{"text_format":"1","workbook":"xlsx","n_sheets":36,"sheets":["DASHBOARD","INPUT","PROCESSING","OUTPUT_1","OUTPUT_2","std1","std2","std3","std4","std5","std6","std7","std8","std9","std10","std11","std12","std13","std14","std15","std16","std17","std18","std19","std20","std21","std22","std23","std24","std25","std26","OUTPUT_1 (2)","OUTPUT_1 (3)","OUTPUT_1 (4)","OUTPUT_1 (5)","Subjects"],"not_rendered":{"charts":1,"images":12,"macros":1,"external_links":0,"defined_names":38,"comments":0,"pivot_tables":0},"unopened":[],"bounds":{"document_bytes":16777216,"sheet_cells":100000,"rows_first":2000,"rows_last":500,"rows_between":2000,"halvings":0,"cell_chars":16384,"cell_head_chars":4096},"cells_cut":0,"cells_raw":0,"read":"whole","date_system":"1900"}

{"sheet":"DASHBOARD","index":0,"n_rows":0,"n_cols":0,"rows_kept":0,"cut":false,"hidden":false,"merged":[[1,1,9,3]]}

{"sheet":"INPUT","index":1,"n_rows":154,"n_cols":77,"rows_kept":154,"cut":false,"hidden":false,"merged":[[1,66,3,66],[1,56,1,65],[2,56,3,56],[2,63,3,63],[2,65,3,65],[2,58,3,58],[2,59,3,59],[2,62,3,62],[1,67,1,76],[2,67,3,67],[2,74,3,74],[2,76,3,76],[2,69,3,69],[2,70,3,70],[2,73,3,73],[1,36,1,45],[2,36,3,36],[2,38,3,38],[2,43,3,43],[2,45,3,45],[2,39,3,39],[2,42,3,42],[1,46,1,55],[2,46,3,46],[2,53,3,53],[2,55,3,55],[2,48,3,48],[2,49,3,49],[2,52,3,52],[2,25,3,25],[1,26,1,35],[2,26,3,26],[2,28,3,28],[2,33,3,33],[2,35,3,35],[1,16,1,25],[2,16,3,16],[2,18,3,18],[2,19,3,19],[2,22,3,22],[2,23,3,23],[2,29,3,29],[2,32,3,32],[1,1,3,1],[1,2,3,2],[1,3,3,3],[1,4,3,4],[1,5,3,5],[1,6,1,15],[2,6,3,6],[2,12,3,12],[2,9,3,9],[2,8,3,8],[2,13,3,13],[2,15,3,15]]}
[]
[null,"S.N.","Name Of Student","DOB","Registration No.","SYMBOL NO.","Com.Nepali",null,null,null,null,null,null,null,null,null,"Com. English",null,null,null,null,null,null,null,null,null,"Com.Social Studies & Life Skill",null,null,null,null,null,null,null,null,null,"OPT 1st",null,null,null,null,null,null,null,null,null,"OPT 2nd",null,null,null,null,null,null,null,null,null,"OPT 3rd",null,null,null,null,null,null,null,null,null,"GPA","EXTRA CREDIT SUBJECT"]
[null,null,null,null,null,null,"Sub Code","MARKS (TH)","GRADE (TH)","G.P. (TH)","WGP (TH)","MARKS (IN)","GRADE (IN)","G.P. (IN)","WGP (IN)","FINAL GRADE","Sub Code","MARKS (TH)","GRADE (TH)","G.P. (TH)","WGP (TH)","MARKS (IN)","GRADE (IN)","G.P. (IN)","WGP (IN)","FINAL GRADE","Sub Code","MARKS (TH)","GRADE (TH)","G.P. (TH)","WGP (TH)","MARKS (IN)","GRADE (IN)","G.P. (IN)","WGP (IN)","FINAL GRADE","Sub Code","MARKS (TH)","GRADE (TH)","G.P. (TH)","WGP (TH)","MARKS (IN)","GRADE (IN)","G.P. (IN)","WGP (IN)","FINAL GRADE","Sub Code","MARKS (TH)","GRADE (TH)","G.P. (TH)","WGP (TH)","MARKS (IN)","GRADE (IN)","G.P. (IN)","WGP (IN)","FINAL GRADE","Sub Code","MARKS (TH)","GRADE (TH)","G.P. (TH)","WGP (TH)","MARKS (IN)","GRADE (IN)","G.P. (IN)","WGP (IN)","FINAL GRADE",null,"Sub Code","MARKS (TH)","GRADE (TH)","G.P. (TH)","WGP (TH)","MARKS (IN)","GRADE (IN)","G.P. (IN)","WGP (IN)","FINAL GRADE"]
[null,null,null,null,null,null,null,75,null,null,2.25,25,null,null,0.75,null,null,75,null,null,3,25,null,null,1,null,null,75,null,null,3.75,25,null,null,1.25,null,null,75,null,null,3.75,25,null,null,1.25,null,null,75,null,null,3.75,25,null,null,1.25,null,null,75,null,null,3.75,25,null,null,1.25,null,null,null,75,null,null,3.75,25,null,null,1.25]
[null,1,"ALISHA KARKI ","4/31/2063","801130210001",11301320,"0011",38,{"$f":"IF(H5/H$4>=0.9,\"A+\",IF(H5/H$4>=0.8,\"A\",IF(H5/H$4>=0.7,\"B+\",IF(H5/H$4>=0.6,\"B\",IF(H5/H$4>=0.5,\"C+\",IF(H5/H$4>=0.4,\"C\",IF(H5/H$4>=0.35,\"D\",IF(H5/H$4>0,\"NG\",\"ABS\"))))))))","v":"C+"},{"$f":"IF(I5=\"A+\",4,IF(I5=\"A\",3.6,IF(I5=\"B+\",3.2,IF(I5=\"B\",2.8,IF(I5=\"C+\",2.4,IF(I5=\"C\",2,IF(I5=\"D\",1.6,IF(I5=\"NG\",\"-\",\"ABS\"))))))))","v":2.4},{"$f":"IFERROR($K$4*J5,\"-\")","v":5.3999999999999995},10,{"$f":"IF(L5/L$4>=0.9,\"A+\",IF(L5/L$4>=0.8,\"A\",IF(L5/L$4>=0.7,\"B+\",IF(L5/L$4>=0.6,\"B\",IF(L5/L$4>=0.5,\"C+\",IF(L5/L$4>=0.4,\"C\",IF(L5/L$4>0,\"NG\",\"ABS\")))))))","v":"C"},{"$f":"IF(M5=\"A+\",4,IF(M5=\"A\",3.6,IF(M5=\"B+\",3.2,IF(M5=\"B\",2.8,IF(M5=\"C+\",2.4,IF(M5=\"C\",2,IF(M5=\"D\",1.6,IF(M5=\"NG\",\"-\",\"ABS\"))))))))","v":2},{"$f":"IFERROR($O$4*N5,\"-\")","v":1.5},{"$f":"IFERROR(IF((K5+O5)/($K$4+$O$4)>3.6,\"A+\",IF((K5+O5)/($K$4+$O$4)>3.2,\"A\",IF((K5+O5)/($K$4+$O$4)>2.8,\"B+\",IF((K5+O5)/($K$4+$O$4)>2.4,\"B\",IF((K5+O5)/($K$4+$O$4)>2,\"C+\",IF((K5+O5)/($K$4+$O$4)>1.6,\"C\",IF((K5+O5)/($K$4+$O$4)=1.6,\"D\",IF((K5+O5)/($K$4+$O$4)<1.6,\"NG\",\"\")))))))),\"*\")","v":"C+"},"0031",38,{"$f":"IF(R5/R$4>=0.9,\"A+\",IF(R5/R$4>=0.8,\"A\",IF(R5/R$4>=0.7,\"B+\",IF(R5/R$4>=0.6,\"B\",IF(R5/R$4>=0.5,\"C+\",IF(R5/R$4>=0.4,\"C\",IF(R5/R$4>=0.35,\"D\",IF(R5/R$4>0,\"NG\",\"ABS\"))))))))","v":"C+"},{"$f":"IF(S5=\"A+\",4,IF(S5=\"A\",3.6,IF(S5=\"B+\",3.2,IF(S5=\"B\",2.8,IF(S5=\"C+\",2.4,IF(S5=\"C\",2,IF(S5=\"D\",1.6,IF(S5=\"NG\",\"-\",\"ABS\"))))))))","v":2.4},{"$f":"IFERROR($U$4*T5,\"-\")","v":7.1999999999999993},10,{"$f":"IF(V5/V$4>=0.9,\"A+\",IF(V5/V$4>=0.8,\"A\",IF(V5/V$4>=0.7,\"B+\",IF(V5/V$4>=0.6,\"B\",IF(V5/V$4>=0.5,\"C+\",IF(V5/V$4>=0.4,\"C\",IF(V5/V$4>0,\"NG\",\"ABS\")))))))","v":"C"},{"$f":"IF(W5=\"A+\",4,IF(W5=\"A\",3.6,IF(W5=\"B+\",3.2,IF(W5=\"B\",2.8,IF(W5=\"C+\",2.4,IF(W5=\"C\",2,IF(W5=\"D\",1.6,IF(W5=\"NG\",\"-\",\"ABS\"))))))))","v":2},{"$f":"IFERROR($Y$4*X5,\"-\")","v":2},{"$f":"IFERROR(IF((U5+Y5)/($U$4+$Y$4)>3.6,\"A+\",IF((U5+Y5)/($U$4+$Y$4)>3.2,\"A\",IF((U5+Y5)/($U$4+$Y$4)>2.8,\"B+\",IF((U5+Y5)/($U$4+$Y$4)>2.4,\"B\",IF((U5+Y5)/($U$4+$Y$4)>2,\"C+\",IF((U5+Y5)/($U$4+$Y$4)>1.6,\"C\",IF((U5+Y5)/($U$4+$Y$4)=1.6,\"D\",IF((U5+Y5)/($U$4+$Y$4)<1.6,\"NG\",\"\")))))))),\"*\")","v":"C+"},"0051",40,{"$f":"IF(AB5/AB$4>=0.9,\"A+\",IF(AB5/AB$4>=0.8,\"A\",IF(AB5/AB$4>=0.7,\"B+\",IF(AB5/AB$4>=0.6,\"B\",IF(AB5/AB$4>=0.5,\"C+\",IF(AB5/AB$4>=0.4,\"C\",IF(AB5/AB$4>=0.35,\"D\",IF(AB5/AB$4>0,\"NG\",\"ABS\"))))))))","v":"C+"},{"$f":"IF(AC5=\"A+\",4,IF(AC5=\"A\",3.6,IF(AC5=\"B+\",3.2,IF(AC5=\"B\",2.8,IF(AC5=\"C+\",2.4,IF(AC5=\"C\",2,IF(AC5=\"D\",1.6,IF(AC5=\"NG\",\"-\",\"ABS\"))))))))","v":2.4},{"$f":"IFERROR($AE$4*AD5,\"-\")","v":9},21,{"$f":"IF(AF5/AF$4>=0.9,\"A+\",IF(AF5/AF$4>=0.8,\"A\",IF(AF5/AF$4>=0.7,\"B+\",IF(AF5/AF$4>=0.6,\"B\",IF(AF5/AF$4>=0.5,\"C+\",IF(AF5/AF$4>=0.4,\"C\",IF(AF5/AF$4>0,\"NG\",\"ABS\")))))))","v":"A"},{"$f":"IF(AG5=\"A+\",4,IF(AG5=\"A\",3.6,IF(AG5=\"B+\",3.2,IF(AG5=\"B\",2.8,IF(AG5=\"C+\",2.4,IF(AG5=\"C\",2,IF(AG5=\"D\",1.6,IF(AG5=\"NG\",\"-\",\"ABS\"))))))))","v":3.6},{"$f":"IFERROR($AI$4*AH5,\"-\")","v":4.5},{"$f":"IFERROR(IF((AE5+AI5)/($AE$4+$AI$4)>3.6,\"A+\",IF((AE5+AI5)/($AE$4+$AI$4)>3.2,\"A\",IF((AE5+AI5)/($AE$4+$AI$4)>2.8,\"B+\",IF((AE5+AI5)/($AE$4+$AI$4)>2.4,\"B\",IF((AE5+AI5)/($AE$4+$AI$4)>2,\"C+\",IF((AE5+AI5)/($AE$4+$AI$4)>1.6,\"C\",IF((AE5+AI5)/($AE$4+$AI$4)=1.6,\"D\",IF((AE5+AI5)/($AE$4+$AI$4)<1.6,\"NG\",\"\")))))))),\"*\")","v":"B"},1031,60,{"$f":"IF(AL5/AL$4>=0.9,\"A+\",IF(AL5/AL$4>=0.8,\"A\",IF(AL5/AL$4>=0.7,\"B+\",IF(AL5/AL$4>=0.6,\"B\",IF(AL5/AL$4>=0.5,\"C+\",IF(AL5/AL$4>=0.4,\"C\",IF(AL5/AL$4>=0.35,\"D\",IF(AL5/AL$4>0,\"NG\",\"ABS\"))))))))","v":"A"},{"$f":"IF(AM5=\"A+\",4,IF(AM5=\"A\",3.6,IF(AM5=\"B+\",3.2,IF(AM5=\"B\",2.8,IF(AM5=\"C+\",2.4,IF(AM5=\"C\",2,IF(AM5=\"D\",1.6,IF(AM5=\"NG\",\"-\",\"ABS\"))))))))","v":3.6},{"$f":"IFERROR($AO$4*AN5,\"-\")","v":13.5},23,{"$f":"IF(AP5/AP$4>=0.9,\"A+\",IF(AP5/AP$4>=0.8,\"A\",IF(AP5/AP$4>=0.7,\"B+\",IF(AP5/AP$4>=0.6,\"B\",IF(AP5/AP$4>=0.5,\"C+\",IF(AP5/AP$4>=0.4,\"C\",IF(AP5/AP$4>0,\"NG\",\"ABS\")))))))","v":"A+"},{"$f":"IF(AQ5=\"A+\",4,IF(AQ5=\"A\",3.6,IF(AQ5=\"B+\",3.2,IF(AQ5=\"B\",2.8,IF(AQ5=\"C+\",2.4,IF(AQ5=\"C\",2,IF(AQ5=\"D\",1.6,IF(AQ5=\"NG\",\"-\",\"ABS\"))))))))","v":4},{"$f":"IFERROR($AS$4*AR5,\"-\")","v":5},{"$f":"IFERROR(IF((AO5+AS5)/($AO$4+$AS$4)>3.6,\"A+\",IF((AO5+AS5)/($AO$4+$AS$4)>3.2,\"A\",IF((AO5+AS5)/($AO$4+$AS$4)>2.8,\"B+\",IF((AO5+AS5)/($AO$4+$AS$4)>2.4,\"B\",IF((AO5+AS5)/($AO$4+$AS$4)>2,\"C+\",IF((AO5+AS5)/($AO$4+$AS$4)>1.6,\"C\",IF((AO5+AS5)/($AO$4+$AS$4)=1.6,\"D\",IF((AO5+AS5)/($AO$4+$AS$4)<1.6,\"NG\",\"\")))))))),\"*\")","v":"A+"},4251,37,{"$f":"IF(AV5/AV$4>=0.9,\"A+\",IF(AV5/AV$4>=0.8,\"A\",IF(AV5/AV$4>=0.7,\"B+\",IF(AV5/AV$4>=0.6,\"B\",IF(AV5/AV$4>=0.5,\"C+\",IF(AV5/AV$4>=0.4,\"C\",IF(AV5/AV$4>=0.35,\"D\",IF(AV5/AV$4>0,\"NG\",\"ABS\"))))))))","v":"C"},{"$f":"IF(AW5=\"A+\",4,IF(AW5=\"A\",3.6,IF(AW5=\"B+\",3.2,IF(AW5=\"B\",2.8,IF(AW5=\"C+\",2.4,IF(AW5=\"C\",2,IF(AW5=\"D\",1.6,IF(AW5=\"NG\",\"-\",\"ABS\"))))))))","v":2},{"$f":"IFERROR($AY$4*AX5,\"-\")","v":7.5},49,{"$f":"IF(AZ5/AZ$4>=0.9,\"A+\",IF(AZ5/AZ$4>=0.8,\"A\",IF(AZ5/AZ$4>=0.7,\"B+\",IF(AZ5/AZ$4>=0.6,\"B\",IF(AZ5/AZ$4>=0.5,\"C+\",IF(AZ5/AZ$4>=0.4,\"C\",IF(AZ5/AZ$4>0,\"NG\",\"ABS\")))))))","v":"A+"},{"$f":"IF(BA5=\"A+\",4,IF(BA5=\"A\",3.6,IF(BA5=\"B+\",3.2,IF(BA5=\"B\",2.8,IF(BA5=\"C+\",2.4,IF(BA5=\"C\",2,IF(BA5=\"D\",1.6,IF(BA5=\"NG\",\"-\",\"ABS\"))))))))","v":4},{"$f":"IFERROR($BC$4*BB5,\"-\")","v":5},{"$f":"IFERROR(IF((AY5+BC5)/($AY$4+$BC$4)>3.6,\"A+\",IF((AY5+BC5)/($AY$4+$BC$4)>3.2,\"A\",IF((AY5+BC5)/($AY$4+$BC$4)>2.8,\"B+\",IF((AY5+BC5)/($AY$4+$BC$4)>2.4,\"B\",IF((AY5+BC5)/($AY$4+$BC$4)>2,\"C+\",IF((AY5+BC5)/($AY$4+$BC$4)>1.6,\"C\",IF((AY5+BC5)/($AY$4+$BC$4)=1.6,\"D\",IF((AY5+BC5)/($AY$4+$BC$4)<1.6,\"NG\",\"\")))))))),\"*\")","v":"B"},4171,51,{"$f":"IF(BF5/BF$4>=0.9,\"A+\",IF(BF5/BF$4>=0.8,\"A\",IF(BF5/BF$4>=0.7,\"B+\",IF(BF5/BF$4>=0.6,\"B\",IF(BF5/BF$4>=0.5,\"C+\",IF(BF5/BF$4>=0.4,\"C\",IF(BF5/BF$4>=0.35,\"D\",IF(BF5/BF$4>0,\"NG\",\"ABS\"))))))))","v":"B"},{"$f":"IF(BG5=\"A+\",4,IF(BG5=\"A\",3.6,IF(BG5=\"B+\",3.2,IF(BG5=\"B\",2.8,IF(BG5=\"C+\",2.4,IF(BG5=\"C\",2,IF(BG5=\"D\",1.6,IF(BG5=\"NG\",\"-\",\"ABS\"))))))))","v":2.8},{"$f":"IFERROR($BI$4*BH5,\"-\")","v":10.5},20,{"$f":"IF(BJ5/BJ$4>=0.9,\"A+\",IF(BJ5/BJ$4>=0.8,\"A\",IF(BJ5/BJ$4>=0.7,\"B+\",IF(BJ5/BJ$4>=0.6,\"B\",IF(BJ5/BJ$4>=0.5,\"C+\",IF(BJ5/BJ$4>=0.4,\"C\",IF(BJ5/BJ$4>0,\"NG\",\"ABS\")))))))","v":"A"},{"$f":"IF(BK5=\"A+\",4,IF(BK5=\"A\",3.6,IF(BK5=\"B+\",3.2,IF(BK5=\"B\",2.8,IF(BK5=\"C+\",2.4,IF(BK5=\"C\",2,IF(BK5=\"D\",1.6,IF(BK5=\"NG\",\"-\",\"ABS\"))))))))","v":3.6},{"$f":"IFERROR($BM$4*BL5,\"-\")","v":4.5},{"$f":"IFERROR(IF((BI5+BM5)/($BI$4+$BM$4)>3.6,\"A+\",IF((BI5+BM5)/($BI$4+$BM$4)>3.2,\"A\",IF((BI5+BM5)/($BI$4+$BM$4)>2.8,\"B+\",IF((BI5+BM5)/($BI$4+$BM$4)>2.4,\"B\",IF((BI5+BM5)/($BI$4+$BM$4)>2,\"C+\",IF((BI5+BM5)/($BI$4+$BM$4)>1.6,\"C\",IF((BI5+BM5)/($BI$4+$BM$4)=1.6,\"D\",IF((BI5+BM5)/($BI$4+$BM$4)<1.6,\"NG\",\"\")))))))),\"*\")","v":"B+"},{"$f":"IFERROR((K5+O5+U5+Y5+AE5+AI5+AO5+AS5+AY5+BC5+BI5+BM5)/($K$4+$O$4+$U$4+$Y$4+$AE$4+$AI$4+$AO$4+$AS$4+$AY$4+$BC$4+$BI$4+$BM$4),\"-\")","v":2.8},null,null,{"$f":"IF(BQ5/BQ$4>=0.9,\"A+\",IF(BQ5/BQ$4>=0.8,\"A\",IF(BQ5/BQ$4>=0.7,\"B+\",IF(BQ5/BQ$4>=0.6,\"B\",IF(BQ5/BQ$4>=0.5,\"C+\",IF(BQ5/BQ$4>=0.4,\"C\",IF(BQ5/BQ$4>=0.35,\"D\",IF(BQ5/BQ$4>0,\"NG\",\"ABS\"))))))))","v":"ABS"},{"$f":"IF(BR5=\"A+\",4,IF(BR5=\"A\",3.6,IF(BR5=\"B+\",3.2,IF(BR5=\"B\",2.8,IF(BR5=\"C+\",2.4,IF(BR5=\"C\",2,IF(BR5=\"D\",1.6,IF(BR5=\"NG\",\"-\",\"ABS\"))))))))","v":"ABS"},{"$f":"IFERROR($BT$4*BS5,\"-\")","v":"-"},null,{"$f":"IF(BU5/BU$4>=0.9,\"A+\",IF(BU5/BU$4>=0.8,\"A\",IF(BU5/BU$4>=0.7,\"B+\",IF(BU5/BU$4>=0.6,\"B\",IF(BU5/BU$4>=0.5,\"C+\",IF(BU5/BU$4>=0.4,\"C\",IF(BU5/BU$4>0,\"NG\",\"ABS\")))))))","v":"ABS"},{"$f":"IF(BV5=\"A+\",4,IF(BV5=\"A\",3.6,IF(BV5=\"B+\",3.2,IF(BV5=\"B\",2.8,IF(BV5=\"C+\",2.4,IF(BV5=\"C\",2,IF(BV5=\"D\",1.6,IF(BV5=\"NG\",\"-\",\"ABS\"))))))))","v":"ABS"},{"$f":"IFERROR($BX$4*BW5,\"-\")","v":"-"},{"$f":"IFERROR(IF((BT5+BX5)/($BT$4+$BX$4)>3.6,\"A+\",IF((BT5+BX5)/($BT$4+$BX$4)>3.2,\"A\",IF((BT5+BX5)/($BT$4+$BX$4)>2.8,\"B+\",IF((BT5+BX5)/($BT$4+$BX$4)>2.4,\"B\",IF((BT5+BX5)/($BT$4+$BX$4)>2,\"C+\",IF((BT5+BX5)/($BT$4+$BX$4)>1.6,\"C\",IF((BT5+BX5)/($BT$4+$BX$4)=1.6,\"D\",IF((BT5+BX5)/($BT$4+$BX$4)<1.6,\"NG\",\"\")))))))),\"\")","v":""}]
[null,2,"AMRITA RAI ","2063-09-02","801130210002",11301321,"0011",40,"C+",2.4,5.3999999999999995,12,{"$f":"IF(L6/L$4>=0.9,\"A+\",IF(L6/L$4>=0.8,\"A\",IF(L6/L$4>=0.7,\"B+\",IF(L6/L$4>=0.6,\"B\",IF(L6/L$4>=0.5,\"C+\",IF(L6/L$4>=0.4,\"C\",IF(L6/L$4>0,\"NG\",\"ABS\")))))))","v":"C"},{"$f":"IF(M6=\"A+\",4,IF(M6=\"A\",3.6,IF(M6=\"B+\",3.2,IF(M6=\"B\",2.8,IF(M6=\"C+\",2.4,IF(M6=\"C\",2,IF(M6=\"D\",1.6,IF(M6=\"NG\",\"-\",\"ABS\"))))))))","v":2},{"$f":"IFERROR($O$4*N6,\"-\")","v":1.5},{"$f":"IFERROR(IF((K6+O6)/($K$4+$O$4)>3.6,\"A+\",IF((K6+O6)/($K$4+$O$4)>3.2,\"A\",IF((K6+O6)/($K$4+$O$4)>2.8,\"B+\",IF((K6+O6)/($K$4+$O$4)>2.4,\"B\",IF((K6+O6)/($K$4+$O$4)>2,\"C+\",IF((K6+O6)/($K$4+$O$4)>1.6,\"C\",IF((K6+O6)/($K$4+$O$4)=1.6,\"D\",IF((K6+O6)/($K$4+$O$4)<1.6,\"NG\",\"\")))))))),\"*\")","v":"C+"},"0031",40,{"$f":"IF(R6/R$4>=0.9,\"A+\",IF(R6/R$4>=0.8,\"A\",IF(R6/R$4>=0.7,\"B+\",IF(R6/R$4>=0.6,\"B\",IF(R6/R$4>=0.5,\"C+\",IF(R6/R$4>=0.4,\"C\",IF(R6/R$4>=0.35,\"D\",IF(R6/R$4>0,\"NG\",\"ABS\"))))))))","v":"C+"},{"$f":"IF(S6=\"A+\",4,IF(S6=\"A\",3.6,IF(S6=\"B+\",3.2,IF(S6=\"B\",2.8,IF(S6=\"C+\",2.4,IF(S6=\"C\",2,IF(S6=\"D\",1.6,IF(S6=\"NG\",\"-\",\"ABS\"))))))))","v":2.4},{"$f":"IFERROR($U$4*T6,\"-\")","v":7.1999999999999993},12,{"$f":"IF(V6/V$4>=0.9,\"A+\",IF(V6/V$4>=0.8,\"A\",IF(V6/V$4>=0.7,\"B+\",IF(V6/V$4>=0.6,\"B\",IF(V6/V$4>=0.5,\"C+\",IF(V6/V$4>=0.4,\"C\",IF(V6/V$4>0,\"NG\",\"ABS\")))))))","v":"C"},{"$f":"IF(W6=\"A+\",4,IF(W6=\"A\",3.6,IF(W6=\"B+\",3.2,IF(W6=\"B\",2.8,IF(W6=\"C+\",2.4,IF(W6=\"C\",2,IF(W6=\"D\",1.6,IF(W6=\"NG\",\"-\",\"ABS\"))))))))","v":2},{"$f":"IFERROR($Y$4*X6,\"-\")","v":2},{"$f":"IFERROR(IF((U6+Y6)/($U$4+$Y$4)>3.6,\"A+\",IF((U6+Y6)/($U$4+$Y$4)>3.2,\"A\",IF((U6+Y6)/($U$4+$Y$4)>2.8,\"B+\",IF((U6+Y6)/($U$4+$Y$4)>2.4,\"B\",IF((U6+Y6)/($U$4+$Y$4)>2,\"C+\",IF((U6+Y6)/($U$4+$Y$4)>1.6,\"C\",IF((U6+Y6)/($U$4+$Y$4)=1.6,\"D\",IF((U6+Y6)/($U$4+$Y$4)<1.6,\"NG\",\"\")))))))),\"*\")","v":"C+"},"0051",68,{"$f":"IF(AB6/AB$4>=0.9,\"A+\",IF(AB6/AB$4>=0.8,\"A\",IF(AB6/AB$4>=0.7,\"B+\",IF(AB6/AB$4>=0.6,\"B\",IF(AB6/AB$4>=0.5,\"C+\",IF(AB6/AB$4>=0.4,\"C\",IF(AB6/AB$4>=0.35,\"D\",IF(AB6/AB$4>0,\"NG\",\"ABS\"))))))))","v":"A+"},{"$f":"IF(AC6=\"A+\",4,IF(AC6=\"A\",3.6,IF(AC6=\"B+\",3.2,IF(AC6=\"B\",2.8,IF(AC6=\"C+\",2.4,IF(AC6=\"C\",2,IF(AC6=\"D\",1.6,IF(AC6=\"NG\",\"-\",\"ABS\"))))))))","v":4},{"$f":"IFERROR($AE$4*AD6,\"-\")","v":15},23,{"$f":"IF(AF6/AF$4>=0.9,\"A+\",IF(AF6/AF$4>=0.8,\"A\",IF(AF6/AF$4>=0.7,\"B+\",IF(AF6/AF$4>=0.6,\"B\",IF(AF6/AF$4>=0.5,\"C+\",IF(AF6/AF$4>=0.4,\"C\",IF(AF6/AF$4>0,\"NG\",\"ABS\")))))))","v":"A+"},{"$f":"IF(AG6=\"A+\",4,IF(AG6=\"A\",3.6,IF(AG6=\"B+\",3.2,IF(AG6=\"B\",2.8,IF(AG6=\"C+\",2.4,IF(AG6=\"C\",2,IF(AG6=\"D\",1.6,IF(AG6=\"NG\",\"-\",\"ABS\"))))))))","v":4},{"$f":"IFERROR($AI$4*AH6,\"-\")","v":5},{"$f":"IFERROR(IF((AE6+AI6)/($AE$4+$AI$4)>3.6,\"A+\",IF((AE6+AI6)/($AE$4+$AI$4)>3.2,\"A\",IF((AE6+AI6)/($AE$4+$AI$4)>2.8,\"B+\",IF((AE6+AI6)/($AE$4+$AI$4)>2.4,\"B\",IF((AE6+AI6)/($AE$4+$AI$4)>2,\"C+\",IF((AE6+AI6)/($AE$4+$AI$4)>1.6,\"C\",IF((AE6+AI6)/($AE$4+$AI$4)=1.6,\"D\",IF((AE6+AI6)/($AE$4+$AI$4)<1.6,\"NG\",\"\")))))))),\"*\")","v":"A+"},1031,61,{"$f":"IF(AL6/AL$4>=0.9,\"A+\",IF(AL6/AL$4>=0.8,\"A\",IF(AL6/AL$4>=0.7,\"B+\",IF(AL6/AL$4>=0.6,\"B\",IF(AL6/AL$4>=0.5,\"C+\",IF(AL6/AL$4>=0.4,\"C\",IF(AL6/AL$4>=0.35,\"D\",IF(AL6/AL$4>0,\"NG\",\"ABS\"))))))))","v":"A"},{"$f":"IF(AM6=\"A+\",4,IF(AM6=\"A\",3.6,IF(AM6=\"B+\",3.2,IF(AM6=\"B\",2.8,IF(AM6=\"C+\",2.4,IF(AM6=\"C\",2,IF(AM6=\"D\",1.6,IF(AM6=\"NG\",\"-\",\"ABS\"))))))))","v":3.6},{"$f":"IFERROR($AO$4*AN6,\"-\")","v":13.5},24,{"$f":"IF(AP6/AP$4>=0.9,\"A+\",IF(AP6/AP$4>=0.8,\"A\",IF(AP6/AP$4>=0.7,\"B+\",IF(AP6/AP$4>=0.6,\"B\",IF(AP6/AP$4>=0.5,\"C+\",IF(AP6/AP$4>=0.4,\"C\",IF(AP6/AP$4>0,\"NG\",\"ABS\")))))))","v":"A+"},{"$f":"IF(AQ6=\"A+\",4,IF(AQ6=\"A\",3.6,IF(AQ6=\"B+\",3.2,IF(AQ6=\"B\",2.8,IF(AQ6=\"C+\",2.4,IF(AQ6=\"C\",2,IF(AQ6=\"D\",1.6,IF(AQ6=\"NG\",\"-\",\"ABS\"))))))))","v":4},{"$f":"IFERROR($AS$4*AR6,\"-\")","v":5},{"$f":"IFERROR(IF((AO6+AS6)/($AO$4+$AS$4)>3.6,\"A+\",IF((AO6+AS6)/($AO$4+$AS$4)>3.2,\"A\",IF((AO6+AS6)/($AO$4+$AS$4)>2.8,\"B+\",IF((AO6+AS6)/($AO$4+$AS$4)>2.4,\"B\",IF((AO6+AS6)/($AO$4+$AS$4)>2,\"C+\",IF((AO6+AS6)/($AO$4+$AS$4)>1.6,\"C\",IF((AO6+AS6)/($AO$4+$AS$4)=1.6,\"D\",IF((AO6+AS6)/($AO$4+$AS$4)<1.6,\"NG\",\"\")))))))),\"*\")","v":"A+"},4251,34,{"$f":"IF(AV6/AV$4>=0.9,\"A+\",IF(AV6/AV$4>=0.8,\"A\",IF(AV6/AV$4>=0.7,\"B+\",IF(AV6/AV$4>=0.6,\"B\",IF(AV6/AV$4>=0.5,\"C+\",IF(AV6/AV$4>=0.4,\"C\",IF(AV6/AV$4>=0.35,\"D\",IF(AV6/AV$4>0,\"NG\",\"ABS\"))))))))","v":"C"},{"$f":"IF(AW6=\"A+\",4,IF(AW6=\"A\",3.6,IF(AW6=\"B+\",3.2,IF(AW6=\"B\",2.8,IF(AW6=\"C+\",2.4,IF(AW6=\"C\",2,IF(AW6=\"D\",1.6,IF(AW6=\"NG\",\"-\",\"ABS\"))))))))","v":2},{"$f":"IFERROR($AY$4*AX6,\"-\")","v":7.5},48,{"$f":"IF(AZ6/AZ$4>=0.9,\"A+\",IF(AZ6/AZ$4>=0.8,\"A\",IF(AZ6/AZ$4>=0.7,\"B+\",IF(AZ6/AZ$4>=0.6,\"B\",IF(AZ6/AZ$4>=0.5,\"C+\",IF(AZ6/AZ$4>=0.4,\"C\",IF(AZ6/AZ$4>0,\"NG\",\"ABS\")))))))","v":"A+"},{"$f":"IF(BA6=\"A+\",4,IF(BA6=\"A\",3.6,IF(BA6=\"B+\",3.2,IF(BA6=\"B\",2.8,IF(BA6=\"C+\",2.4,IF(BA6=\"C\",2,IF(BA6=\"D\",1.6,IF(BA6=\"NG\",\"-\",\"ABS\"))))))))","v":4},{"$f":"IFERROR($BC$4*BB6,\"-\")","v":5},{"$f":"IFERROR(IF((AY6+BC6)/($AY$4+$BC$4)>3.6,\"A+\",IF((AY6+BC6)/($AY$4+$BC$4)>3.2,\"A\",IF((AY6+BC6)/($AY$4+$BC$4)>2.8,\"B+\",IF((AY6+BC6)/($AY$4+$BC$4)>2.4,\"B\",IF((AY6+BC6)/($AY$4+$BC$4)>2,\"C+\",IF((AY6+BC6)/($AY$4+$BC$4)>1.6,\"C\",IF((AY6+BC6)/($AY$4+$BC$4)=1.6,\"D\",IF((AY6+BC6)/($AY$4+$BC$4)<1.6,\"NG\",\"\")))))))),\"*\")","v":"B"},4171,62,{"$f":"IF(BF6/BF$4>=0.9,\"A+\",IF(BF6/BF$4>=0.8,\"A\",IF(BF6/BF$4>=0.7,\"B+\",IF(BF6/BF$4>=0.6,\"B\",IF(BF6/BF$4>=0.5,\"C+\",IF(BF6/BF$4>=0.4,\"C\",IF(BF6/BF$4>=0.35,\"D\",IF(BF6/BF$4>0,\"NG\",\"ABS\"))))))))","v":"A"},{"$f":"IF(BG6=\"A+\",4,IF(BG6=\"A\",3.6,IF(BG6=\"B+\",3.2,IF(BG6=\"B\",2.8,IF(BG6=\"C+\",2.4,IF(BG6=\"C\",2,IF(BG6=\"D\",1.6,IF(BG6=\"NG\",\"-\",\"ABS\"))))))))","v":3.6},{"$f":"IFERROR($BI$4*BH6,\"-\")","v":13.5},20,{"$f":"IF(BJ6/BJ$4>=0.9,\"A+\",IF(BJ6/BJ$4>=0.8,\"A\",IF(BJ6/BJ$4>=0.7,\"B+\",IF(BJ6/BJ$4>=0.6,\"B\",IF(BJ6/BJ$4>=0.5,\"C+\",IF(BJ6/BJ$4>=0.4,\"C\",IF(BJ6/BJ$4>0,\"NG\",\"ABS\")))))))","v":"A"},{"$f":"IF(BK6=\"A+\",4,IF(BK6=\"A\",3.6,IF(BK6=\"B+\",3.2,IF(BK6=\"B\",2.8,IF(BK6=\"C+\",2.4,IF(BK6=\"C\",2,IF(BK6=\"D\",1.6,IF(BK6=\"NG\",\"-\",\"ABS\"))))))))","v":3.6},{"$f":"IFERROR($BM$4*BL6,\"-\")","v":4.5},{"$f":"IFERROR(IF((BI6+BM6)/($BI$4+$BM$4)>3.6,\"A+\",IF((BI6+BM6)/($BI$4+$BM$4)>3.2,\"A\",IF((BI6+BM6)/($BI$4+$BM$4)>2.8,\"B+\",IF((BI6+BM6)/($BI$4+$BM$4)>2.4,\"B\",IF((BI6+BM6)/($BI$4+$BM$4)>2,\"C+\",IF((BI6+BM6)/($BI$4+$BM$4)>1.6,\"C\",IF((BI6+BM6)/($BI$4+$BM$4)=1.6,\"D\",IF((BI6+BM6)/($BI$4+$BM$4)<1.6,\"NG\",\"\")))))))),\"*\")","v":"A"},{"$f":"IFERROR((K6+O6+U6+Y6+AE6+AI6+AO6+AS6+AY6+BC6+BI6+BM6)/($K$4+$O$4+$U$4+$Y$4+$AE$4+$AI$4+$AO$4+$AS$4+$AY$4+$BC$4+$BI$4+$BM$4),\"-\")","v":3.1518518518518515},null,null,{"$f":"IF(BQ6/BQ$4>=0.9,\"A+\",IF(BQ6/BQ$4>=0.8,\"A\",IF(BQ6/BQ$4>=0.7,\"B+\",IF(BQ6/BQ$4>=0.6,\"B\",IF(BQ6/BQ$4>=0.5,\"C+\",IF(BQ6/BQ$4>=0.4,\"C\",IF(BQ6/BQ$4>=0.35,\"D\",IF(BQ6/BQ$4>0,\"NG\",\"ABS\"))))))))","v":"ABS"},{"$f":"IF(BR6=\"A+\",4,IF(BR6=\"A\",3.6,IF(BR6=\"B+\",3.2,IF(BR6=\"B\",2.8,IF(BR6=\"C+\",2.4,IF(BR6=\"C\",2,IF(BR6=\"D\",1.6,IF(BR6=\"NG\",\"-\",\"ABS\"))))))))","v":"ABS"},{"$f":"IFERROR($BT$4*BS6,\"-\")","v":"-"},null,{"$f":"IF(BU6/BU$4>=0.9,\"A+\",IF(BU6/BU$4>=0.8,\"A\",IF(BU6/BU$4>=0.7,\"B+\",IF(BU6/BU$4>=0.6,\"B\",IF(BU6/BU$4>=0.5,\"C+\",IF(BU6/BU$4>=0.4,\"C\",IF(BU6/BU$4>0,\"NG\",\"ABS\")))))))","v":"ABS"},{"$f":"IF(BV6=\"A+\",4,IF(BV6=\"A\",3.6,IF(BV6=\"B+\",3.2,IF(BV6=\"B\",2.8,IF(BV6=\"C+\",2.4,IF(BV6=\"C\",2,IF(BV6=\"D\",1.6,IF(BV6=\"NG\",\"-\",\"ABS\"))))))))","v":"ABS"},{"$f":"IFERROR($BX$4*BW6,\"-\")","v":"-"},{"$f":"IFERROR(IF((BT6+BX6)/($BT$4+$BX$4)>3.6,\"A+\",IF((BT6+BX6)/($BT$4+$BX$4)>3.2,\"A\",IF((BT6+BX6)/($BT$4+$BX$4)>2.8,\"B+\",IF((BT6+BX6)/($BT$4+$BX$4)>2.4,\"B\",IF((BT6+BX6)/($BT$4+$BX$4)>2,\"C+\",IF((BT6+BX6)/($BT$4+$BX$4)>1.6,\"C\",IF((BT6+BX6)/($BT$4+$BX$4)=1.6,\"D\",IF((BT6+BX6)/($BT$4+$BX$4)<1.6,\"NG\",\"\")))))))),\"\")","v":""}]
[null,3,"ANISHA THAPA MAGAR ","2062-07-07","801130210003",11301322,"0011",41,"C+",2.4,5.3999999999999995,10,"C",2,1.5,"C+","0031",41,"C+",2.4,7.1999999999999993,10,"C",2,2,"C+","0051",54,"B+",3.2,12,22,"A",3.6,4.5,"A",1031,62,"A",3.6,13.5,23,"A+",4,5,"A+",4251,41,"C+",2.4,9,50,"A+",4,5,"B",4171,56,"B+",3.2,12,20,"A",3.6,4.5,"A",3.0222222222222221,null,null,"ABS","ABS","-",null,"ABS","ABS","-",""]
[null,4,"ANUPAMA TAMANG ","2062-12-20","801130210004",11301323,"0011",32,"C",2,4.5,10,"C",2,1.5,"C","0031",32,"C",2,6,10,"C",2,2,"C","0051",46,"B",2.8,10.5,21,"A",3.6,4.5,"B+",1031,52,"B",2.8,10.5,22,"A",3.6,4.5,"B+",4251,37,"C",2,7.5,49,"A+",4,5,"B",4171,53,"B+",3.2,12,null,"ABS","ABS","-","*","-",null,null,"ABS","ABS","-",null,"ABS","ABS","-",""]
[null,5,"ASMITA PARIYAR ","2062-12-27","801130210005",11301324,"0011",33,"C",2,4.5,11,"C",2,1.5,"C","0031",33,"C",2,6,11,"C",2,2,"C","0051",45,"B",2.8,10.5,21,"A",3.6,4.5,"B+",1031,52,"B",2.8,10.5,21,"A",3.6,4.5,"B+",4251,35,"C",2,7.5,49,"A+",4,5,"B",4171,61,"A",3.6,13.5,null,"ABS","ABS","-","*","-",null,null,"ABS","ABS","-",null,"ABS","ABS","-",""]
[null,6,"BIKASH RAI ","2063-03-10","801130210006",11301325,"0011",42,"C+",2.4,5.3999999999999995,12,"C",2,1.5,"C+","0031",42,"C+",2.4,7.1999999999999993,12,"C",2,2,"C+","0051",60,"A",3.6,13.5,23,"A+",4,5,"A+",1031,63,"A",3.6,13.5,23,"A+",4,5,"A+",4251,43,"C+",2.4,9,50,"A+",4,5,"B",4171,61,"A",3.6,13.5,null,"ABS","ABS","-","*","-",null,null,"ABS","ABS","-",null,"ABS","ABS","-",""]
[null,7,"DIKESH RAI ","2063-07-06","801130210007",11301326,"0011",37,"C",2,4.5,12,"C",2,1.5,"C","0031",37,"C",2,6,12,"C",2,2,"C","0051",37,"C",2,7.5,20,"A",3.6,4.5,"C+",1031,50,"B",2.8,10.5,22,"A",3.6,4.5,"B+",4251,38,"C+",2.4,9,49,"A+",4,5,"B",4171,61,"A",3.6,13.5,null,"ABS","ABS","-","*","-",null,null,"ABS","ABS","-",null,"ABS","ABS","-",""]
[null,8,"ERON BHUJEL ","2064-06-02","801130210008",11301327,"0011",36,"C",2,4.5,11,"C",2,1.5,"C","0031",36,"C",2,6,11,"C",2,2,"C","0051",61,"A",3.6,13.5,23,"A+",4,5,"A+",1031,51,"B",2.8,10.5,22,"A",3.6,4.5,"B+",4251,39,"C+",2.4,9,45,"A+",4,5,"B",4171,50,"B",2.8,10.5,null,"ABS","ABS","-","*","-",null,null,"ABS","ABS","-",null,"ABS","ABS","-",""]
[null,9,"ISMITA RAI ","2062-06-05","801130210009",11301328,"0011",39,"C+",2.4,5.3999999999999995,11,"C",2,1.5,"C+","0031",39,"C+",2.4,7.1999999999999993,11,"C",2,2,"C+","0051",61,"A",3.6,13.5,23,"A+",4,5,"A+",1031,55,"B+",3.2,12,24,"A+",4,5,"A",4251,34,"C",2,7.5,48,"A+",4,5,"B",4171,57,"B+",3.2,12,null,"ABS","ABS","-","*","-",null,null,"ABS","ABS","-",null,"ABS","ABS","-",""]
[null,10,"KANCHAN KHATRI ","2063-12-05","801130210010",11301329,"0011",40,"C+",2.4,5.3999999999999995,10,"C",2,1.5,"C+","0031",40,"C+",2.4,7.1999999999999993,10,"C",2,2,"C+","0051",56,"B+",3.2,12,23,"A+",4,5,"A",1031,55,"B+",3.2,12,23,"A+",4,5,"A",4251,41,"C+",2.4,9,48,"A+",4,5,"B",4171,59,"B+",3.2,12,null,"ABS","ABS","-","*","-",null,null,"ABS","ABS","-",null,"ABS","ABS","-",""]
[null,11,"KAUSTUV JUNG KHADKA ","2064-03-11","801130210011",11301330,"0011",58,{"$f":"IF(H15/H$4>=0.9,\"A+\",IF(H15/H$4>=0.8,\"A\",IF(H15/H$4>=0.7,\"B+\",IF(H15/H$4>=0.6,\"B\",IF(H15/H$4>=0.5,\"C+\",IF(H15/H$4>=0.4,\"C\",IF(H15/H$4>=0.35,\"D\",IF(H15/H$4>0,\"NG\",\"ABS\"))))))))","v":"B+"},{"$f":"IF(I15=\"A+\",4,IF(I15=\"A\",3.6,IF(I15=\"B+\",3.2,IF(I15=\"B\",2.8,IF(I15=\"C+\",2.4,IF(I15=\"C\",2,IF(I15=\"D\",1.6,IF(I15=\"NG\",\"-\",\"ABS\"))))))))","v":3.2},{"$f":"IFERROR($K$4*J15,\"-\")","v":7.2},17,"B",2.8,2.0999999999999996,"B+","0031",58,"B+",3.2,9.6000000000000014,17,"B",2.8,2.8,"B+","0051",60,"A",3.6,13.5,23,"A+",4,5,"A+",1031,65,"A",3.6,13.5,24,"A+",4,5,"A+",4251,42,"C+",2.4,9,48,"A+",4,5,"B",4171,53,"B+",3.2,12,null,"ABS","ABS","-","*","-",null,null,"ABS","ABS","-",null,"ABS","ABS","-",""]
[null,12,"KUSUM RAI ","2063-01-19","801130210012",11301331,"0011",38,"C+",2.4,5.3999999999999995,10,"C",2,1.5,"C+","0031",38,"C+",2.4,7.1999999999999993,10,"C",2,2,"C+","0051",48,"B",2.8,10.5,21,"A",3.6,4.5,"B+",1031,53,"B+",3.2,12,21,"A",3.6,4.5,"A",4251,34,"C",2,7.5,45,"A+",4,5,"B",4171,54,"B+",3.2,12,null,"ABS","ABS","-","*","-",null,null,"ABS","ABS","-",null,"ABS","ABS","-",""]
[null,13,"LEPMUHANG RAI ","2062-04-23","801130210013",11301332,"0011",37,"C",2,4.5,12,"C",2,1.5,"C","0031",37,"C",2,6,12,"C",2,2,"C","0051",54,"B+",3.2,12,22,"A",3.6,4.5,"A",1031,53,"B+",3.2,12,22,"A",3.6,4.5,"A",4251,39,"C+",2.4,9,42,"A+",4,5,"B",4171,60,"A",3.6,13.5,null,"ABS","ABS","-","*","-",null,null,"ABS","ABS","-",null,"ABS","ABS","-",""]
[null,14,"MAHESH DAHAL ","2061-04-01","801130210014",11301333,"0011",35,"C",2,4.5,12,"C",2,1.5,"C","0031",35,"C",2,6,12,"C",2,2,"C","0051",49,"B",2.8,10.5,21,"A",3.6,4.5,"B+",1031,51,"B",2.8,10.5,22,"A",3.6,4.5,"B+",4251,44,"C+",2.4,9,50,"A+",4,5,"B",4171,60,"A",3.6,13.5,null,"ABS","ABS","-","*","-",null,null,"ABS","ABS","-",null,"ABS","ABS","-",""]
[null,15,"MANISHA RAI ","2064-01-15","801130210015",11301334,"0011",60,"A",3.6,8.1,20,"A",3.6,2.7,"A","0031",62,"A",3.6,10.8,20,"A",3.6,3.6,"A","0051",68,"A+",4,15,23,"A+",4,5,"A+",1031,70,"A+",4,15,24,"A+",4,5,"A+",4251,43,"C+",2.4,9,50,"A+",4,5,"B",4171,61,"A",3.6,13.5,null,"ABS","ABS","-","*","-",null,null,"ABS","ABS","-",null,"ABS","ABS","-",""]
[null,16,"MANISHA THAPA ","2062-06-25","801130210016",11301335,"0011",62,"A",3.6,8.1,18,"B+",3.2,2.4000000000000004,"A","0031",62,"A",3.6,10.8,18,"B+",3.2,3.2,"A","0051",66,"A",3.6,13.5,23,"A+",4,5,"A+",1031,70,"A+",4,15,24,"A+",4,5,"A+",4251,44,"C+",2.4,9,49,"A+",4,5,"B",4171,64,"A",3.6,13.5,null,"ABS","ABS","-","*","-",null,null,"ABS","ABS","-",null,"ABS","ABS","-",""]
[null,17,"MOUSAM RAI ","2063-06-29","801130210017",11301336,"0011",38,"C+",2.4,5.3999999999999995,13,"C+",2.4,1.7999999999999998,"C+","0031",38,"C+",2.4,7.1999999999999993,13,"C+",2.4,2.4,"C+","0051",60,"A",3.6,13.5,23,"A+",4,5,"A+",1031,50,"B",2.8,10.5,21,"A",3.6,4.5,"B+",4251,30,"C",2,7.5,47,"A+",4,5,"B",4171,41,"C+",2.4,9,null,"ABS","ABS","-","*","-",null,null,"ABS","ABS","-",null,"ABS","ABS","-",""]
[null,18,"NANIMA SHRESTHA ","2064-11-16","801130210018",11301337,"0011",38,"C+",2.4,5.3999999999999995,11,"C",2,1.5,"C+","0031",38,"C+",2.4,7.1999999999999993,11,"C",2,2,"C+","0051",66,"A",3.6,13.5,23,"A+",4,5,"A+",1031,55,"B+",3.2,12,22,"A",3.6,4.5,"A",4251,37,"C",2,7.5,49,"A+",4,5,"B",4171,46,"B",2.8,10.5,null,"ABS","ABS","-","*","-",null,null,"ABS","ABS","-",null,"ABS","ABS","-",""]
[null,19,"PRABIN TAMANG ","2062-02-27","801130210019",11301338,"0011",40,"C+",2.4,5.3999999999999995,13,"C+",2.4,1.7999999999999998,"C+","0031",40,"C+",2.4,7.1999999999999993,13,"C+",2.4,2.4,"C+","0051",66,"A",3.6,13.5,23,"A+",4,5,"A+",1031,51,"B",2.8,10.5,22,"A",3.6,4.5,"B+",4251,33,"C",2,7.5,47,"A+",4,5,"B",4171,46,"B",2.8,10.5,null,"ABS","ABS","-","*","-",null,null,"ABS","ABS","-",null,"ABS","ABS","-",""]
[null,20,"PRAMISAN RAI ","2063-05-27","801130210020",11301339,"0011",42,"C+",2.4,5.3999999999999995,14,"C+",2.4,1.7999999999999998,"C+","0031",42,"C+",2.4,7.1999999999999993,14,"C+",2.4,2.4,"C+","0051",67,"A",3.6,13.5,23,"A+",4,5,"A+",1031,52,"B",2.8,10.5,22,"A",3.6,4.5,"B+",4251,40,"C+",2.4,9,50,"A+",4,5,"B",4171,44,"C+",2.4,9,null,"ABS","ABS","-","*","-",null,null,"ABS","ABS","-",null,"ABS","ABS","-",""]
[null,21,"REJINA RAI ","2062-02-27","801130210021",11301340,"0011",68,"A+",4,9,22,"A",3.6,2.7,"A+","0031",68,"A+",4,12,22,"A",3.6,3.6,"A+","0051",69,"A+",4,15,23,"A+",4,5,"A+",1031,70,"A+",4,15,24,"A+",4,5,"A+",4251,45,"B",2.8,10.5,50,"A+",4,5,"B+",4051,71,"A+",4,15,null,"ABS","ABS","-","*","-",null,null,"ABS","ABS","-",null,"ABS","ABS","-",""]
[null,22,"ROHAN JOSHI ","2062-04-08","801130210022",11301341,"0011",58,"B+",3.2,7.2,18,"B+",3.2,2.4000000000000004,"B+","0031",58,"B+",3.2,9.6000000000000014,18,"B+",3.2,3.2,"B+","0051",52,"B",2.8,10.5,21,"A",3.6,4.5,"B+",1031,61,"A",3.6,13.5,23,"A+",4,5,"A+",4251,42,"C+",2.4,9,49,"A+",4,5,"B",4051,65,"A",3.6,13.5,null,"ABS","ABS","-","*","-",null,null,"ABS","ABS","-",null,"ABS","ABS","-",""]
[null,23,"SALINA GAJMER ","2063-04-25","801130210023",11301342,"0011",35,{"$f":"IF(H27/H$4>=0.9,\"A+\",IF(H27/H$4>=0.8,\"A\",IF(H27/H$4>=0.7,\"B+\",IF(H27/H$4>=0.6,\"B\",IF(H27/H$4>=0.5,\"C+\",IF(H27/H$4>=0.4,\"C\",IF(H27/H$4>=0.35,\"D\",IF(H27/H$4>0,\"NG\",\"ABS\"))))))))","v":"C"},{"$f":"IF(I27=\"A+\",4,IF(I27=\"A\",3.6,IF(I27=\"B+\",3.2,IF(I27=\"B\",2.8,IF(I27=\"C+\",2.4,IF(I27=\"C\",2,IF(I27=\"D\",1.6,IF(I27=\"NG\",\"-\",\"ABS\"))))))))","v":2},{"$f":"IFERROR($K$4*J27,\"-\")","v":4.5},10,"C",2,1.5,"C","0031",35,"C",2,6,10,"C",2,2,"C","0051",50,"B",2.8,10.5,22,"A",3.6,4.5,"B+",1031,56,"B+",3.2,12,21,"A",3.6,4.5,"A",4251,42,"C+",2.4,9,50,"A+",4,5,"B",4171,55,"B+",3.2,12,null,"ABS","ABS","-","*","-",null,null,"ABS","ABS","-",null,"ABS","ABS","-",""]
[null,24,"SAPHAL SHRESTHA ","2062-08-06","801130210024",11301343,"0011",58,"B+",3.2,7.2,18,"B+",3.2,2.4000000000000004,"B+","0031",58,"B+",3.2,9.6000000000000014,18,"B+",3.2,3.2,"B+","0051",58,"B+",3.2,12,22,"A",3.6,4.5,"A",1031,70,"A+",4,15,24,"A+",4,5,"A+",4251,41,"C+",2.4,9,49,"A+",4,5,"B",4171,57,"B+",3.2,12,null,"ABS","ABS","-","*","-",null,null,"ABS","ABS","-",null,"ABS","ABS","-",""]
[null,25,"SAUGAT SHRESTHA ","2062-01-05","801130210025",11301344,"0011",39,"C+",2.4,5.3999999999999995,11,"C",2,1.5,"C+","0031",39,"C+",2.4,7.1999999999999993,11,"C",2,2,"C+","0051",56,"B+",3.2,12,22,"A",3.6,4.5,"A",1031,51,"B",2.8,10.5,22,"A",3.6,4.5,"B+",4251,31,"C",2,7.5,47,"A+",4,5,"B",4171,44,"C+",2.4,9,null,"ABS","ABS","-","*","-",null,null,"ABS","ABS","-",null,"ABS","ABS","-",""]
[null,26,"SIKSHA RAI ","2064-03-21","801130210026",11301345,"0011",51,"B",2.8,6.3,14,"C+",2.4,1.7999999999999998,"B","0031",51,"B",2.8,8.3999999999999986,14,"C+",2.4,2.4,"B","0051",70,"A+",4,15,23,"A+",4,5,"A+",1031,70,"A+",4,15,24,"A+",4,5,"A+",4251,39,"C+",2.4,9,49,"A+",4,5,"B",4051,70,"A+",4,15,null,"ABS","ABS","-","*","-",null,null,"ABS","ABS","-",null,"ABS","ABS","-",""]
[null,27,"ESAN  RAI","MALE",58291,null,"0011",null,"ABS","ABS","-",null,"ABS","ABS","-","*","0031",null,"ABS","ABS","-",null,"ABS","ABS","-","*","0051",null,"ABS","ABS","-",null,"ABS","ABS","-","*",null,null,"ABS","ABS","-",null,"ABS","ABS","-","*",null,null,"ABS","ABS","-",null,"ABS","ABS","-","*",null,null,"ABS","ABS","-",null,"ABS","ABS","-","*","-",null,null,"ABS","ABS","-",null,"ABS","ABS","-",""]
[null,28,"ESHAN  RAI","MALE",59856,null,"0011",null,"ABS","ABS","-",null,"ABS","ABS","-","*","0031",null,"ABS","ABS","-",null,"ABS","ABS","-","*","0051",null,"ABS","ABS","-",null,"ABS","ABS","-","*",null,null,"ABS","ABS","-",null,"ABS","ABS","-","*",null,null,"ABS","ABS","-",null,"ABS","ABS","-","*",null,null,"ABS","ABS","-",null,"ABS","ABS","-","*","-",null,null,"ABS","ABS","-",null,"ABS","ABS","-",""]
[null,29,"INDESH  RAI","MALE",58546,null,"0011",null,"ABS","ABS","-",null,"ABS","ABS","-","*","0031",null,"ABS","ABS","-",null,"ABS","ABS","-","*","0051",null,"ABS","ABS","-",null,"ABS","ABS","-","*",null,null,"ABS","ABS","-",null,"ABS","ABS","-","*",null,null,"ABS","ABS","-",null,"ABS","ABS","-","*",null,null,"ABS","ABS","-",null,"ABS","ABS","-","*","-",null,null,"ABS","ABS","-",null,"ABS","ABS","-",""]
[null,30,"JENY  RAI","FEMALE",58353,null,"0011",null,"ABS","ABS","-",null,"ABS","ABS","-","*","0031",null,"ABS","ABS","-",null,"ABS","ABS","-","*","0051",null,"ABS","ABS","-",null,"ABS","ABS","-","*",null,null,"ABS","ABS","-",null,"ABS","ABS","-","*",null,null,"ABS","ABS","-",null,"ABS","ABS","-","*",null,null,"ABS","ABS","-",null,"ABS","ABS","-","*","-",null,null,"ABS","ABS","-",null,"ABS","ABS","-",""]
[null,31,"MANOJ  MAGAR","MALE",59378,null,"0011",null,"ABS","ABS","-",null,"ABS","ABS","-","*","0031",null,"ABS","ABS","-",null,"ABS","ABS","-","*","0051",null,"ABS","ABS","-",null,"ABS","ABS","-","*",null,null,"ABS","ABS","-",null,"ABS","ABS","-","*",null,null,"ABS","ABS","-",null,"ABS","ABS","-","*",null,null,"ABS","ABS","-",null,"ABS","ABS","-","*","-",null,null,"ABS","ABS","-",null,"ABS","ABS","-",""]
[null,32,null,null,null,null,"0011",null,"ABS","ABS","-",null,"ABS","ABS","-","*","0031",null,"ABS","ABS","-",null,"ABS","ABS","-","*","0051",null,"ABS","ABS","-",null,"ABS","ABS","-","*",null,null,"ABS","ABS","-",null,"ABS","ABS","-","*",null,null,"ABS","ABS","-",null,"ABS","ABS","-","*",null,null,"ABS","ABS","-",null,"ABS","ABS","-","*","-",null,null,"ABS","ABS","-",null,"ABS","ABS","-",""]
[null,33,null,null,null,null,"0011",null,"ABS","ABS","-",null,"ABS","ABS","-","*","0031",null,"ABS","ABS","-",null,"ABS","ABS","-","*","0051",null,"ABS","ABS","-",null,"ABS","ABS","-","*",null,null,"ABS","ABS","-",null,"ABS","ABS","-","*",null,null,"ABS","ABS","-",null,"ABS","ABS","-","*",null,null,"ABS","ABS","-",null,"ABS","ABS","-","*","-",null,null,"ABS","ABS","-",null,"ABS","ABS","-",""]
[null,34,null,null,null,null,"0011",null,"ABS","ABS","-",null,"ABS","ABS","-","*","0031",null,"ABS","ABS","-",null,"ABS","ABS","-","*","0051",null,"ABS","ABS","-",null,"ABS","ABS","-","*",null,null,"ABS","ABS","-",null,"ABS","ABS","-","*",null,null,"ABS","ABS","-",null,"ABS","ABS","-","*",null,null,"ABS","ABS","-",null,"ABS","ABS","-","*","-",null,null,"ABS","ABS","-",null,"ABS","ABS","-",""]
[null,35,null,null,null,null,"0011",null,"ABS","ABS","-",null,"ABS","ABS","-","*","0031",null,"ABS","ABS","-",null,"ABS","ABS","-","*","0051",null,"ABS","ABS","-",null,"ABS","ABS","-","*",null,null,"ABS","ABS","-",null,"ABS","ABS","-","*",null,null,"ABS","ABS","-",null,"ABS","ABS","-","*",null,null,"ABS","ABS","-",null,"ABS","ABS","-","*","-",null,null,"ABS","ABS","-",null,"ABS","ABS","-",""]
[null,36,null,null,null,null,"0011",null,"ABS","ABS","-",null,"ABS","ABS","-","*","0031",null,"ABS","ABS","-",null,"ABS","ABS","-","*","0051",null,"ABS","ABS","-",null,"ABS","ABS","-","*",null,null,"ABS","ABS","-",null,"ABS","ABS","-","*",null,null,"ABS","ABS","-",null,"ABS","ABS","-","*",null,null,"ABS","ABS","-",null,"ABS","ABS","-","*","-",null,null,"ABS","ABS","-",null,"ABS","ABS","-",""]
[null,37,null,null,null,null,"0011",null,"ABS","ABS","-",null,"ABS","ABS","-","*","0031",null,"ABS","ABS","-",null,"ABS","ABS","-","*","0051",null,"ABS","ABS","-",null,"ABS","ABS","-","*",null,null,"ABS","ABS","-",null,"ABS","ABS","-","*",null,null,"ABS","ABS","-",null,"ABS","ABS","-","*",null,null,"ABS","ABS","-",null,"ABS","ABS","-","*","-",null,null,"ABS","ABS","-",null,"ABS","ABS","-",""]
[null,38,null,null,null,null,"0011",null,"ABS","ABS","-",null,"ABS","ABS","-","*","0031",null,"ABS","ABS","-",null,"ABS","ABS","-","*","0051",null,"ABS","ABS","-",null,"ABS","ABS","-","*",null,null,"ABS","ABS","-",null,"ABS","ABS","-","*",null,null,"ABS","ABS","-",null,"ABS","ABS","-","*",null,null,"ABS","ABS","-",null,"ABS","ABS","-","*","-",null,null,"ABS","ABS","-",null,"ABS","ABS","-",""]
[null,39,null,null,null,null,"0011",null,"ABS","ABS","-",null,"ABS","ABS","-","*","0031",null,"ABS","ABS","-",null,"ABS","ABS","-","*","0051",null,"ABS","ABS","-",null,"ABS","ABS","-","*",null,null,"ABS","ABS","-",null,"ABS","ABS","-","*",null,null,"ABS","ABS","-",null,"ABS","ABS","-","*",null,null,"ABS","ABS","-",null,"ABS","ABS","-","*","-",null,null,"ABS","ABS","-",null,"ABS","ABS","-",""]
[null,40,null,null,null,null,"0011",null,"ABS","ABS","-",null,"ABS","ABS","-","*","0031",null,"ABS","ABS","-",null,"ABS","ABS","-","*","0051",null,"ABS","ABS","-",null,"ABS","ABS","-","*",null,null,"ABS","ABS","-",null,"ABS","ABS","-","*",null,null,"ABS","ABS","-",null,"ABS","ABS","-","*",null,null,"ABS","ABS","-",null,"ABS","ABS","-","*","-",null,null,"ABS","ABS","-",null,"ABS","ABS","-",""]
[null,41,null,null,null,null,"0011",null,"ABS","ABS","-",null,"ABS","ABS","-","*","0031",null,"ABS","ABS","-",null,"ABS","ABS","-","*","0051",null,"ABS","ABS","-",null,"ABS","ABS","-","*",null,null,"ABS","ABS","-",null,"ABS","ABS","-","*",null,null,"ABS","ABS","-",null,"ABS","ABS","-","*",null,null,"ABS","ABS","-",null,"ABS","ABS","-","*","-",null,null,"ABS","ABS","-",null,"ABS","ABS","-",""]
[null,42,null,null,null,null,"0011",null,"ABS","ABS","-",null,"ABS","ABS","-","*","0031",null,"ABS","ABS","-",null,"ABS","ABS","-","*","0051",null,"ABS","ABS","-",null,"ABS","ABS","-","*",null,null,"ABS","ABS","-",null,"ABS","ABS","-","*",null,null,"ABS","ABS","-",null,"ABS","ABS","-","*",null,null,"ABS","ABS","-",null,"ABS","ABS","-","*","-",null,null,"ABS","ABS","-",null,"ABS","ABS","-",""]
[null,43,null,null,null,null,"0011",null,"ABS","ABS","-",null,"ABS","ABS","-","*","0031",null,"ABS","ABS","-",null,"ABS","ABS","-","*","0051",null,"ABS","ABS","-",null,"ABS","ABS","-","*",null,null,"ABS","ABS","-",null,"ABS","ABS","-","*",null,null,"ABS","ABS","-",null,"ABS","ABS","-","*",null,null,"ABS","ABS","-",null,"ABS","ABS","-","*","-",null,null,"ABS","ABS","-",null,"ABS","ABS","-",""]
[null,44,null,null,null,null,"0011",null,"ABS","ABS","-",null,"ABS","ABS","-","*","0031",null,"ABS","ABS","-",null,"ABS","ABS","-","*","0051",null,"ABS","ABS","-",null,"ABS","ABS","-","*",null,null,"ABS","ABS","-",null,"ABS","ABS","-","*",null,null,"ABS","ABS","-",null,"ABS","ABS","-","*",null,null,"ABS","ABS","-",null,"ABS","ABS","-","*","-",null,null,"ABS","ABS","-",null,"ABS","ABS","-",""]
[null,45,null,null,null,null,"0011",null,"ABS","ABS","-",null,"ABS","ABS","-","*","0031",null,"ABS","ABS","-",null,"ABS","ABS","-","*","0051",null,"ABS","ABS","-",null,"ABS","ABS","-","*",null,null,"ABS","ABS","-",null,"ABS","ABS","-","*",null,null,"ABS","ABS","-",null,"ABS","ABS","-","*",null,null,"ABS","ABS","-",null,"ABS","ABS","-","*","-",null,null,"ABS","ABS","-",null,"ABS","ABS","-",""]
[null,46,null,null,null,null,"0011",null,"ABS","ABS","-",null,"ABS","ABS","-","*","0031",null,"ABS","ABS","-",null,"ABS","ABS","-","*","0051",null,"ABS","ABS","-",null,"ABS","ABS","-","*",null,null,"ABS","ABS","-",null,"ABS","ABS","-","*",null,null,"ABS","ABS","-",null,"ABS","ABS","-","*",null,null,"ABS","ABS","-",null,"ABS","ABS","-","*","-",null,null,"ABS","ABS","-",null,"ABS","ABS","-",""]
[null,47,null,null,null,null,"0011",null,"ABS","ABS","-",null,"ABS","ABS","-","*","0031",null,"ABS","ABS","-",null,"ABS","ABS","-","*","0051",null,"ABS","ABS","-",null,"ABS","ABS","-","*",null,null,"ABS","ABS","-",null,"ABS","ABS","-","*",null,null,"ABS","ABS","-",null,"ABS","ABS","-","*",null,null,"ABS","ABS","-",null,"ABS","ABS","-","*","-",null,null,"ABS","ABS","-",null,"ABS","ABS","-",""]
[null,48,null,null,null,null,"0011",null,"ABS","ABS","-",null,"ABS","ABS","-","*","0031",null,"ABS","ABS","-",null,"ABS","ABS","-","*","0051",null,"ABS","ABS","-",null,"ABS","ABS","-","*",null,null,"ABS","ABS","-",null,"ABS","ABS","-","*",null,null,"ABS","ABS","-",null,"ABS","ABS","-","*",null,null,"ABS","ABS","-",null,"ABS","ABS","-","*","-",null,null,"ABS","ABS","-",null,"ABS","ABS","-",""]
[null,49,null,null,null,null,"0011",null,"ABS","ABS","-",null,"ABS","ABS","-","*","0031",null,"ABS","ABS","-",null,"ABS","ABS","-","*","0051",null,"ABS","ABS","-",null,"ABS","ABS","-","*",null,null,"ABS","ABS","-",null,"ABS","ABS","-","*",null,null,"ABS","ABS","-",null,"ABS","ABS","-","*",null,null,"ABS","ABS","-",null,"ABS","ABS","-","*","-",null,null,"ABS","ABS","-",null,"ABS","ABS","-",""]
[null,50,null,null,null,null,"0011",null,"ABS","ABS","-",null,"ABS","ABS","-","*","0031",null,"ABS","ABS","-",null,"ABS","ABS","-","*","0051",null,"ABS","ABS","-",null,"ABS","ABS","-","*",null,null,"ABS","ABS","-",null,"ABS","ABS","-","*",null,null,"ABS","ABS","-",null,"ABS","ABS","-","*",null,null,"ABS","ABS","-",null,"ABS","ABS","-","*","-",null,null,"ABS","ABS","-",null,"ABS","ABS","-",""]
[null,51,null,null,null,null,"0011",null,"ABS","ABS","-",null,"ABS","ABS","-","*","0031",null,"ABS","ABS","-",null,"ABS","ABS","-","*","0051",null,"ABS","ABS","-",null,"ABS","ABS","-","*",null,null,"ABS","ABS","-",null,"ABS","ABS","-","*",null,null,"ABS","ABS","-",null,"ABS","ABS","-","*",null,null,"ABS","ABS","-",null,"ABS","ABS","-","*","-",null,null,"ABS","ABS","-",null,"ABS","ABS","-",""]
[null,52,null,null,null,null,"0011",null,"ABS","ABS","-",null,"ABS","ABS","-","*","0031",null,"ABS","ABS","-",null,"ABS","ABS","-","*","0051",null,"ABS","ABS","-",null,"ABS","ABS","-","*",null,null,"ABS","ABS","-",null,"ABS","ABS","-","*",null,null,"ABS","ABS","-",null,"ABS","ABS","-","*",null,null,"ABS","ABS","-",null,"ABS","ABS","-","*","-",null,null,"ABS","ABS","-",null,"ABS","ABS","-",""]
[null,53,null,null,null,null,"0011",null,"ABS","ABS","-",null,"ABS","ABS","-","*","0031",null,"ABS","ABS","-",null,"ABS","ABS","-","*","0051",null,"ABS","ABS","-",null,"ABS","ABS","-","*",null,null,"ABS","ABS","-",null,"ABS","ABS","-","*",null,null,"ABS","ABS","-",null,"ABS","ABS","-","*",null,null,"ABS","ABS","-",null,"ABS","ABS","-","*","-",null,null,"ABS","ABS","-",null,"ABS","ABS","-",""]
[null,54,null,null,null,null,"0011",null,"ABS","ABS","-",null,"ABS","ABS","-","*","0031",null,"ABS","ABS","-",null,"ABS","ABS","-","*","0051",null,"ABS","ABS","-",null,"ABS","ABS","-","*",null,null,"ABS","ABS","-",null,"ABS","ABS","-","*",null,null,"ABS","ABS","-",null,"ABS","ABS","-","*",null,null,"ABS","ABS","-",null,"ABS","ABS","-","*","-",null,null,"ABS","ABS","-",null,"ABS","ABS","-",""]
[null,55,null,null,null,null,"0011",null,"ABS","ABS","-",null,"ABS","ABS","-","*","0031",null,"ABS","ABS","-",null,"ABS","ABS","-","*","0051",null,"ABS","ABS","-",null,"ABS","ABS","-","*",null,null,"ABS","ABS","-",null,"ABS","ABS","-","*",null,null,"ABS","ABS","-",null,"ABS","ABS","-","*",null,null,"ABS","ABS","-",null,"ABS","ABS","-","*","-",null,null,"ABS","ABS","-",null,"ABS","ABS","-",""]
[null,56,null,null,null,null,"0011",null,"ABS","ABS","-",null,"ABS","ABS","-","*","0031",null,"ABS","ABS","-",null,"ABS","ABS","-","*","0051",null,"ABS","ABS","-",null,"ABS","ABS","-","*",null,null,"ABS","ABS","-",null,"ABS","ABS","-","*",null,null,"ABS","ABS","-",null,"ABS","ABS","-","*",null,null,"ABS","ABS","-",null,"ABS","ABS","-","*","-",null,null,"ABS","ABS","-",null,"ABS","ABS","-",""]
[null,57,null,null,null,null,"0011",null,"ABS","ABS","-",null,"ABS","ABS","-","*","0031",null,"ABS","ABS","-",null,"ABS","ABS","-","*","0051",null,"ABS","ABS","-",null,"ABS","ABS","-","*",null,null,"ABS","ABS","-",null,"ABS","ABS","-","*",null,null,"ABS","ABS","-",null,"ABS","ABS","-","*",null,null,"ABS","ABS","-",null,"ABS","ABS","-","*","-",null,null,"ABS","ABS","-",null,"ABS","ABS","-",""]
[null,58,null,null,null,null,"0011",null,"ABS","ABS","-",null,"ABS","ABS","-","*","0031",null,"ABS","ABS","-",null,"ABS","ABS","-","*","0051",null,"ABS","ABS","-",null,"ABS","ABS","-","*",null,null,"ABS","ABS","-",null,"ABS","ABS","-","*",null,null,"ABS","ABS","-",null,"ABS","ABS","-","*",null,null,"ABS","ABS","-",null,"ABS","ABS","-","*","-",null,null,"ABS","ABS","-",null,"ABS","ABS","-",""]
[null,59,null,null,null,null,"0011",null,"ABS","ABS","-",null,"ABS","ABS","-","*","0031",null,"ABS","ABS","-",null,"ABS","ABS","-","*","0051",null,"ABS","ABS","-",null,"ABS","ABS","-","*",null,null,"ABS","ABS","-",null,"ABS","ABS","-","*",null,null,"ABS","ABS","-",null,"ABS","ABS","-","*",null,null,"ABS","ABS","-",null,"ABS","ABS","-","*","-",null,null,"ABS","ABS","-",null,"ABS","ABS","-",""]
[null,60,null,null,null,null,"0011",null,"ABS","ABS","-",null,"ABS","ABS","-","*","0031",null,"ABS","ABS","-",null,"ABS","ABS","-","*","0051",null,"ABS","ABS","-",null,"ABS","ABS","-","*",null,null,"ABS","ABS","-",null,"ABS","ABS","-","*",null,null,"ABS","ABS","-",null,"ABS","ABS","-","*",null,null,"ABS","ABS","-",null,"ABS","ABS","-","*","-",null,null,"ABS","ABS","-",null,"ABS","ABS","-",""]
[null,61,null,null,null,null,"0011",null,"ABS","ABS","-",null,"ABS","ABS","-","*","0031",null,"ABS","ABS","-",null,"ABS","ABS","-","*","0051",null,"ABS","ABS","-",null,"ABS","ABS","-","*",null,null,"ABS","ABS","-",null,"ABS","ABS","-","*",null,null,"ABS","ABS","-",null,"ABS","ABS","-","*",null,null,"ABS","ABS","-",null,"ABS","ABS","-","*","-",null,null,"ABS","ABS","-",null,"ABS","ABS","-",""]
[null,62,null,null,null,null,"0011",null,"ABS","ABS","-",null,"ABS","ABS","-","*","0031",null,"ABS","ABS","-",null,"ABS","ABS","-","*","0051",null,"ABS","ABS","-",null,"ABS","ABS","-","*",null,null,"ABS","ABS","-",null,"ABS","ABS","-","*",null,null,"ABS","ABS","-",null,"ABS","ABS","-","*",null,null,"ABS","ABS","-",null,"ABS","ABS","-","*","-",null,null,"ABS","ABS","-",null,"ABS","ABS","-",""]
[null,63,null,null,null,null,"0011",null,"ABS","ABS","-",null,"ABS","ABS","-","*","0031",null,"ABS","ABS","-",null,"ABS","ABS","-","*","0051",null,"ABS","ABS","-",null,"ABS","ABS","-","*",null,null,"ABS","ABS","-",null,"ABS","ABS","-","*",null,null,"ABS","ABS","-",null,"ABS","ABS","-","*",null,null,"ABS","ABS","-",null,"ABS","ABS","-","*","-",null,null,"ABS","ABS","-",null,"ABS","ABS","-",""]
[null,64,null,null,null,null,"0011",null,"ABS","ABS","-",null,"ABS","ABS","-","*","0031",null,"ABS","ABS","-",null,"ABS","ABS","-","*","0051",null,"ABS","ABS","-",null,"ABS","ABS","-","*",null,null,"ABS","ABS","-",null,"ABS","ABS","-","*",null,null,"ABS","ABS","-",null,"ABS","ABS","-","*",null,null,"ABS","ABS","-",null,"ABS","ABS","-","*","-",null,null,"ABS","ABS","-",null,"ABS","ABS","-",""]
[null,65,null,null,null,null,"0011",null,"ABS","ABS","-",null,"ABS","ABS","-","*","0031",null,"ABS","ABS","-",null,"ABS","ABS","-","*","0051",null,"ABS","ABS","-",null,"ABS","ABS","-","*",null,null,"ABS","ABS","-",null,"ABS","ABS","-","*",null,null,"ABS","ABS","-",null,"ABS","ABS","-","*",null,null,"ABS","ABS","-",null,"ABS","ABS","-","*","-",null,null,"ABS","ABS","-",null,"ABS","ABS","-",""]
[null,66,null,null,null,null,"0011",null,{"$f":"IF(H70/H$4>=0.9,\"A+\",IF(H70/H$4>=0.8,\"A\",IF(H70/H$4>=0.7,\"B+\",IF(H70/H$4>=0.6,\"B\",IF(H70/H$4>=0.5,\"C+\",IF(H70/H$4>=0.4,\"C\",IF(H70/H$4>=0.35,\"D\",IF(H70/H$4>0,\"NG\",\"ABS\"))))))))","v":"ABS"},{"$f":"IF(I70=\"A+\",4,IF(I70=\"A\",3.6,IF(I70=\"B+\",3.2,IF(I70=\"B\",2.8,IF(I70=\"C+\",2.4,IF(I70=\"C\",2,IF(I70=\"D\",1.6,IF(I70=\"NG\",\"-\",\"ABS\"))))))))","v":"ABS"},{"$f":"IFERROR($K$4*J70,\"-\")","v":"-"},null,{"$f":"IF(L70/L$4>=0.9,\"A+\",IF(L70/L$4>=0.8,\"A\",IF(L70/L$4>=0.7,\"B+\",IF(L70/L$4>=0.6,\"B\",IF(L70/L$4>=0.5,\"C+\",IF(L70/L$4>=0.4,\"C\",IF(L70/L$4>0,\"NG\",\"ABS\")))))))","v":"ABS"},{"$f":"IF(M70=\"A+\",4,IF(M70=\"A\",3.6,IF(M70=\"B+\",3.2,IF(M70=\"B\",2.8,IF(M70=\"C+\",2.4,IF(M70=\"C\",2,IF(M70=\"D\",1.6,IF(M70=\"NG\",\"-\",\"ABS\"))))))))","v":"ABS"},{"$f":"IFERROR($O$4*N70,\"-\")","v":"-"},{"$f":"IFERROR(IF((K70+O70)/($K$4+$O$4)>3.6,\"A+\",IF((K70+O70)/($K$4+$O$4)>3.2,\"A\",IF((K70+O70)/($K$4+$O$4)>2.8,\"B+\",IF((K70+O70)/($K$4+$O$4)>2.4,\"B\",IF((K70+O70)/($K$4+$O$4)>2,\"C+\",IF((K70+O70)/($K$4+$O$4)>1.6,\"C\",IF((K70+O70)/($K$4+$O$4)=1.6,\"D\",IF((K70+O70)/($K$4+$O$4)<1.6,\"NG\",\"\")))))))),\"*\")","v":"*"},"0031",null,{"$f":"IF(R70/R$4>=0.9,\"A+\",IF(R70/R$4>=0.8,\"A\",IF(R70/R$4>=0.7,\"B+\",IF(R70/R$4>=0.6,\"B\",IF(R70/R$4>=0.5,\"C+\",IF(R70/R$4>=0.4,\"C\",IF(R70/R$4>=0.35,\"D\",IF(R70/R$4>0,\"NG\",\"ABS\"))))))))","v":"ABS"},{"$f":"IF(S70=\"A+\",4,IF(S70=\"A\",3.6,IF(S70=\"B+\",3.2,IF(S70=\"B\",2.8,IF(S70=\"C+\",2.4,IF(S70=\"C\",2,IF(S70=\"D\",1.6,IF(S70=\"NG\",\"-\",\"ABS\"))))))))","v":"ABS"},{"$f":"IFERROR($U$4*T70,\"-\")","v":"-"},null,{"$f":"IF(V70/V$4>=0.9,\"A+\",IF(V70/V$4>=0.8,\"A\",IF(V70/V$4>=0.7,\"B+\",IF(V70/V$4>=0.6,\"B\",IF(V70/V$4>=0.5,\"C+\",IF(V70/V$4>=0.4,\"C\",IF(V70/V$4>0,\"NG\",\"ABS\")))))))","v":"ABS"},{"$f":"IF(W70=\"A+\",4,IF(W70=\"A\",3.6,IF(W70=\"B+\",3.2,IF(W70=\"B\",2.8,IF(W70=\"C+\",2.4,IF(W70=\"C\",2,IF(W70=\"D\",1.6,IF(W70=\"NG\",\"-\",\"ABS\"))))))))","v":"ABS"},{"$f":"IFERROR($Y$4*X70,\"-\")","v":"-"},{"$f":"IFERROR(IF((U70+Y70)/($U$4+$Y$4)>3.6,\"A+\",IF((U70+Y70)/($U$4+$Y$4)>3.2,\"A\",IF((U70+Y70)/($U$4+$Y$4)>2.8,\"B+\",IF((U70+Y70)/($U$4+$Y$4)>2.4,\"B\",IF((U70+Y70)/($U$4+$Y$4)>2,\"C+\",IF((U70+Y70)/($U$4+$Y$4)>1.6,\"C\",IF((U70+Y70)/($U$4+$Y$4)=1.6,\"D\",IF((U70+Y70)/($U$4+$Y$4)<1.6,\"NG\",\"\")))))))),\"*\")","v":"*"},"0051",null,{"$f":"IF(AB70/AB$4>=0.9,\"A+\",IF(AB70/AB$4>=0.8,\"A\",IF(AB70/AB$4>=0.7,\"B+\",IF(AB70/AB$4>=0.6,\"B\",IF(AB70/AB$4>=0.5,\"C+\",IF(AB70/AB$4>=0.4,\"C\",IF(AB70/AB$4>=0.35,\"D\",IF(AB70/AB$4>0,\"NG\",\"ABS\"))))))))","v":"ABS"},{"$f":"IF(AC70=\"A+\",4,IF(AC70=\"A\",3.6,IF(AC70=\"B+\",3.2,IF(AC70=\"B\",2.8,IF(AC70=\"C+\",2.4,IF(AC70=\"C\",2,IF(AC70=\"D\",1.6,IF(AC70=\"NG\",\"-\",\"ABS\"))))))))","v":"ABS"},{"$f":"IFERROR($AE$4*AD70,\"-\")","v":"-"},null,{"$f":"IF(AF70/AF$4>=0.9,\"A+\",IF(AF70/AF$4>=0.8,\"A\",IF(AF70/AF$4>=0.7,\"B+\",IF(AF70/AF$4>=0.6,\"B\",IF(AF70/AF$4>=0.5,\"C+\",IF(AF70/AF$4>=0.4,\"C\",IF(AF70/AF$4>0,\"NG\",\"ABS\")))))))","v":"ABS"},{"$f":"IF(AG70=\"A+\",4,IF(AG70=\"A\",3.6,IF(AG70=\"B+\",3.2,IF(AG70=\"B\",2.8,IF(AG70=\"C+\",2.4,IF(AG70=\"C\",2,IF(AG70=\"D\",1.6,IF(AG70=\"NG\",\"-\",\"ABS\"))))))))","v":"ABS"},{"$f":"IFERROR($AI$4*AH70,\"-\")","v":"-"},{"$f":"IFERROR(IF((AE70+AI70)/($AE$4+$AI$4)>3.6,\"A+\",IF((AE70+AI70)/($AE$4+$AI$4)>3.2,\"A\",IF((AE70+AI70)/($AE$4+$AI$4)>2.8,\"B+\",IF((AE70+AI70)/($AE$4+$AI$4)>2.4,\"B\",IF((AE70+AI70)/($AE$4+$AI$4)>2,\"C+\",IF((AE70+AI70)/($AE$4+$AI$4)>1.6,\"C\",IF((AE70+AI70)/($AE$4+$AI$4)=1.6,\"D\",IF((AE70+AI70)/($AE$4+$AI$4)<1.6,\"NG\",\"\")))))))),\"*\")","v":"*"},null,null,{"$f":"IF(AL70/AL$4>=0.9,\"A+\",IF(AL70/AL$4>=0.8,\"A\",IF(AL70/AL$4>=0.7,\"B+\",IF(AL70/AL$4>=0.6,\"B\",IF(AL70/AL$4>=0.5,\"C+\",IF(AL70/AL$4>=0.4,\"C\",IF(AL70/AL$4>=0.35,\"D\",IF(AL70/AL$4>0,\"NG\",\"ABS\"))))))))","v":"ABS"},{"$f":"IF(AM70=\"A+\",4,IF(AM70=\"A\",3.6,IF(AM70=\"B+\",3.2,IF(AM70=\"B\",2.8,IF(AM70=\"C+\",2.4,IF(AM70=\"C\",2,IF(AM70=\"D\",1.6,IF(AM70=\"NG\",\"-\",\"ABS\"))))))))","v":"ABS"},{"$f":"IFERROR($AO$4*AN70,\"-\")","v":"-"},null,{"$f":"IF(AP70/AP$4>=0.9,\"A+\",IF(AP70/AP$4>=0.8,\"A\",IF(AP70/AP$4>=0.7,\"B+\",IF(AP70/AP$4>=0.6,\"B\",IF(AP70/AP$4>=0.5,\"C+\",IF(AP70/AP$4>=0.4,\"C\",IF(AP70/AP$4>0,\"NG\",\"ABS\")))))))","v":"ABS"},{"$f":"IF(AQ70=\"A+\",4,IF(AQ70=\"A\",3.6,IF(AQ70=\"B+\",3.2,IF(AQ70=\"B\",2.8,IF(AQ70=\"C+\",2.4,IF(AQ70=\"C\",2,IF(AQ70=\"D\",1.6,IF(AQ70=\"NG\",\"-\",\"ABS\"))))))))","v":"ABS"},{"$f":"IFERROR($AS$4*AR70,\"-\")","v":"-"},{"$f":"IFERROR(IF((AO70+AS70)/($AO$4+$AS$4)>3.6,\"A+\",IF((AO70+AS70)/($AO$4+$AS$4)>3.2,\"A\",IF((AO70+AS70)/($AO$4+$AS$4)>2.8,\"B+\",IF((AO70+AS70)/($AO$4+$AS$4)>2.4,\"B\",IF((AO70+AS70)/($AO$4+$AS$4)>2,\"C+\",IF((AO70+AS70)/($AO$4+$AS$4)>1.6,\"C\",IF((AO70+AS70)/($AO$4+$AS$4)=1.6,\"D\",IF((AO70+AS70)/($AO$4+$AS$4)<1.6,\"NG\",\"\")))))))),\"*\")","v":"*"},null,null,{"$f":"IF(AV70/AV$4>=0.9,\"A+\",IF(AV70/AV$4>=0.8,\"A\",IF(AV70/AV$4>=0.7,\"B+\",IF(AV70/AV$4>=0.6,\"B\",IF(AV70/AV$4>=0.5,\"C+\",IF(AV70/AV$4>=0.4,\"C\",IF(AV70/AV$4>=0.35,\"D\",IF(AV70/AV$4>0,\"NG\",\"ABS\"))))))))","v":"ABS"},{"$f":"IF(AW70=\"A+\",4,IF(AW70=\"A\",3.6,IF(AW70=\"B+\",3.2,IF(AW70=\"B\",2.8,IF(AW70=\"C+\",2.4,IF(AW70=\"C\",2,IF(AW70=\"D\",1.6,IF(AW70=\"NG\",\"-\",\"ABS\"))))))))","v":"ABS"},{"$f":"IFERROR($AY$4*AX70,\"-\")","v":"-"},null,{"$f":"IF(AZ70/AZ$4>=0.9,\"A+\",IF(AZ70/AZ$4>=0.8,\"A\",IF(AZ70/AZ$4>=0.7,\"B+\",IF(AZ70/AZ$4>=0.6,\"B\",IF(AZ70/AZ$4>=0.5,\"C+\",IF(AZ70/AZ$4>=0.4,\"C\",IF(AZ70/AZ$4>0,\"NG\",\"ABS\")))))))","v":"ABS"},{"$f":"IF(BA70=\"A+\",4,IF(BA70=\"A\",3.6,IF(BA70=\"B+\",3.2,IF(BA70=\"B\",2.8,IF(BA70=\"C+\",2.4,IF(BA70=\"C\",2,IF(BA70=\"D\",1.6,IF(BA70=\"NG\",\"-\",\"ABS\"))))))))","v":"ABS"},{"$f":"IFERROR($BC$4*BB70,\"-\")","v":"-"},{"$f":"IFERROR(IF((AY70+BC70)/($AY$4+$BC$4)>3.6,\"A+\",IF((AY70+BC70)/($AY$4+$BC$4)>3.2,\"A\",IF((AY70+BC70)/($AY$4+$BC$4)>2.8,\"B+\",IF((AY70+BC70)/($AY$4+$BC$4)>2.4,\"B\",IF((AY70+BC70)/($AY$4+$BC$4)>2,\"C+\",IF((AY70+BC70)/($AY$4+$BC$4)>1.6,\"C\",IF((AY70+BC70)/($AY$4+$BC$4)=1.6,\"D\",IF((AY70+BC70)/($AY$4+$BC$4)<1.6,\"NG\",\"\")))))))),\"*\")","v":"*"},null,null,{"$f":"IF(BF70/BF$4>=0.9,\"A+\",IF(BF70/BF$4>=0.8,\"A\",IF(BF70/BF$4>=0.7,\"B+\",IF(BF70/BF$4>=0.6,\"B\",IF(BF70/BF$4>=0.5,\"C+\",IF(BF70/BF$4>=0.4,\"C\",IF(BF70/BF$4>=0.35,\"D\",IF(BF70/BF$4>0,\"NG\",\"ABS\"))))))))","v":"ABS"},{"$f":"IF(BG70=\"A+\",4,IF(BG70=\"A\",3.6,IF(BG70=\"B+\",3.2,IF(BG70=\"B\",2.8,IF(BG70=\"C+\",2.4,IF(BG70=\"C\",2,IF(BG70=\"D\",1.6,IF(BG70=\"NG\",\"-\",\"ABS\"))))))))","v":"ABS"},{"$f":"IFERROR($BI$4*BH70,\"-\")","v":"-"},null,{"$f":"IF(BJ70/BJ$4>=0.9,\"A+\",IF(BJ70/BJ$4>=0.8,\"A\",IF(BJ70/BJ$4>=0.7,\"B+\",IF(BJ70/BJ$4>=0.6,\"B\",IF(BJ70/BJ$4>=0.5,\"C+\",IF(BJ70/BJ$4>=0.4,\"C\",IF(BJ70/BJ$4>0,\"NG\",\"ABS\")))))))","v":"ABS"},{"$f":"IF(BK70=\"A+\",4,IF(BK70=\"A\",3.6,IF(BK70=\"B+\",3.2,IF(BK70=\"B\",2.8,IF(BK70=\"C+\",2.4,IF(BK70=\"C\",2,IF(BK70=\"D\",1.6,IF(BK70=\"NG\",\"-\",\"ABS\"))))))))","v":"ABS"},{"$f":"IFERROR($BM$4*BL70,\"-\")","v":"-"},{"$f":"IFERROR(IF((BI70+BM70)/($BI$4+$BM$4)>3.6,\"A+\",IF((BI70+BM70)/($BI$4+$BM$4)>3.2,\"A\",IF((BI70+BM70)/($BI$4+$BM$4)>2.8,\"B+\",IF((BI70+BM70)/($BI$4+$BM$4)>2.4,\"B\",IF((BI70+BM70)/($BI$4+$BM$4)>2,\"C+\",IF((BI70+BM70)/($BI$4+$BM$4)>1.6,\"C\",IF((BI70+BM70)/($BI$4+$BM$4)=1.6,\"D\",IF((BI70+BM70)/($BI$4+$BM$4)<1.6,\"NG\",\"\")))))))),\"*\")","v":"*"},{"$f":"IFERROR((K70+O70+U70+Y70+AE70+AI70+AO70+AS70+AY70+BC70+BI70+BM70)/($K$4+$O$4+$U$4+$Y$4+$AE$4+$AI$4+$AO$4+$AS$4+$AY$4+$BC$4+$BI$4+$BM$4),\"-\")","v":"-"},null,null,{"$f":"IF(BQ70/BQ$4>=0.9,\"A+\",IF(BQ70/BQ$4>=0.8,\"A\",IF(BQ70/BQ$4>=0.7,\"B+\",IF(BQ70/BQ$4>=0.6,\"B\",IF(BQ70/BQ$4>=0.5,\"C+\",IF(BQ70/BQ$4>=0.4,\"C\",IF(BQ70/BQ$4>=0.35,\"D\",IF(BQ70/BQ$4>0,\"NG\",\"ABS\"))))))))","v":"ABS"},{"$f":"IF(BR70=\"A+\",4,IF(BR70=\"A\",3.6,IF(BR70=\"B+\",3.2,IF(BR70=\"B\",2.8,IF(BR70=\"C+\",2.4,IF(BR70=\"C\",2,IF(BR70=\"D\",1.6,IF(BR70=\"NG\",\"-\",\"ABS\"))))))))","v":"ABS"},{"$f":"IFERROR($BT$4*BS70,\"-\")","v":"-"},null,{"$f":"IF(BU70/BU$4>=0.9,\"A+\",IF(BU70/BU$4>=0.8,\"A\",IF(BU70/BU$4>=0.7,\"B+\",IF(BU70/BU$4>=0.6,\"B\",IF(BU70/BU$4>=0.5,\"C+\",IF(BU70/BU$4>=0.4,\"C\",IF(BU70/BU$4>0,\"NG\",\"ABS\")))))))","v":"ABS"},{"$f":"IF(BV70=\"A+\",4,IF(BV70=\"A\",3.6,IF(BV70=\"B+\",3.2,IF(BV70=\"B\",2.8,IF(BV70=\"C+\",2.4,IF(BV70=\"C\",2,IF(BV70=\"D\",1.6,IF(BV70=\"NG\",\"-\",\"ABS\"))))))))","v":"ABS"},{"$f":"IFERROR($BX$4*BW70,\"-\")","v":"-"},{"$f":"IFERROR(IF((BT70+BX70)/($BT$4+$BX$4)>3.6,\"A+\",IF((BT70+BX70)/($BT$4+$BX$4)>3.2,\"A\",IF((BT70+BX70)/($BT$4+$BX$4)>2.8,\"B+\",IF((BT70+BX70)/($BT$4+$BX$4)>2.4,\"B\",IF((BT70+BX70)/($BT$4+$BX$4)>2,\"C+\",IF((BT70+BX70)/($BT$4+$BX$4)>1.6,\"C\",IF((BT70+BX70)/($BT$4+$BX$4)=1.6,\"D\",IF((BT70+BX70)/($BT$4+$BX$4)<1.6,\"NG\",\"\")))))))),\"\")","v":""}]
[null,67,null,null,null,null,"0011",null,"ABS","ABS","-",null,"ABS","ABS","-","*","0031",null,"ABS","ABS","-",null,"ABS","ABS","-","*","0051",null,"ABS","ABS","-",null,"ABS","ABS","-","*",null,null,"ABS","ABS","-",null,"ABS","ABS","-","*",null,null,"ABS","ABS","-",null,"ABS","ABS","-","*",null,null,"ABS","ABS","-",null,"ABS","ABS","-","*","-",null,null,"ABS","ABS","-",null,"ABS","ABS","-",""]
[null,68,null,null,null,null,"0011",null,"ABS","ABS","-",null,"ABS","ABS","-","*","0031",null,"ABS","ABS","-",null,"ABS","ABS","-","*","0051",null,"ABS","ABS","-",null,"ABS","ABS","-","*",null,null,"ABS","ABS","-",null,"ABS","ABS","-","*",null,null,"ABS","ABS","-",null,"ABS","ABS","-","*",null,null,"ABS","ABS","-",null,"ABS","ABS","-","*","-",null,null,"ABS","ABS","-",null,"ABS","ABS","-",""]
[null,69,null,null,null,null,"0011",null,"ABS","ABS","-",null,"ABS","ABS","-","*","0031",null,"ABS","ABS","-",null,"ABS","ABS","-","*","0051",null,"ABS","ABS","-",null,"ABS","ABS","-","*",null,null,"ABS","ABS","-",null,"ABS","ABS","-","*",null,null,"ABS","ABS","-",null,"ABS","ABS","-","*",null,null,"ABS","ABS","-",null,"ABS","ABS","-","*","-",null,null,"ABS","ABS","-",null,"ABS","ABS","-",""]
[null,70,null,null,null,null,"0011",null,"ABS","ABS","-",null,"ABS","ABS","-","*","0031",null,"ABS","ABS","-",null,"ABS","ABS","-","*","0051",null,"ABS","ABS","-",null,"ABS","ABS","-","*",null,null,"ABS","ABS","-",null,"ABS","ABS","-","*",null,null,"ABS","ABS","-",null,"ABS","ABS","-","*",null,null,"ABS","ABS","-",null,"ABS","ABS","-","*","-",null,null,"ABS","ABS","-",null,"ABS","ABS","-",""]
[null,71,null,null,null,null,"0011",null,"ABS","ABS","-",null,"ABS","ABS","-","*","0031",null,"ABS","ABS","-",null,"ABS","ABS","-","*","0051",null,"ABS","ABS","-",null,"ABS","ABS","-","*",null,null,"ABS","ABS","-",null,"ABS","ABS","-","*",null,null,"ABS","ABS","-",null,"ABS","ABS","-","*",null,null,"ABS","ABS","-",null,"ABS","ABS","-","*","-",null,null,"ABS","ABS","-",null,"ABS","ABS","-",""]
[null,72,null,null,null,null,"0011",null,"ABS","ABS","-",null,"ABS","ABS","-","*","0031",null,"ABS","ABS","-",null,"ABS","ABS","-","*","0051",null,"ABS","ABS","-",null,"ABS","ABS","-","*",null,null,"ABS","ABS","-",null,"ABS","ABS","-","*",null,null,"ABS","ABS","-",null,"ABS","ABS","-","*",null,null,"ABS","ABS","-",null,"ABS","ABS","-","*","-",null,null,"ABS","ABS","-",null,"ABS","ABS","-",""]
[null,73,null,null,null,null,"0011",null,"ABS","ABS","-",null,"ABS","ABS","-","*","0031",null,"ABS","ABS","-",null,"ABS","ABS","-","*","0051",null,"ABS","ABS","-",null,"ABS","ABS","-","*",null,null,"ABS","ABS","-",null,"ABS","ABS","-","*",null,null,"ABS","ABS","-",null,"ABS","ABS","-","*",null,null,"ABS","ABS","-",null,"ABS","ABS","-","*","-",null,null,"ABS","ABS","-",null,"ABS","ABS","-",""]
[null,74,null,null,null,null,"0011",null,"ABS","ABS","-",null,"ABS","ABS","-","*","0031",null,"ABS","ABS","-",null,"ABS","ABS","-","*","0051",null,"ABS","ABS","-",null,"ABS","ABS","-","*",null,null,"ABS","ABS","-",null,"ABS","ABS","-","*",null,null,"ABS","ABS","-",null,"ABS","ABS","-","*",null,null,"ABS","ABS","-",null,"ABS","ABS","-","*","-",null,null,"ABS","ABS","-",null,"ABS","ABS","-",""]
[null,75,null,null,null,null,"0011",null,"ABS","ABS","-",null,"ABS","ABS","-","*","0031",null,"ABS","ABS","-",null,"ABS","ABS","-","*","0051",null,"ABS","ABS","-",null,"ABS","ABS","-","*",null,null,"ABS","ABS","-",null,"ABS","ABS","-","*",null,null,"ABS","ABS","-",null,"ABS","ABS","-","*",null,null,"ABS","ABS","-",null,"ABS","ABS","-","*","-",null,null,"ABS","ABS","-",null,"ABS","ABS","-",""]
[null,76,null,null,null,null,"0011",null,"ABS","ABS","-",null,"ABS","ABS","-","*","0031",null,"ABS","ABS","-",null,"ABS","ABS","-","*","0051",null,"ABS","ABS","-",null,"ABS","ABS","-","*",null,null,"ABS","ABS","-",null,"ABS","ABS","-","*",null,null,"ABS","ABS","-",null,"ABS","ABS","-","*",null,null,"ABS","ABS","-",null,"ABS","ABS","-","*","-",null,null,"ABS","ABS","-",null,"ABS","ABS","-",""]
[null,77,null,null,null,null,"0011",null,"ABS","ABS","-",null,"ABS","ABS","-","*","0031",null,"ABS","ABS","-",null,"ABS","ABS","-","*","0051",null,"ABS","ABS","-",null,"ABS","ABS","-","*",null,null,"ABS","ABS","-",null,"ABS","ABS","-","*",null,null,"ABS","ABS","-",null,"ABS","ABS","-","*",null,null,"ABS","ABS","-",null,"ABS","ABS","-","*","-",null,null,"ABS","ABS","-",null,"ABS","ABS","-",""]
[null,78,null,null,null,null,"0011",null,"ABS","ABS","-",null,"ABS","ABS","-","*","0031",null,"ABS","ABS","-",null,"ABS","ABS","-","*","0051",null,"ABS","ABS","-",null,"ABS","ABS","-","*",null,null,"ABS","ABS","-",null,"ABS","ABS","-","*",null,null,"ABS","ABS","-",null,"ABS","ABS","-","*",null,null,"ABS","ABS","-",null,"ABS","ABS","-","*","-",null,null,"ABS","ABS","-",null,"ABS","ABS","-",""]
[null,79,null,null,null,null,"0011",null,"ABS","ABS","-",null,"ABS","ABS","-","*","0031",null,"ABS","ABS","-",null,"ABS","ABS","-","*","0051",null,"ABS","ABS","-",null,"ABS","ABS","-","*",null,null,"ABS","ABS","-",null,"ABS","ABS","-","*",null,null,"ABS","ABS","-",null,"ABS","ABS","-","*",null,null,"ABS","ABS","-",null,"ABS","ABS","-","*","-",null,null,"ABS","ABS","-",null,"ABS","ABS","-",""]
[null,80,null,null,null,null,"0011",null,"ABS","ABS","-",null,"ABS","ABS","-","*","0031",null,"ABS","ABS","-",null,"ABS","ABS","-","*","0051",null,"ABS","ABS","-",null,"ABS","ABS","-","*",null,null,"ABS","ABS","-",null,"ABS","ABS","-","*",null,null,"ABS","ABS","-",null,"ABS","ABS","-","*",null,null,"ABS","ABS","-",null,"ABS","ABS","-","*","-",null,null,"ABS","ABS","-",null,"ABS","ABS","-",""]
[null,81,null,null,null,null,"0011",null,"ABS","ABS","-",null,"ABS","ABS","-","*","0031",null,"ABS","ABS","-",null,"ABS","ABS","-","*","0051",null,"ABS","ABS","-",null,"ABS","ABS","-","*",null,null,"ABS","ABS","-",null,"ABS","ABS","-","*",null,null,"ABS","ABS","-",null,"ABS","ABS","-","*",null,null,"ABS","ABS","-",null,"ABS","ABS","-","*","-",null,null,"ABS","ABS","-",null,"ABS","ABS","-",""]
[null,82,null,null,null,null,"0011",null,"ABS","ABS","-",null,"ABS","ABS","-","*","0031",null,"ABS","ABS","-",null,"ABS","ABS","-","*","0051",null,"ABS","ABS","-",null,"ABS","ABS","-","*",null,null,"ABS","ABS","-",null,"ABS","ABS","-","*",null,null,"ABS","ABS","-",null,"ABS","ABS","-","*",null,null,"ABS","ABS","-",null,"ABS","ABS","-","*","-",null,null,"ABS","ABS","-",null,"ABS","ABS","-",""]
[null,83,null,null,null,null,"0011",null,"ABS","ABS","-",null,"ABS","ABS","-","*","0031",null,"ABS","ABS","-",null,"ABS","ABS","-","*","0051",null,"ABS","ABS","-",null,"ABS","ABS","-","*",null,null,"ABS","ABS","-",null,"ABS","ABS","-","*",null,null,"ABS","ABS","-",null,"ABS","ABS","-","*",null,null,"ABS","ABS","-",null,"ABS","ABS","-","*","-",null,null,"ABS","ABS","-",null,"ABS","ABS","-",""]
[null,84,null,null,null,null,"0011",null,"ABS","ABS","-",null,"ABS","ABS","-","*","0031",null,"ABS","ABS","-",null,"ABS","ABS","-","*","0051",null,"ABS","ABS","-",null,"ABS","ABS","-","*",null,null,"ABS","ABS","-",null,"ABS","ABS","-","*",null,null,"ABS","ABS","-",null,"ABS","ABS","-","*",null,null,"ABS","ABS","-",null,"ABS","ABS","-","*","-",null,null,"ABS","ABS","-",null,"ABS","ABS","-",""]
[null,85,null,null,null,null,"0011",null,"ABS","ABS","-",null,"ABS","ABS","-","*","0031",null,"ABS","ABS","-",null,"ABS","ABS","-","*","0051",null,"ABS","ABS","-",null,"ABS","ABS","-","*",null,null,"ABS","ABS","-",null,"ABS","ABS","-","*",null,null,"ABS","ABS","-",null,"ABS","ABS","-","*",null,null,"ABS","ABS","-",null,"ABS","ABS","-","*","-",null,null,"ABS","ABS","-",null,"ABS","ABS","-",""]
[null,86,null,null,null,null,"0011",null,"ABS","ABS","-",null,"ABS","ABS","-","*","0031",null,"ABS","ABS","-",null,"ABS","ABS","-","*","0051",null,"ABS","ABS","-",null,"ABS","ABS","-","*",null,null,"ABS","ABS","-",null,"ABS","ABS","-","*",null,null,"ABS","ABS","-",null,"ABS","ABS","-","*",null,null,"ABS","ABS","-",null,"ABS","ABS","-","*","-",null,null,"ABS","ABS","-",null,"ABS","ABS","-",""]
[null,87,null,null,null,null,"0011",null,"ABS","ABS","-",null,"ABS","ABS","-","*","0031",null,"ABS","ABS","-",null,"ABS","ABS","-","*","0051",null,"ABS","ABS","-",null,"ABS","ABS","-","*",null,null,"ABS","ABS","-",null,"ABS","ABS","-","*",null,null,"ABS","ABS","-",null,"ABS","ABS","-","*",null,null,"ABS","ABS","-",null,"ABS","ABS","-","*","-",null,null,"ABS","ABS","-",null,"ABS","ABS","-",""]
[null,88,null,null,null,null,"0011",null,"ABS","ABS","-",null,"ABS","ABS","-","*","0031",null,"ABS","ABS","-",null,"ABS","ABS","-","*","0051",null,"ABS","ABS","-",null,"ABS","ABS","-","*",null,null,"ABS","ABS","-",null,"ABS","ABS","-","*",null,null,"ABS","ABS","-",null,"ABS","ABS","-","*",null,null,"ABS","ABS","-",null,"ABS","ABS","-","*","-",null,null,"ABS","ABS","-",null,"ABS","ABS","-",""]
[null,89,null,null,null,null,"0011",null,"ABS","ABS","-",null,"ABS","ABS","-","*","0031",null,"ABS","ABS","-",null,"ABS","ABS","-","*","0051",null,"ABS","ABS","-",null,"ABS","ABS","-","*",null,null,"ABS","ABS","-",null,"ABS","ABS","-","*",null,null,"ABS","ABS","-",null,"ABS","ABS","-","*",null,null,"ABS","ABS","-",null,"ABS","ABS","-","*","-",null,null,"ABS","ABS","-",null,"ABS","ABS","-",""]
[null,90,null,null,null,null,"0011",null,"ABS","ABS","-",null,"ABS","ABS","-","*","0031",null,"ABS","ABS","-",null,"ABS","ABS","-","*","0051",null,"ABS","ABS","-",null,"ABS","ABS","-","*",null,null,"ABS","ABS","-",null,"ABS","ABS","-","*",null,null,"ABS","ABS","-",null,"ABS","ABS","-","*",null,null,"ABS","ABS","-",null,"ABS","ABS","-","*","-",null,null,"ABS","ABS","-",null,"ABS","ABS","-",""]
[null,91,null,null,null,null,"0011",null,"ABS","ABS","-",null,"ABS","ABS","-","*","0031",null,"ABS","ABS","-",null,"ABS","ABS","-","*","0051",null,"ABS","ABS","-",null,"ABS","ABS","-","*",null,null,"ABS","ABS","-",null,"ABS","ABS","-","*",null,null,"ABS","ABS","-",null,"ABS","ABS","-","*",null,null,"ABS","ABS","-",null,"ABS","ABS","-","*","-",null,null,"ABS","ABS","-",null,"ABS","ABS","-",""]
[null,92,null,null,null,null,"0011",null,"ABS","ABS","-",null,"ABS","ABS","-","*","0031",null,"ABS","ABS","-",null,"ABS","ABS","-","*","0051",null,"ABS","ABS","-",null,"ABS","ABS","-","*",null,null,"ABS","ABS","-",null,"ABS","ABS","-","*",null,null,"ABS","ABS","-",null,"ABS","ABS","-","*",null,null,"ABS","ABS","-",null,"ABS","ABS","-","*","-",null,null,"ABS","ABS","-",null,"ABS","ABS","-",""]
[null,93,null,null,null,null,"0011",null,"ABS","ABS","-",null,"ABS","ABS","-","*","0031",null,"ABS","ABS","-",null,"ABS","ABS","-","*","0051",null,"ABS","ABS","-",null,"ABS","ABS","-","*",null,null,"ABS","ABS","-",null,"ABS","ABS","-","*",null,null,"ABS","ABS","-",null,"ABS","ABS","-","*",null,null,"ABS","ABS","-",null,"ABS","ABS","-","*","-",null,null,"ABS","ABS","-",null,"ABS","ABS","-",""]
[null,94,null,null,null,null,"0011",null,"ABS","ABS","-",null,"ABS","ABS","-","*","0031",null,"ABS","ABS","-",null,"ABS","ABS","-","*","0051",null,"ABS","ABS","-",null,"ABS","ABS","-","*",null,null,"ABS","ABS","-",null,"ABS","ABS","-","*",null,null,"ABS","ABS","-",null,"ABS","ABS","-","*",null,null,"ABS","ABS","-",null,"ABS","ABS","-","*","-",null,null,"ABS","ABS","-",null,"ABS","ABS","-",""]
[null,95,null,null,null,null,"0011",null,"ABS","ABS","-",null,"ABS","ABS","-","*","0031",null,"ABS","ABS","-",null,"ABS","ABS","-","*","0051",null,"ABS","ABS","-",null,"ABS","ABS","-","*",null,null,"ABS","ABS","-",null,"ABS","ABS","-","*",null,null,"ABS","ABS","-",null,"ABS","ABS","-","*",null,null,"ABS","ABS","-",null,"ABS","ABS","-","*","-",null,null,"ABS","ABS","-",null,"ABS","ABS","-",""]
[null,96,null,null,null,null,"0011",null,"ABS","ABS","-",null,"ABS","ABS","-","*","0031",null,"ABS","ABS","-",null,"ABS","ABS","-","*","0051",null,"ABS","ABS","-",null,"ABS","ABS","-","*",null,null,"ABS","ABS","-",null,"ABS","ABS","-","*",null,null,"ABS","ABS","-",null,"ABS","ABS","-","*",null,null,"ABS","ABS","-",null,"ABS","ABS","-","*","-",null,null,"ABS","ABS","-",null,"ABS","ABS","-",""]
[null,97,null,null,null,null,"0011",null,"ABS","ABS","-",null,"ABS","ABS","-","*","0031",null,"ABS","ABS","-",null,"ABS","ABS","-","*","0051",null,"ABS","ABS","-",null,"ABS","ABS","-","*",null,null,"ABS","ABS","-",null,"ABS","ABS","-","*",null,null,"ABS","ABS","-",null,"ABS","ABS","-","*",null,null,"ABS","ABS","-",null,"ABS","ABS","-","*","-",null,null,"ABS","ABS","-",null,"ABS","ABS","-",""]
[null,98,null,null,null,null,"0011",null,"ABS","ABS","-",null,"ABS","ABS","-","*","0031",null,"ABS","ABS","-",null,"ABS","ABS","-","*","0051",null,"ABS","ABS","-",null,"ABS","ABS","-","*",null,null,"ABS","ABS","-",null,"ABS","ABS","-","*",null,null,"ABS","ABS","-",null,"ABS","ABS","-","*",null,null,"ABS","ABS","-",null,"ABS","ABS","-","*","-",null,null,"ABS","ABS","-",null,"ABS","ABS","-",""]
[null,99,null,null,null,null,"0011",null,"ABS","ABS","-",null,"ABS","ABS","-","*","0031",null,"ABS","ABS","-",null,"ABS","ABS","-","*","0051",null,"ABS","ABS","-",null,"ABS","ABS","-","*",null,null,"ABS","ABS","-",null,"ABS","ABS","-","*",null,null,"ABS","ABS","-",null,"ABS","ABS","-","*",null,null,"ABS","ABS","-",null,"ABS","ABS","-","*","-",null,null,"ABS","ABS","-",null,"ABS","ABS","-",""]
[null,100,null,null,null,null,"0011",null,"ABS","ABS","-",null,"ABS","ABS","-","*","0031",null,"ABS","ABS","-",null,"ABS","ABS","-","*","0051",null,"ABS","ABS","-",null,"ABS","ABS","-","*",null,null,"ABS","ABS","-",null,"ABS","ABS","-","*",null,null,"ABS","ABS","-",null,"ABS","ABS","-","*",null,null,"ABS","ABS","-",null,"ABS","ABS","-","*","-",null,null,"ABS","ABS","-",null,"ABS","ABS","-",""]
[null,101,null,null,null,null,"0011",null,"ABS","ABS","-",null,"ABS","ABS","-","*","0031",null,"ABS","ABS","-",null,"ABS","ABS","-","*","0051",null,"ABS","ABS","-",null,"ABS","ABS","-","*",null,null,"ABS","ABS","-",null,"ABS","ABS","-","*",null,null,"ABS","ABS","-",null,"ABS","ABS","-","*",null,null,"ABS","ABS","-",null,"ABS","ABS","-","*","-",null,null,"ABS","ABS","-",null,"ABS","ABS","-",""]
[null,102,null,null,null,null,"0011",null,"ABS","ABS","-",null,"ABS","ABS","-","*","0031",null,"ABS","ABS","-",null,"ABS","ABS","-","*","0051",null,"ABS","ABS","-",null,"ABS","ABS","-","*",null,null,"ABS","ABS","-",null,"ABS","ABS","-","*",null,null,"ABS","ABS","-",null,"ABS","ABS","-","*",null,null,"ABS","ABS","-",null,"ABS","ABS","-","*","-",null,null,"ABS","ABS","-",null,"ABS","ABS","-",""]
[null,103,null,null,null,null,"0011",null,"ABS","ABS","-",null,"ABS","ABS","-","*","0031",null,"ABS","ABS","-",null,"ABS","ABS","-","*","0051",null,"ABS","ABS","-",null,"ABS","ABS","-","*",null,null,"ABS","ABS","-",null,"ABS","ABS","-","*",null,null,"ABS","ABS","-",null,"ABS","ABS","-","*",null,null,"ABS","ABS","-",null,"ABS","ABS","-","*","-",null,null,"ABS","ABS","-",null,"ABS","ABS","-",""]
[null,104,null,null,null,null,"0011",null,"ABS","ABS","-",null,"ABS","ABS","-","*","0031",null,"ABS","ABS","-",null,"ABS","ABS","-","*","0051",null,"ABS","ABS","-",null,"ABS","ABS","-","*",null,null,"ABS","ABS","-",null,"ABS","ABS","-","*",null,null,"ABS","ABS","-",null,"ABS","ABS","-","*",null,null,"ABS","ABS","-",null,"ABS","ABS","-","*","-",null,null,"ABS","ABS","-",null,"ABS","ABS","-",""]
[null,105,null,null,null,null,"0011",null,"ABS","ABS","-",null,"ABS","ABS","-","*","0031",null,"ABS","ABS","-",null,"ABS","ABS","-","*","0051",null,"ABS","ABS","-",null,"ABS","ABS","-","*",null,null,"ABS","ABS","-",null,"ABS","ABS","-","*",null,null,"ABS","ABS","-",null,"ABS","ABS","-","*",null,null,"ABS","ABS","-",null,"ABS","ABS","-","*","-",null,null,"ABS","ABS","-",null,"ABS","ABS","-",""]
[null,106,null,null,null,null,"0011",null,"ABS","ABS","-",null,"ABS","ABS","-","*","0031",null,"ABS","ABS","-",null,"ABS","ABS","-","*","0051",null,"ABS","ABS","-",null,"ABS","ABS","-","*",null,null,"ABS","ABS","-",null,"ABS","ABS","-","*",null,null,"ABS","ABS","-",null,"ABS","ABS","-","*",null,null,"ABS","ABS","-",null,"ABS","ABS","-","*","-",null,null,"ABS","ABS","-",null,"ABS","ABS","-",""]
[null,107,null,null,null,null,"0011",null,"ABS","ABS","-",null,"ABS","ABS","-","*","0031",null,"ABS","ABS","-",null,"ABS","ABS","-","*","0051",null,"ABS","ABS","-",null,"ABS","ABS","-","*",null,null,"ABS","ABS","-",null,"ABS","ABS","-","*",null,null,"ABS","ABS","-",null,"ABS","ABS","-","*",null,null,"ABS","ABS","-",null,"ABS","ABS","-","*","-",null,null,"ABS","ABS","-",null,"ABS","ABS","-",""]
[null,108,null,null,null,null,"0011",null,"ABS","ABS","-",null,"ABS","ABS","-","*","0031",null,"ABS","ABS","-",null,"ABS","ABS","-","*","0051",null,"ABS","ABS","-",null,"ABS","ABS","-","*",null,null,"ABS","ABS","-",null,"ABS","ABS","-","*",null,null,"ABS","ABS","-",null,"ABS","ABS","-","*",null,null,"ABS","ABS","-",null,"ABS","ABS","-","*","-",null,null,"ABS","ABS","-",null,"ABS","ABS","-",""]
[null,109,null,null,null,null,"0011",null,"ABS","ABS","-",null,"ABS","ABS","-","*","0031",null,"ABS","ABS","-",null,"ABS","ABS","-","*","0051",null,"ABS","ABS","-",null,"ABS","ABS","-","*",null,null,"ABS","ABS","-",null,"ABS","ABS","-","*",null,null,"ABS","ABS","-",null,"ABS","ABS","-","*",null,null,"ABS","ABS","-",null,"ABS","ABS","-","*","-",null,null,"ABS","ABS","-",null,"ABS","ABS","-",""]
[null,110,null,null,null,null,"0011",null,"ABS","ABS","-",null,"ABS","ABS","-","*","0031",null,"ABS","ABS","-",null,"ABS","ABS","-","*","0051",null,"ABS","ABS","-",null,"ABS","ABS","-","*",null,null,"ABS","ABS","-",null,"ABS","ABS","-","*",null,null,"ABS","ABS","-",null,"ABS","ABS","-","*",null,null,"ABS","ABS","-",null,"ABS","ABS","-","*","-",null,null,"ABS","ABS","-",null,"ABS","ABS","-",""]
[null,111,null,null,null,null,"0011",null,"ABS","ABS","-",null,"ABS","ABS","-","*","0031",null,"ABS","ABS","-",null,"ABS","ABS","-","*","0051",null,"ABS","ABS","-",null,"ABS","ABS","-","*",null,null,"ABS","ABS","-",null,"ABS","ABS","-","*",null,null,"ABS","ABS","-",null,"ABS","ABS","-","*",null,null,"ABS","ABS","-",null,"ABS","ABS","-","*","-",null,null,"ABS","ABS","-",null,"ABS","ABS","-",""]
[null,112,null,null,null,null,"0011",null,"ABS","ABS","-",null,"ABS","ABS","-","*","0031",null,"ABS","ABS","-",null,"ABS","ABS","-","*","0051",null,"ABS","ABS","-",null,"ABS","ABS","-","*",null,null,"ABS","ABS","-",null,"ABS","ABS","-","*",null,null,"ABS","ABS","-",null,"ABS","ABS","-","*",null,null,"ABS","ABS","-",null,"ABS","ABS","-","*","-",null,null,"ABS","ABS","-",null,"ABS","ABS","-",""]
[null,113,null,null,null,null,"0011",null,"ABS","ABS","-",null,"ABS","ABS","-","*","0031",null,"ABS","ABS","-",null,"ABS","ABS","-","*","0051",null,"ABS","ABS","-",null,"ABS","ABS","-","*",null,null,"ABS","ABS","-",null,"ABS","ABS","-","*",null,null,"ABS","ABS","-",null,"ABS","ABS","-","*",null,null,"ABS","ABS","-",null,"ABS","ABS","-","*","-",null,null,"ABS","ABS","-",null,"ABS","ABS","-",""]
[null,114,null,null,null,null,"0011",null,"ABS","ABS","-",null,"ABS","ABS","-","*","0031",null,"ABS","ABS","-",null,"ABS","ABS","-","*","0051",null,"ABS","ABS","-",null,"ABS","ABS","-","*",null,null,"ABS","ABS","-",null,"ABS","ABS","-","*",null,null,"ABS","ABS","-",null,"ABS","ABS","-","*",null,null,"ABS","ABS","-",null,"ABS","ABS","-","*","-",null,null,"ABS","ABS","-",null,"ABS","ABS","-",""]
[null,115,null,null,null,null,"0011",null,"ABS","ABS","-",null,"ABS","ABS","-","*","0031",null,"ABS","ABS","-",null,"ABS","ABS","-","*","0051",null,"ABS","ABS","-",null,"ABS","ABS","-","*",null,null,"ABS","ABS","-",null,"ABS","ABS","-","*",null,null,"ABS","ABS","-",null,"ABS","ABS","-","*",null,null,"ABS","ABS","-",null,"ABS","ABS","-","*","-",null,null,"ABS","ABS","-",null,"ABS","ABS","-",""]
[null,116,null,null,null,null,"0011",null,"ABS","ABS","-",null,"ABS","ABS","-","*","0031",null,"ABS","ABS","-",null,"ABS","ABS","-","*","0051",null,"ABS","ABS","-",null,"ABS","ABS","-","*",null,null,"ABS","ABS","-",null,"ABS","ABS","-","*",null,null,"ABS","ABS","-",null,"ABS","ABS","-","*",null,null,"ABS","ABS","-",null,"ABS","ABS","-","*","-",null,null,"ABS","ABS","-",null,"ABS","ABS","-",""]
[null,117,null,null,null,null,"0011",null,"ABS","ABS","-",null,"ABS","ABS","-","*","0031",null,"ABS","ABS","-",null,"ABS","ABS","-","*","0051",null,"ABS","ABS","-",null,"ABS","ABS","-","*",null,null,"ABS","ABS","-",null,"ABS","ABS","-","*",null,null,"ABS","ABS","-",null,"ABS","ABS","-","*",null,null,"ABS","ABS","-",null,"ABS","ABS","-","*","-",null,null,"ABS","ABS","-",null,"ABS","ABS","-",""]
[null,118,null,null,null,null,"0011",null,"ABS","ABS","-",null,"ABS","ABS","-","*","0031",null,"ABS","ABS","-",null,"ABS","ABS","-","*","0051",null,"ABS","ABS","-",null,"ABS","ABS","-","*",null,null,"ABS","ABS","-",null,"ABS","ABS","-","*",null,null,"ABS","ABS","-",null,"ABS","ABS","-","*",null,null,"ABS","ABS","-",null,"ABS","ABS","-","*","-",null,null,"ABS","ABS","-",null,"ABS","ABS","-",""]
[null,119,null,null,null,null,"0011",null,"ABS","ABS","-",null,"ABS","ABS","-","*","0031",null,"ABS","ABS","-",null,"ABS","ABS","-","*","0051",null,"ABS","ABS","-",null,"ABS","ABS","-","*",null,null,"ABS","ABS","-",null,"ABS","ABS","-","*",null,null,"ABS","ABS","-",null,"ABS","ABS","-","*",null,null,"ABS","ABS","-",null,"ABS","ABS","-","*","-",null,null,"ABS","ABS","-",null,"ABS","ABS","-",""]
[null,120,null,null,null,null,"0011",null,"ABS","ABS","-",null,"ABS","ABS","-","*","0031",null,"ABS","ABS","-",null,"ABS","ABS","-","*","0051",null,"ABS","ABS","-",null,"ABS","ABS","-","*",null,null,"ABS","ABS","-",null,"ABS","ABS","-","*",null,null,"ABS","ABS","-",null,"ABS","ABS","-","*",null,null,"ABS","ABS","-",null,"ABS","ABS","-","*","-",null,null,"ABS","ABS","-",null,"ABS","ABS","-",""]
[null,121,null,null,null,null,"0011",null,"ABS","ABS","-",null,"ABS","ABS","-","*","0031",null,"ABS","ABS","-",null,"ABS","ABS","-","*","0051",null,"ABS","ABS","-",null,"ABS","ABS","-","*",null,null,"ABS","ABS","-",null,"ABS","ABS","-","*",null,null,"ABS","ABS","-",null,"ABS","ABS","-","*",null,null,"ABS","ABS","-",null,"ABS","ABS","-","*","-",null,null,"ABS","ABS","-",null,"ABS","ABS","-",""]
[null,122,null,null,null,null,"0011",null,"ABS","ABS","-",null,"ABS","ABS","-","*","0031",null,"ABS","ABS","-",null,"ABS","ABS","-","*","0051",null,"ABS","ABS","-",null,"ABS","ABS","-","*",null,null,"ABS","ABS","-",null,"ABS","ABS","-","*",null,null,"ABS","ABS","-",null,"ABS","ABS","-","*",null,null,"ABS","ABS","-",null,"ABS","ABS","-","*","-",null,null,"ABS","ABS","-",null,"ABS","ABS","-",""]
[null,123,null,null,null,null,"0011",null,"ABS","ABS","-",null,"ABS","ABS","-","*","0031",null,"ABS","ABS","-",null,"ABS","ABS","-","*","0051",null,"ABS","ABS","-",null,"ABS","ABS","-","*",null,null,"ABS","ABS","-",null,"ABS","ABS","-","*",null,null,"ABS","ABS","-",null,"ABS","ABS","-","*",null,null,"ABS","ABS","-",null,"ABS","ABS","-","*","-",null,null,"ABS","ABS","-",null,"ABS","ABS","-",""]
[null,124,null,null,null,null,"0011",null,"ABS","ABS","-",null,"ABS","ABS","-","*","0031",null,"ABS","ABS","-",null,"ABS","ABS","-","*","0051",null,"ABS","ABS","-",null,"ABS","ABS","-","*",null,null,"ABS","ABS","-",null,"ABS","ABS","-","*",null,null,"ABS","ABS","-",null,"ABS","ABS","-","*",null,null,"ABS","ABS","-",null,"ABS","ABS","-","*","-",null,null,"ABS","ABS","-",null,"ABS","ABS","-",""]
[null,125,null,null,null,null,"0011",null,"ABS","ABS","-",null,"ABS","ABS","-","*","0031",null,"ABS","ABS","-",null,"ABS","ABS","-","*","0051",null,"ABS","ABS","-",null,"ABS","ABS","-","*",null,null,"ABS","ABS","-",null,"ABS","ABS","-","*",null,null,"ABS","ABS","-",null,"ABS","ABS","-","*",null,null,"ABS","ABS","-",null,"ABS","ABS","-","*","-",null,null,"ABS","ABS","-",null,"ABS","ABS","-",""]
[null,126,null,null,null,null,"0011",null,"ABS","ABS","-",null,"ABS","ABS","-","*","0031",null,"ABS","ABS","-",null,"ABS","ABS","-","*","0051",null,"ABS","ABS","-",null,"ABS","ABS","-","*",null,null,"ABS","ABS","-",null,"ABS","ABS","-","*",null,null,"ABS","ABS","-",null,"ABS","ABS","-","*",null,null,"ABS","ABS","-",null,"ABS","ABS","-","*","-",null,null,"ABS","ABS","-",null,"ABS","ABS","-",""]
[null,127,null,null,null,null,"0011",null,"ABS","ABS","-",null,"ABS","ABS","-","*","0031",null,"ABS","ABS","-",null,"ABS","ABS","-","*","0051",null,"ABS","ABS","-",null,"ABS","ABS","-","*",null,null,"ABS","ABS","-",null,"ABS","ABS","-","*",null,null,"ABS","ABS","-",null,"ABS","ABS","-","*",null,null,"ABS","ABS","-",null,"ABS","ABS","-","*","-",null,null,"ABS","ABS","-",null,"ABS","ABS","-",""]
[null,128,null,null,null,null,"0011",null,"ABS","ABS","-",null,"ABS","ABS","-","*","0031",null,"ABS","ABS","-",null,"ABS","ABS","-","*","0051",null,"ABS","ABS","-",null,"ABS","ABS","-","*",null,null,"ABS","ABS","-",null,"ABS","ABS","-","*",null,null,"ABS","ABS","-",null,"ABS","ABS","-","*",null,null,"ABS","ABS","-",null,"ABS","ABS","-","*","-",null,null,"ABS","ABS","-",null,"ABS","ABS","-",""]
[null,129,null,null,null,null,"0011",null,"ABS","ABS","-",null,"ABS","ABS","-","*","0031",null,"ABS","ABS","-",null,"ABS","ABS","-","*","0051",null,"ABS","ABS","-",null,"ABS","ABS","-","*",null,null,"ABS","ABS","-",null,"ABS","ABS","-","*",null,null,"ABS","ABS","-",null,"ABS","ABS","-","*",null,null,"ABS","ABS","-",null,"ABS","ABS","-","*","-",null,null,"ABS","ABS","-",null,"ABS","ABS","-",""]
[null,130,null,null,null,null,"0011",null,{"$f":"IF(H134/H$4>=0.9,\"A+\",IF(H134/H$4>=0.8,\"A\",IF(H134/H$4>=0.7,\"B+\",IF(H134/H$4>=0.6,\"B\",IF(H134/H$4>=0.5,\"C+\",IF(H134/H$4>=0.4,\"C\",IF(H134/H$4>=0.35,\"D\",IF(H134/H$4>0,\"NG\",\"ABS\"))))))))","v":"ABS"},{"$f":"IF(I134=\"A+\",4,IF(I134=\"A\",3.6,IF(I134=\"B+\",3.2,IF(I134=\"B\",2.8,IF(I134=\"C+\",2.4,IF(I134=\"C\",2,IF(I134=\"D\",1.6,IF(I134=\"NG\",\"-\",\"ABS\"))))))))","v":"ABS"},{"$f":"IFERROR($K$4*J134,\"-\")","v":"-"},null,{"$f":"IF(L134/L$4>=0.9,\"A+\",IF(L134/L$4>=0.8,\"A\",IF(L134/L$4>=0.7,\"B+\",IF(L134/L$4>=0.6,\"B\",IF(L134/L$4>=0.5,\"C+\",IF(L134/L$4>=0.4,\"C\",IF(L134/L$4>0,\"NG\",\"ABS\")))))))","v":"ABS"},{"$f":"IF(M134=\"A+\",4,IF(M134=\"A\",3.6,IF(M134=\"B+\",3.2,IF(M134=\"B\",2.8,IF(M134=\"C+\",2.4,IF(M134=\"C\",2,IF(M134=\"D\",1.6,IF(M134=\"NG\",\"-\",\"ABS\"))))))))","v":"ABS"},{"$f":"IFERROR($O$4*N134,\"-\")","v":"-"},{"$f":"IFERROR(IF((K134+O134)/($K$4+$O$4)>3.6,\"A+\",IF((K134+O134)/($K$4+$O$4)>3.2,\"A\",IF((K134+O134)/($K$4+$O$4)>2.8,\"B+\",IF((K134+O134)/($K$4+$O$4)>2.4,\"B\",IF((K134+O134)/($K$4+$O$4)>2,\"C+\",IF((K134+O134)/($K$4+$O$4)>1.6,\"C\",IF((K134+O134)/($K$4+$O$4)=1.6,\"D\",IF((K134+O134)/($K$4+$O$4)<1.6,\"NG\",\"\")))))))),\"*\")","v":"*"},"0031",null,{"$f":"IF(R134/R$4>=0.9,\"A+\",IF(R134/R$4>=0.8,\"A\",IF(R134/R$4>=0.7,\"B+\",IF(R134/R$4>=0.6,\"B\",IF(R134/R$4>=0.5,\"C+\",IF(R134/R$4>=0.4,\"C\",IF(R134/R$4>=0.35,\"D\",IF(R134/R$4>0,\"NG\",\"ABS\"))))))))","v":"ABS"},{"$f":"IF(S134=\"A+\",4,IF(S134=\"A\",3.6,IF(S134=\"B+\",3.2,IF(S134=\"B\",2.8,IF(S134=\"C+\",2.4,IF(S134=\"C\",2,IF(S134=\"D\",1.6,IF(S134=\"NG\",\"-\",\"ABS\"))))))))","v":"ABS"},{"$f":"IFERROR($U$4*T134,\"-\")","v":"-"},null,{"$f":"IF(V134/V$4>=0.9,\"A+\",IF(V134/V$4>=0.8,\"A\",IF(V134/V$4>=0.7,\"B+\",IF(V134/V$4>=0.6,\"B\",IF(V134/V$4>=0.5,\"C+\",IF(V134/V$4>=0.4,\"C\",IF(V134/V$4>0,\"NG\",\"ABS\")))))))","v":"ABS"},{"$f":"IF(W134=\"A+\",4,IF(W134=\"A\",3.6,IF(W134=\"B+\",3.2,IF(W134=\"B\",2.8,IF(W134=\"C+\",2.4,IF(W134=\"C\",2,IF(W134=\"D\",1.6,IF(W134=\"NG\",\"-\",\"ABS\"))))))))","v":"ABS"},{"$f":"IFERROR($Y$4*X134,\"-\")","v":"-"},{"$f":"IFERROR(IF((U134+Y134)/($U$4+$Y$4)>3.6,\"A+\",IF((U134+Y134)/($U$4+$Y$4)>3.2,\"A\",IF((U134+Y134)/($U$4+$Y$4)>2.8,\"B+\",IF((U134+Y134)/($U$4+$Y$4)>2.4,\"B\",IF((U134+Y134)/($U$4+$Y$4)>2,\"C+\",IF((U134+Y134)/($U$4+$Y$4)>1.6,\"C\",IF((U134+Y134)/($U$4+$Y$4)=1.6,\"D\",IF((U134+Y134)/($U$4+$Y$4)<1.6,\"NG\",\"\")))))))),\"*\")","v":"*"},"0051",null,{"$f":"IF(AB134/AB$4>=0.9,\"A+\",IF(AB134/AB$4>=0.8,\"A\",IF(AB134/AB$4>=0.7,\"B+\",IF(AB134/AB$4>=0.6,\"B\",IF(AB134/AB$4>=0.5,\"C+\",IF(AB134/AB$4>=0.4,\"C\",IF(AB134/AB$4>=0.35,\"D\",IF(AB134/AB$4>0,\"NG\",\"ABS\"))))))))","v":"ABS"},{"$f":"IF(AC134=\"A+\",4,IF(AC134=\"A\",3.6,IF(AC134=\"B+\",3.2,IF(AC134=\"B\",2.8,IF(AC134=\"C+\",2.4,IF(AC134=\"C\",2,IF(AC134=\"D\",1.6,IF(AC134=\"NG\",\"-\",\"ABS\"))))))))","v":"ABS"},{"$f":"IFERROR($AE$4*AD134,\"-\")","v":"-"},null,{"$f":"IF(AF134/AF$4>=0.9,\"A+\",IF(AF134/AF$4>=0.8,\"A\",IF(AF134/AF$4>=0.7,\"B+\",IF(AF134/AF$4>=0.6,\"B\",IF(AF134/AF$4>=0.5,\"C+\",IF(AF134/AF$4>=0.4,\"C\",IF(AF134/AF$4>0,\"NG\",\"ABS\")))))))","v":"ABS"},{"$f":"IF(AG134=\"A+\",4,IF(AG134=\"A\",3.6,IF(AG134=\"B+\",3.2,IF(AG134=\"B\",2.8,IF(AG134=\"C+\",2.4,IF(AG134=\"C\",2,IF(AG134=\"D\",1.6,IF(AG134=\"NG\",\"-\",\"ABS\"))))))))","v":"ABS"},{"$f":"IFERROR($AI$4*AH134,\"-\")","v":"-"},{"$f":"IFERROR(IF((AE134+AI134)/($AE$4+$AI$4)>3.6,\"A+\",IF((AE134+AI134)/($AE$4+$AI$4)>3.2,\"A\",IF((AE134+AI134)/($AE$4+$AI$4)>2.8,\"B+\",IF((AE134+AI134)/($AE$4+$AI$4)>2.4,\"B\",IF((AE134+AI134)/($AE$4+$AI$4)>2,\"C+\",IF((AE134+AI134)/($AE$4+$AI$4)>1.6,\"C\",IF((AE134+AI134)/($AE$4+$AI$4)=1.6,\"D\",IF((AE134+AI134)/($AE$4+$AI$4)<1.6,\"NG\",\"\")))))))),\"*\")","v":"*"},null,null,{"$f":"IF(AL134/AL$4>=0.9,\"A+\",IF(AL134/AL$4>=0.8,\"A\",IF(AL134/AL$4>=0.7,\"B+\",IF(AL134/AL$4>=0.6,\"B\",IF(AL134/AL$4>=0.5,\"C+\",IF(AL134/AL$4>=0.4,\"C\",IF(AL134/AL$4>=0.35,\"D\",IF(AL134/AL$4>0,\"NG\",\"ABS\"))))))))","v":"ABS"},{"$f":"IF(AM134=\"A+\",4,IF(AM134=\"A\",3.6,IF(AM134=\"B+\",3.2,IF(AM134=\"B\",2.8,IF(AM134=\"C+\",2.4,IF(AM134=\"C\",2,IF(AM134=\"D\",1.6,IF(AM134=\"NG\",\"-\",\"ABS\"))))))))","v":"ABS"},{"$f":"IFERROR($AO$4*AN134,\"-\")","v":"-"},null,{"$f":"IF(AP134/AP$4>=0.9,\"A+\",IF(AP134/AP$4>=0.8,\"A\",IF(AP134/AP$4>=0.7,\"B+\",IF(AP134/AP$4>=0.6,\"B\",IF(AP134/AP$4>=0.5,\"C+\",IF(AP134/AP$4>=0.4,\"C\",IF(AP134/AP$4>0,\"NG\",\"ABS\")))))))","v":"ABS"},{"$f":"IF(AQ134=\"A+\",4,IF(AQ134=\"A\",3.6,IF(AQ134=\"B+\",3.2,IF(AQ134=\"B\",2.8,IF(AQ134=\"C+\",2.4,IF(AQ134=\"C\",2,IF(AQ134=\"D\",1.6,IF(AQ134=\"NG\",\"-\",\"ABS\"))))))))","v":"ABS"},{"$f":"IFERROR($AS$4*AR134,\"-\")","v":"-"},{"$f":"IFERROR(IF((AO134+AS134)/($AO$4+$AS$4)>3.6,\"A+\",IF((AO134+AS134)/($AO$4+$AS$4)>3.2,\"A\",IF((AO134+AS134)/($AO$4+$AS$4)>2.8,\"B+\",IF((AO134+AS134)/($AO$4+$AS$4)>2.4,\"B\",IF((AO134+AS134)/($AO$4+$AS$4)>2,\"C+\",IF((AO134+AS134)/($AO$4+$AS$4)>1.6,\"C\",IF((AO134+AS134)/($AO$4+$AS$4)=1.6,\"D\",IF((AO134+AS134)/($AO$4+$AS$4)<1.6,\"NG\",\"\")))))))),\"*\")","v":"*"},null,null,{"$f":"IF(AV134/AV$4>=0.9,\"A+\",IF(AV134/AV$4>=0.8,\"A\",IF(AV134/AV$4>=0.7,\"B+\",IF(AV134/AV$4>=0.6,\"B\",IF(AV134/AV$4>=0.5,\"C+\",IF(AV134/AV$4>=0.4,\"C\",IF(AV134/AV$4>=0.35,\"D\",IF(AV134/AV$4>0,\"NG\",\"ABS\"))))))))","v":"ABS"},{"$f":"IF(AW134=\"A+\",4,IF(AW134=\"A\",3.6,IF(AW134=\"B+\",3.2,IF(AW134=\"B\",2.8,IF(AW134=\"C+\",2.4,IF(AW134=\"C\",2,IF(AW134=\"D\",1.6,IF(AW134=\"NG\",\"-\",\"ABS\"))))))))","v":"ABS"},{"$f":"IFERROR($AY$4*AX134,\"-\")","v":"-"},null,{"$f":"IF(AZ134/AZ$4>=0.9,\"A+\",IF(AZ134/AZ$4>=0.8,\"A\",IF(AZ134/AZ$4>=0.7,\"B+\",IF(AZ134/AZ$4>=0.6,\"B\",IF(AZ134/AZ$4>=0.5,\"C+\",IF(AZ134/AZ$4>=0.4,\"C\",IF(AZ134/AZ$4>0,\"NG\",\"ABS\")))))))","v":"ABS"},{"$f":"IF(BA134=\"A+\",4,IF(BA134=\"A\",3.6,IF(BA134=\"B+\",3.2,IF(BA134=\"B\",2.8,IF(BA134=\"C+\",2.4,IF(BA134=\"C\",2,IF(BA134=\"D\",1.6,IF(BA134=\"NG\",\"-\",\"ABS\"))))))))","v":"ABS"},{"$f":"IFERROR($BC$4*BB134,\"-\")","v":"-"},{"$f":"IFERROR(IF((AY134+BC134)/($AY$4+$BC$4)>3.6,\"A+\",IF((AY134+BC134)/($AY$4+$BC$4)>3.2,\"A\",IF((AY134+BC134)/($AY$4+$BC$4)>2.8,\"B+\",IF((AY134+BC134)/($AY$4+$BC$4)>2.4,\"B\",IF((AY134+BC134)/($AY$4+$BC$4)>2,\"C+\",IF((AY134+BC134)/($AY$4+$BC$4)>1.6,\"C\",IF((AY134+BC134)/($AY$4+$BC$4)=1.6,\"D\",IF((AY134+BC134)/($AY$4+$BC$4)<1.6,\"NG\",\"\")))))))),\"*\")","v":"*"},null,null,{"$f":"IF(BF134/BF$4>=0.9,\"A+\",IF(BF134/BF$4>=0.8,\"A\",IF(BF134/BF$4>=0.7,\"B+\",IF(BF134/BF$4>=0.6,\"B\",IF(BF134/BF$4>=0.5,\"C+\",IF(BF134/BF$4>=0.4,\"C\",IF(BF134/BF$4>=0.35,\"D\",IF(BF134/BF$4>0,\"NG\",\"ABS\"))))))))","v":"ABS"},{"$f":"IF(BG134=\"A+\",4,IF(BG134=\"A\",3.6,IF(BG134=\"B+\",3.2,IF(BG134=\"B\",2.8,IF(BG134=\"C+\",2.4,IF(BG134=\"C\",2,IF(BG134=\"D\",1.6,IF(BG134=\"NG\",\"-\",\"ABS\"))))))))","v":"ABS"},{"$f":"IFERROR($BI$4*BH134,\"-\")","v":"-"},null,{"$f":"IF(BJ134/BJ$4>=0.9,\"A+\",IF(BJ134/BJ$4>=0.8,\"A\",IF(BJ134/BJ$4>=0.7,\"B+\",IF(BJ134/BJ$4>=0.6,\"B\",IF(BJ134/BJ$4>=0.5,\"C+\",IF(BJ134/BJ$4>=0.4,\"C\",IF(BJ134/BJ$4>0,\"NG\",\"ABS\")))))))","v":"ABS"},{"$f":"IF(BK134=\"A+\",4,IF(BK134=\"A\",3.6,IF(BK134=\"B+\",3.2,IF(BK134=\"B\",2.8,IF(BK134=\"C+\",2.4,IF(BK134=\"C\",2,IF(BK134=\"D\",1.6,IF(BK134=\"NG\",\"-\",\"ABS\"))))))))","v":"ABS"},{"$f":"IFERROR($BM$4*BL134,\"-\")","v":"-"},{"$f":"IFERROR(IF((BI134+BM134)/($BI$4+$BM$4)>3.6,\"A+\",IF((BI134+BM134)/($BI$4+$BM$4)>3.2,\"A\",IF((BI134+BM134)/($BI$4+$BM$4)>2.8,\"B+\",IF((BI134+BM134)/($BI$4+$BM$4)>2.4,\"B\",IF((BI134+BM134)/($BI$4+$BM$4)>2,\"C+\",IF((BI134+BM134)/($BI$4+$BM$4)>1.6,\"C\",IF((BI134+BM134)/($BI$4+$BM$4)=1.6,\"D\",IF((BI134+BM134)/($BI$4+$BM$4)<1.6,\"NG\",\"\")))))))),\"*\")","v":"*"},{"$f":"IFERROR((K134+O134+U134+Y134+AE134+AI134+AO134+AS134+AY134+BC134+BI134+BM134)/($K$4+$O$4+$U$4+$Y$4+$AE$4+$AI$4+$AO$4+$AS$4+$AY$4+$BC$4+$BI$4+$BM$4),\"-\")","v":"-"},null,null,{"$f":"IF(BQ134/BQ$4>=0.9,\"A+\",IF(BQ134/BQ$4>=0.8,\"A\",IF(BQ134/BQ$4>=0.7,\"B+\",IF(BQ134/BQ$4>=0.6,\"B\",IF(BQ134/BQ$4>=0.5,\"C+\",IF(BQ134/BQ$4>=0.4,\"C\",IF(BQ134/BQ$4>=0.35,\"D\",IF(BQ134/BQ$4>0,\"NG\",\"ABS\"))))))))","v":"ABS"},{"$f":"IF(BR134=\"A+\",4,IF(BR134=\"A\",3.6,IF(BR134=\"B+\",3.2,IF(BR134=\"B\",2.8,IF(BR134=\"C+\",2.4,IF(BR134=\"C\",2,IF(BR134=\"D\",1.6,IF(BR134=\"NG\",\"-\",\"ABS\"))))))))","v":"ABS"},{"$f":"IFERROR($BT$4*BS134,\"-\")","v":"-"},null,{"$f":"IF(BU134/BU$4>=0.9,\"A+\",IF(BU134/BU$4>=0.8,\"A\",IF(BU134/BU$4>=0.7,\"B+\",IF(BU134/BU$4>=0.6,\"B\",IF(BU134/BU$4>=0.5,\"C+\",IF(BU134/BU$4>=0.4,\"C\",IF(BU134/BU$4>0,\"NG\",\"ABS\")))))))","v":"ABS"},{"$f":"IF(BV134=\"A+\",4,IF(BV134=\"A\",3.6,IF(BV134=\"B+\",3.2,IF(BV134=\"B\",2.8,IF(BV134=\"C+\",2.4,IF(BV134=\"C\",2,IF(BV134=\"D\",1.6,IF(BV134=\"NG\",\"-\",\"ABS\"))))))))","v":"ABS"},{"$f":"IFERROR($BX$4*BW134,\"-\")","v":"-"},{"$f":"IFERROR(IF((BT134+BX134)/($BT$4+$BX$4)>3.6,\"A+\",IF((BT134+BX134)/($BT$4+$BX$4)>3.2,\"A\",IF((BT134+BX134)/($BT$4+$BX$4)>2.8,\"B+\",IF((BT134+BX134)/($BT$4+$BX$4)>2.4,\"B\",IF((BT134+BX134)/($BT$4+$BX$4)>2,\"C+\",IF((BT134+BX134)/($BT$4+$BX$4)>1.6,\"C\",IF((BT134+BX134)/($BT$4+$BX$4)=1.6,\"D\",IF((BT134+BX134)/($BT$4+$BX$4)<1.6,\"NG\",\"\")))))))),\"\")","v":""}]
[null,131,null,null,null,null,"0011",null,"ABS","ABS","-",null,"ABS","ABS","-","*","0031",null,"ABS","ABS","-",null,"ABS","ABS","-","*","0051",null,"ABS","ABS","-",null,"ABS","ABS","-","*",null,null,"ABS","ABS","-",null,"ABS","ABS","-","*",null,null,"ABS","ABS","-",null,"ABS","ABS","-","*",null,null,"ABS","ABS","-",null,"ABS","ABS","-","*","-",null,null,"ABS","ABS","-",null,"ABS","ABS","-",""]
[null,132,null,null,null,null,"0011",null,"ABS","ABS","-",null,"ABS","ABS","-","*","0031",null,"ABS","ABS","-",null,"ABS","ABS","-","*","0051",null,"ABS","ABS","-",null,"ABS","ABS","-","*",null,null,"ABS","ABS","-",null,"ABS","ABS","-","*",null,null,"ABS","ABS","-",null,"ABS","ABS","-","*",null,null,"ABS","ABS","-",null,"ABS","ABS","-","*","-",null,null,"ABS","ABS","-",null,"ABS","ABS","-",""]
[null,133,null,null,null,null,"0011",null,"ABS","ABS","-",null,"ABS","ABS","-","*","0031",null,"ABS","ABS","-",null,"ABS","ABS","-","*","0051",null,"ABS","ABS","-",null,"ABS","ABS","-","*",null,null,"ABS","ABS","-",null,"ABS","ABS","-","*",null,null,"ABS","ABS","-",null,"ABS","ABS","-","*",null,null,"ABS","ABS","-",null,"ABS","ABS","-","*","-",null,null,"ABS","ABS","-",null,"ABS","ABS","-",""]
[null,134,null,null,null,null,"0011",null,"ABS","ABS","-",null,"ABS","ABS","-","*","0031",null,"ABS","ABS","-",null,"ABS","ABS","-","*","0051",null,"ABS","ABS","-",null,"ABS","ABS","-","*",null,null,"ABS","ABS","-",null,"ABS","ABS","-","*",null,null,"ABS","ABS","-",null,"ABS","ABS","-","*",null,null,"ABS","ABS","-",null,"ABS","ABS","-","*","-",null,null,"ABS","ABS","-",null,"ABS","ABS","-",""]
[null,135,null,null,null,null,"0011",null,"ABS","ABS","-",null,"ABS","ABS","-","*","0031",null,"ABS","ABS","-",null,"ABS","ABS","-","*","0051",null,"ABS","ABS","-",null,"ABS","ABS","-","*",null,null,"ABS","ABS","-",null,"ABS","ABS","-","*",null,null,"ABS","ABS","-",null,"ABS","ABS","-","*",null,null,"ABS","ABS","-",null,"ABS","ABS","-","*","-",null,null,"ABS","ABS","-",null,"ABS","ABS","-",""]
[null,136,null,null,null,null,"0011",null,"ABS","ABS","-",null,"ABS","ABS","-","*","0031",null,"ABS","ABS","-",null,"ABS","ABS","-","*","0051",null,"ABS","ABS","-",null,"ABS","ABS","-","*",null,null,"ABS","ABS","-",null,"ABS","ABS","-","*",null,null,"ABS","ABS","-",null,"ABS","ABS","-","*",null,null,"ABS","ABS","-",null,"ABS","ABS","-","*","-",null,null,"ABS","ABS","-",null,"ABS","ABS","-",""]
[null,137,null,null,null,null,"0011",null,"ABS","ABS","-",null,"ABS","ABS","-","*","0031",null,"ABS","ABS","-",null,"ABS","ABS","-","*","0051",null,"ABS","ABS","-",null,"ABS","ABS","-","*",null,null,"ABS","ABS","-",null,"ABS","ABS","-","*",null,null,"ABS","ABS","-",null,"ABS","ABS","-","*",null,null,"ABS","ABS","-",null,"ABS","ABS","-","*","-",null,null,"ABS","ABS","-",null,"ABS","ABS","-",""]
[null,138,null,null,null,null,"0011",null,"ABS","ABS","-",null,"ABS","ABS","-","*","0031",null,"ABS","ABS","-",null,"ABS","ABS","-","*","0051",null,"ABS","ABS","-",null,"ABS","ABS","-","*",null,null,"ABS","ABS","-",null,"ABS","ABS","-","*",null,null,"ABS","ABS","-",null,"ABS","ABS","-","*",null,null,"ABS","ABS","-",null,"ABS","ABS","-","*","-",null,null,"ABS","ABS","-",null,"ABS","ABS","-",""]
[null,139,null,null,null,null,"0011",null,"ABS","ABS","-",null,"ABS","ABS","-","*","0031",null,"ABS","ABS","-",null,"ABS","ABS","-","*","0051",null,"ABS","ABS","-",null,"ABS","ABS","-","*",null,null,"ABS","ABS","-",null,"ABS","ABS","-","*",null,null,"ABS","ABS","-",null,"ABS","ABS","-","*",null,null,"ABS","ABS","-",null,"ABS","ABS","-","*","-",null,null,"ABS","ABS","-",null,"ABS","ABS","-",""]
[null,140,null,null,null,null,"0011",null,"ABS","ABS","-",null,"ABS","ABS","-","*","0031",null,"ABS","ABS","-",null,"ABS","ABS","-","*","0051",null,"ABS","ABS","-",null,"ABS","ABS","-","*",null,null,"ABS","ABS","-",null,"ABS","ABS","-","*",null,null,"ABS","ABS","-",null,"ABS","ABS","-","*",null,null,"ABS","ABS","-",null,"ABS","ABS","-","*","-",null,null,"ABS","ABS","-",null,"ABS","ABS","-",""]
[null,141,null,null,null,null,"0011",null,"ABS","ABS","-",null,"ABS","ABS","-","*","0031",null,"ABS","ABS","-",null,"ABS","ABS","-","*","0051",null,"ABS","ABS","-",null,"ABS","ABS","-","*",null,null,"ABS","ABS","-",null,"ABS","ABS","-","*",null,null,"ABS","ABS","-",null,"ABS","ABS","-","*",null,null,"ABS","ABS","-",null,"ABS","ABS","-","*","-",null,null,"ABS","ABS","-",null,"ABS","ABS","-",""]
[null,142,null,null,null,null,"0011",null,"ABS","ABS","-",null,"ABS","ABS","-","*","0031",null,"ABS","ABS","-",null,"ABS","ABS","-","*","0051",null,"ABS","ABS","-",null,"ABS","ABS","-","*",null,null,"ABS","ABS","-",null,"ABS","ABS","-","*",null,null,"ABS","ABS","-",null,"ABS","ABS","-","*",null,null,"ABS","ABS","-",null,"ABS","ABS","-","*","-",null,null,"ABS","ABS","-",null,"ABS","ABS","-",""]
[null,143,null,null,null,null,"0011",null,"ABS","ABS","-",null,"ABS","ABS","-","*","0031",null,"ABS","ABS","-",null,"ABS","ABS","-","*","0051",null,"ABS","ABS","-",null,"ABS","ABS","-","*",null,null,"ABS","ABS","-",null,"ABS","ABS","-","*",null,null,"ABS","ABS","-",null,"ABS","ABS","-","*",null,null,"ABS","ABS","-",null,"ABS","ABS","-","*","-",null,null,"ABS","ABS","-",null,"ABS","ABS","-",""]
[null,144,null,null,null,null,"0011",null,"ABS","ABS","-",null,"ABS","ABS","-","*","0031",null,"ABS","ABS","-",null,"ABS","ABS","-","*","0051",null,"ABS","ABS","-",null,"ABS","ABS","-","*",null,null,"ABS","ABS","-",null,"ABS","ABS","-","*",null,null,"ABS","ABS","-",null,"ABS","ABS","-","*",null,null,"ABS","ABS","-",null,"ABS","ABS","-","*","-",null,null,"ABS","ABS","-",null,"ABS","ABS","-",""]
[null,145,null,null,null,null,"0011",null,"ABS","ABS","-",null,"ABS","ABS","-","*","0031",null,"ABS","ABS","-",null,"ABS","ABS","-","*","0051",null,"ABS","ABS","-",null,"ABS","ABS","-","*",null,null,"ABS","ABS","-",null,"ABS","ABS","-","*",null,null,"ABS","ABS","-",null,"ABS","ABS","-","*",null,null,"ABS","ABS","-",null,"ABS","ABS","-","*","-",null,null,"ABS","ABS","-",null,"ABS","ABS","-",""]
[null,146,null,null,null,null,"0011",null,"ABS","ABS","-",null,"ABS","ABS","-","*","0031",null,"ABS","ABS","-",null,"ABS","ABS","-","*","0051",null,"ABS","ABS","-",null,"ABS","ABS","-","*",null,null,"ABS","ABS","-",null,"ABS","ABS","-","*",null,null,"ABS","ABS","-",null,"ABS","ABS","-","*",null,null,"ABS","ABS","-",null,"ABS","ABS","-","*","-",null,null,"ABS","ABS","-",null,"ABS","ABS","-",""]
[null,147,null,null,null,null,"0011",null,"ABS","ABS","-",null,"ABS","ABS","-","*","0031",null,"ABS","ABS","-",null,"ABS","ABS","-","*","0051",null,"ABS","ABS","-",null,"ABS","ABS","-","*",null,null,"ABS","ABS","-",null,"ABS","ABS","-","*",null,null,"ABS","ABS","-",null,"ABS","ABS","-","*",null,null,"ABS","ABS","-",null,"ABS","ABS","-","*","-",null,null,"ABS","ABS","-",null,"ABS","ABS","-",""]
[null,148,null,null,null,null,"0011",null,"ABS","ABS","-",null,"ABS","ABS","-","*","0031",null,"ABS","ABS","-",null,"ABS","ABS","-","*","0051",null,"ABS","ABS","-",null,"ABS","ABS","-","*",null,null,"ABS","ABS","-",null,"ABS","ABS","-","*",null,null,"ABS","ABS","-",null,"ABS","ABS","-","*",null,null,"ABS","ABS","-",null,"ABS","ABS","-","*","-",null,null,"ABS","ABS","-",null,"ABS","ABS","-",""]
[null,149,null,null,null,null,"0011",null,"ABS","ABS","-",null,"ABS","ABS","-","*","0031",null,"ABS","ABS","-",null,"ABS","ABS","-","*","0051",null,"ABS","ABS","-",null,"ABS","ABS","-","*",null,null,"ABS","ABS","-",null,"ABS","ABS","-","*",null,null,"ABS","ABS","-",null,"ABS","ABS","-","*",null,null,"ABS","ABS","-",null,"ABS","ABS","-","*","-",null,null,"ABS","ABS","-",null,"ABS","ABS","-",""]
[null,150,null,null,null,null,"0011",null,"ABS","ABS","-",null,"ABS","ABS","-","*","0031",null,"ABS","ABS","-",null,"ABS","ABS","-","*","0051",null,"ABS","ABS","-",null,"ABS","ABS","-","*",null,null,"ABS","ABS","-",null,"ABS","ABS","-","*",null,null,"ABS","ABS","-",null,"ABS","ABS","-","*",null,null,"ABS","ABS","-",null,"ABS","ABS","-","*","-",null,null,"ABS","ABS","-",null,"ABS","ABS","-",""]

{"sheet":"PROCESSING","index":2,"n_rows":163,"n_cols":57,"rows_kept":163,"cut":false,"hidden":false,"merged":[[2,14,3,14],[2,18,3,18],[2,24,3,24],[2,30,3,30],[2,36,3,36],[2,9,3,9],[2,6,3,6],[2,8,3,8],[2,45,3,45],[1,48,3,48],[2,16,3,16],[2,37,3,37],[2,40,3,40],[2,42,3,42],[2,44,3,44],[2,34,3,34],[2,35,3,35],[2,17,3,17],[2,19,3,19],[2,20,3,20],[2,15,3,15],[1,23,1,28],[1,29,1,34],[1,49,3,49],[1,51,3,52],[1,53,3,54],[2,47,3,47],[1,50,3,50],[2,43,3,43],[1,1,3,1],[1,2,3,2],[1,3,3,3],[1,4,3,4],[1,55,3,55],[1,35,1,40],[1,41,3,41],[1,42,1,47],[2,5,3,5],[2,7,3,7],[2,10,3,10],[2,11,3,11],[2,12,3,12],[2,13,3,13],[1,5,1,10],[1,11,1,16],[1,56,3,56],[2,21,3,21],[2,27,3,27],[2,33,3,33],[2,39,3,39],[2,46,3,46],[2,38,3,38],[2,22,3,22],[2,23,3,23],[2,25,3,25],[2,26,3,26],[2,28,3,28],[2,29,3,29],[2,31,3,31],[2,32,3,32],[1,17,1,22]]}
[null,null,null,3,4,null,null,7,null,9,null,null,null,13,null,15,null,null,null,19,null,21,null,null,null,25,null,27,null,null,null,31,null,33,null,null,null,37,null,39,null,null,null,null,44,null,46]
[null,"SYMBOL NO.","Name Of Student","DOB","Registration No.","Com.Nepali",null,null,null,null,null,"Com.English",null,null,null,null,null,"Social & Life Skill",null,null,null,null,null,"OPT 1st",null,null,null,null,null,"OPT 2nd",null,null,null,null,null,"OPT 3rd",null,null,null,null,null,"GPA","EXTRA CREDIT SUBJECT",null,null,null,null,null,"Not Graded","Absent","Withheld","Top 5",null,"Less 5",null,"Top/Less 5 Helper","Top/Less 5 Helper 2"]
[null,null,null,null,null,"Sub Code","TH","G.P. (TH)","IN","G.P. (IN)","FINAL GRADE","Sub Code","TH","G.P. (TH)","IN","G.P. (IN)","FINAL GRADE","Sub Code","TH","G.P. (TH)","IN","G.P. (IN)","FINAL GRADE","Sub Code","TH","G.P. (TH)","IN","G.P. (IN)","FINAL GRADE","Sub Code","TH","G.P. (TH)","IN","G.P. (IN)","FINAL GRADE","Sub Code","TH","G.P. (TH)","IN","G.P. (IN)","FINAL GRADE",null,"Sub Code","TH","G.P. (TH)","IN","G.P. (IN)","FINAL GRADE"]
[]
[null,{"$f":"INPUT!F5","v":11301320},{"$f":"INPUT!C5","v":"ALISHA KARKI "},{"$f":"INPUT!D5","v":"4/31/2063"},{"$f":"INPUT!E5","v":"801130210001"},{"$f":"INPUT!G5","v":"0011"},{"$f":"INPUT!I5","v":"C+"},{"$f":"INPUT!J5","v":2.4},{"$f":"INPUT!M5","v":"C"},{"$f":"INPUT!N5","v":2},{"$f":"INPUT!P5","v":"C+"},{"$f":"INPUT!Q5","v":"0031"},{"$f":"INPUT!S5","v":"C+"},{"$f":"INPUT!T5","v":2.4},{"$f":"INPUT!W5","v":"C"},{"$f":"INPUT!X5","v":2},{"$f":"INPUT!Z5","v":"C+"},{"$f":"INPUT!AA5","v":"0051"},{"$f":"INPUT!AC5","v":"C+"},{"$f":"INPUT!AD5","v":2.4},{"$f":"INPUT!AG5","v":"A"},{"$f":"INPUT!AH5","v":3.6},{"$f":"INPUT!AJ5","v":"B"},{"$f":"INPUT!AK5","v":1031},{"$f":"INPUT!AM5","v":"A"},{"$f":"INPUT!AN5","v":3.6},{"$f":"INPUT!AQ5","v":"A+"},{"$f":"INPUT!AR5","v":4},{"$f":"INPUT!AT5","v":"A+"},{"$f":"INPUT!AU5","v":4251},{"$f":"INPUT!AW5","v":"C"},{"$f":"INPUT!AX5","v":2},{"$f":"INPUT!BA5","v":"A+"},{"$f":"INPUT!BB5","v":4},{"$f":"INPUT!BD5","v":"B"},{"$f":"INPUT!BE5","v":4171},{"$f":"INPUT!BG5","v":"B"},{"$f":"INPUT!BH5","v":2.8},{"$f":"INPUT!BK5","v":"A"},{"$f":"INPUT!BL5","v":3.6},{"$f":"INPUT!BN5","v":"B+"},{"$f":"INPUT!BO5","v":2.8},{"$f":"INPUT!BP5","v":0},{"$f":"INPUT!BR5","v":"ABS"},{"$f":"INPUT!BS5","v":"ABS"},{"$f":"INPUT!BV5","v":"ABS"},{"$f":"INPUT!BW5","v":"ABS"},{"$f":"INPUT!BY5","v":""},{"$f":"IF(OR(G5=\"NG\",M5=\"NG\",S5=\"NG\",Y5=\"NG\",AE5=\"NG\",AK5=\"NG\"),\"NG\",\"\")","v":""},{"$f":"IF(OR(H5=\"ABS\",N5=\"ABS\",T5=\"ABS\",Z5=\"ABS\",AF5=\"ABS\",AL5=\"ABS\"),\"ABS\",\"\")","v":""},{"$f":"IF(OR(J5=\"-\",P5=\"-\",V5=\"-\",AB5=\"-\",AH5=\"-\",AN5=\"NG\",AW5=\"NG\"),\"W\",\"\")","v":""},{"$f":"INDEX(Name,MATCH(BD5,$BE$5:$BE$154,0))","v":"AMRITA RAI "},{"$f":"LARGE(GPA,{1;2;3;4;5})","v":3.1518518518518515},{"$f":"INDEX(Name,MATCH(BD12,$BE$5:$BE$154,0))","v":"ALISHA KARKI "},{"$f":"SMALL(GPA,{1;2;3;4;5})","v":2.8},{"$f":"BA5&\"_\"&COUNTIF($BA$5:BA5,BA5)","v":"3.15185185185185_1"},{"$f":"AP5&\"_\"&COUNTIF($AP$5:AP5,AP5)","v":"2.8_1"}]
[null,{"$f":"INPUT!F6","v":11301321},{"$f":"INPUT!C6","v":"AMRITA RAI "},{"$f":"INPUT!D6","v":"2063-09-02"},{"$f":"INPUT!E6","v":"801130210002"},{"$f":"INPUT!G6","v":"0011"},{"$f":"INPUT!I6","v":"C+"},{"$f":"INPUT!J6","v":2.4},{"$f":"INPUT!M6","v":"C"},{"$f":"INPUT!N6","v":2},{"$f":"INPUT!P6","v":"C+"},{"$f":"INPUT!Q6","v":"0031"},{"$f":"INPUT!S6","v":"C+"},{"$f":"INPUT!T6","v":2.4},{"$f":"INPUT!W6","v":"C"},{"$f":"INPUT!X6","v":2},{"$f":"INPUT!Z6","v":"C+"},{"$f":"INPUT!AA6","v":"0051"},{"$f":"INPUT!AC6","v":"A+"},{"$f":"INPUT!AD6","v":4},{"$f":"INPUT!AG6","v":"A+"},{"$f":"INPUT!AH6","v":4},{"$f":"INPUT!AJ6","v":"A+"},{"$f":"INPUT!AK6","v":1031},{"$f":"INPUT!AM6","v":"A"},{"$f":"INPUT!AN6","v":3.6},{"$f":"INPUT!AQ6","v":"A+"},{"$f":"INPUT!AR6","v":4},{"$f":"INPUT!AT6","v":"A+"},{"$f":"INPUT!AU6","v":4251},{"$f":"INPUT!AW6","v":"C"},{"$f":"INPUT!AX6","v":2},{"$f":"INPUT!BA6","v":"A+"},{"$f":"INPUT!BB6","v":4},{"$f":"INPUT!BD6","v":"B"},{"$f":"INPUT!BE6","v":4171},{"$f":"INPUT!BG6","v":"A"},{"$f":"INPUT!BH6","v":3.6},{"$f":"INPUT!BK6","v":"A"},{"$f":"INPUT!BL6","v":3.6},{"$f":"INPUT!BN6","v":"A"},{"$f":"INPUT!BO6","v":3.1518518518518515},{"$f":"INPUT!BP6","v":0},{"$f":"INPUT!BR6","v":"ABS"},{"$f":"INPUT!BS6","v":"ABS"},{"$f":"INPUT!BV6","v":"ABS"},{"$f":"INPUT!BW6","v":"ABS"},{"$f":"INPUT!BY6","v":""},{"$f":"IF(OR(G6=\"NG\",M6=\"NG\",S6=\"NG\",Y6=\"NG\",AE6=\"NG\",AK6=\"NG\"),\"NG\",\"\")","v":""},{"$f":"IF(OR(H6=\"ABS\",N6=\"ABS\",T6=\"ABS\",Z6=\"ABS\",AF6=\"ABS\",AL6=\"ABS\"),\"ABS\",\"\")","v":""},{"$f":"IF(OR(J6=\"-\",P6=\"-\",V6=\"-\",AB6=\"-\",AH6=\"-\",AN6=\"NG\",AW6=\"NG\"),\"W\",\"\")","v":""},{"$f":"INDEX(Name,MATCH(BD6,$BE$5:$BE$154,0))","v":"ANISHA THAPA MAGAR "},3.0222222222222221,{"$f":"INDEX(Name,MATCH(BD13,$BE$5:$BE$154,0))","v":"ANISHA THAPA MAGAR "},3.0222222222222221,{"$f":"BA6&\"_\"&COUNTIF($BA$5:BA6,BA6)","v":"3.02222222222222_1"},{"$f":"AP6&\"_\"&COUNTIF($AP$5:AP6,AP6)","v":"3.15185185185185_1"}]
[null,{"$f":"INPUT!F7","v":11301322},{"$f":"INPUT!C7","v":"ANISHA THAPA MAGAR "},{"$f":"INPUT!D7","v":"2062-07-07"},{"$f":"INPUT!E7","v":"801130210003"},{"$f":"INPUT!G7","v":"0011"},{"$f":"INPUT!I7","v":"C+"},{"$f":"INPUT!J7","v":2.4},{"$f":"INPUT!M7","v":"C"},{"$f":"INPUT!N7","v":2},{"$f":"INPUT!P7","v":"C+"},{"$f":"INPUT!Q7","v":"0031"},{"$f":"INPUT!S7","v":"C+"},{"$f":"INPUT!T7","v":2.4},{"$f":"INPUT!W7","v":"C"},{"$f":"INPUT!X7","v":2},{"$f":"INPUT!Z7","v":"C+"},{"$f":"INPUT!AA7","v":"0051"},{"$f":"INPUT!AC7","v":"B+"},{"$f":"INPUT!AD7","v":3.2},{"$f":"INPUT!AG7","v":"A"},{"$f":"INPUT!AH7","v":3.6},{"$f":"INPUT!AJ7","v":"A"},{"$f":"INPUT!AK7","v":1031},{"$f":"INPUT!AM7","v":"A"},{"$f":"INPUT!AN7","v":3.6},{"$f":"INPUT!AQ7","v":"A+"},{"$f":"INPUT!AR7","v":4},{"$f":"INPUT!AT7","v":"A+"},{"$f":"INPUT!AU7","v":4251},{"$f":"INPUT!AW7","v":"C+"},{"$f":"INPUT!AX7","v":2.4},{"$f":"INPUT!BA7","v":"A+"},{"$f":"INPUT!BB7","v":4},{"$f":"INPUT!BD7","v":"B"},{"$f":"INPUT!BE7","v":4171},{"$f":"INPUT!BG7","v":"B+"},{"$f":"INPUT!BH7","v":3.2},{"$f":"INPUT!BK7","v":"A"},{"$f":"INPUT!BL7","v":3.6},{"$f":"INPUT!BN7","v":"A"},{"$f":"INPUT!BO7","v":3.0222222222222221},{"$f":"INPUT!BP7","v":0},{"$f":"INPUT!BR7","v":"ABS"},{"$f":"INPUT!BS7","v":"ABS"},{"$f":"INPUT!BV7","v":"ABS"},{"$f":"INPUT!BW7","v":"ABS"},{"$f":"INPUT!BY7","v":""},"","","",{"$f":"INDEX(Name,MATCH(BD7,$BE$5:$BE$154,0))","v":"ALISHA KARKI "},2.8,{"$f":"INDEX(Name,MATCH(BD14,$BE$5:$BE$154,0))","v":"AMRITA RAI "},3.1518518518518515,{"$f":"BA7&\"_\"&COUNTIF($BA$5:BA7,BA7)","v":"2.8_1"},{"$f":"AP7&\"_\"&COUNTIF($AP$5:AP7,AP7)","v":"3.02222222222222_1"}]
[null,{"$f":"INPUT!F8","v":11301323},{"$f":"INPUT!C8","v":"ANUPAMA TAMANG "},{"$f":"INPUT!D8","v":"2062-12-20"},{"$f":"INPUT!E8","v":"801130210004"},{"$f":"INPUT!G8","v":"0011"},{"$f":"INPUT!I8","v":"C"},{"$f":"INPUT!J8","v":2},{"$f":"INPUT!M8","v":"C"},{"$f":"INPUT!N8","v":2},{"$f":"INPUT!P8","v":"C"},{"$f":"INPUT!Q8","v":"0031"},{"$f":"INPUT!S8","v":"C"},{"$f":"INPUT!T8","v":2},{"$f":"INPUT!W8","v":"C"},{"$f":"INPUT!X8","v":2},{"$f":"INPUT!Z8","v":"C"},{"$f":"INPUT!AA8","v":"0051"},{"$f":"INPUT!AC8","v":"B"},{"$f":"INPUT!AD8","v":2.8},{"$f":"INPUT!AG8","v":"A"},{"$f":"INPUT!AH8","v":3.6},{"$f":"INPUT!AJ8","v":"B+"},{"$f":"INPUT!AK8","v":1031},{"$f":"INPUT!AM8","v":"B"},{"$f":"INPUT!AN8","v":2.8},{"$f":"INPUT!AQ8","v":"A"},{"$f":"INPUT!AR8","v":3.6},{"$f":"INPUT!AT8","v":"B+"},{"$f":"INPUT!AU8","v":4251},{"$f":"INPUT!AW8","v":"C"},{"$f":"INPUT!AX8","v":2},{"$f":"INPUT!BA8","v":"A+"},{"$f":"INPUT!BB8","v":4},{"$f":"INPUT!BD8","v":"B"},{"$f":"INPUT!BE8","v":4171},{"$f":"INPUT!BG8","v":"B+"},{"$f":"INPUT!BH8","v":3.2},{"$f":"INPUT!BK8","v":"ABS"},{"$f":"INPUT!BL8","v":"ABS"},{"$f":"INPUT!BN8","v":"*"},{"$f":"INPUT!BO8","v":"-"},{"$f":"INPUT!BP8","v":0},{"$f":"INPUT!BR8","v":"ABS"},{"$f":"INPUT!BS8","v":"ABS"},{"$f":"INPUT!BV8","v":"ABS"},{"$f":"INPUT!BW8","v":"ABS"},{"$f":"INPUT!BY8","v":""},"","","",{"$f":"INDEX(Name,MATCH(BD8,$BE$5:$BE$154,0))","v":{"$error":"#NUM!"}},{"$error":"#NUM!"},{"$f":"INDEX(Name,MATCH(BD15,$BE$5:$BE$154,0))","v":{"$error":"#NUM!"}},{"$error":"#NUM!"},{"$f":"BA8&\"_\"&COUNTIF($BA$5:BA8,BA8)","v":{"$error":"#NUM!"}},{"$f":"AP8&\"_\"&COUNTIF($AP$5:AP8,AP8)","v":"-_1"}]
[null,{"$f":"INPUT!F9","v":11301324},{"$f":"INPUT!C9","v":"ASMITA PARIYAR "},{"$f":"INPUT!D9","v":"2062-12-27"},{"$f":"INPUT!E9","v":"801130210005"},{"$f":"INPUT!G9","v":"0011"},{"$f":"INPUT!I9","v":"C"},{"$f":"INPUT!J9","v":2},{"$f":"INPUT!M9","v":"C"},{"$f":"INPUT!N9","v":2},{"$f":"INPUT!P9","v":"C"},{"$f":"INPUT!Q9","v":"0031"},{"$f":"INPUT!S9","v":"C"},{"$f":"INPUT!T9","v":2},{"$f":"INPUT!W9","v":"C"},{"$f":"INPUT!X9","v":2},{"$f":"INPUT!Z9","v":"C"},{"$f":"INPUT!AA9","v":"0051"},{"$f":"INPUT!AC9","v":"B"},{"$f":"INPUT!AD9","v":2.8},{"$f":"INPUT!AG9","v":"A"},{"$f":"INPUT!AH9","v":3.6},{"$f":"INPUT!AJ9","v":"B+"},{"$f":"INPUT!AK9","v":1031},{"$f":"INPUT!AM9","v":"B"},{"$f":"INPUT!AN9","v":2.8},{"$f":"INPUT!AQ9","v":"A"},{"$f":"INPUT!AR9","v":3.6},{"$f":"INPUT!AT9","v":"B+"},{"$f":"INPUT!AU9","v":4251},{"$f":"INPUT!AW9","v":"C"},{"$f":"INPUT!AX9","v":2},{"$f":"INPUT!BA9","v":"A+"},{"$f":"INPUT!BB9","v":4},{"$f":"INPUT!BD9","v":"B"},{"$f":"INPUT!BE9","v":4171},{"$f":"INPUT!BG9","v":"A"},{"$f":"INPUT!BH9","v":3.6},{"$f":"INPUT!BK9","v":"ABS"},{"$f":"INPUT!BL9","v":"ABS"},{"$f":"INPUT!BN9","v":"*"},{"$f":"INPUT!BO9","v":"-"},{"$f":"INPUT!BP9","v":0},{"$f":"INPUT!BR9","v":"ABS"},{"$f":"INPUT!BS9","v":"ABS"},{"$f":"INPUT!BV9","v":"ABS"},{"$f":"INPUT!BW9","v":"ABS"},{"$f":"INPUT!BY9","v":""},"","","",{"$f":"INDEX(Name,MATCH(BD9,$BE$5:$BE$154,0))","v":{"$error":"#NUM!"}},{"$error":"#NUM!"},{"$f":"INDEX(Name,MATCH(BD16,$BE$5:$BE$154,0))","v":{"$error":"#NUM!"}},{"$error":"#NUM!"},{"$f":"BA9&\"_\"&COUNTIF($BA$5:BA9,BA9)","v":{"$error":"#NUM!"}},{"$f":"AP9&\"_\"&COUNTIF($AP$5:AP9,AP9)","v":"-_2"}]
[null,{"$f":"INPUT!F10","v":11301325},{"$f":"INPUT!C10","v":"BIKASH RAI "},{"$f":"INPUT!D10","v":"2063-03-10"},{"$f":"INPUT!E10","v":"801130210006"},{"$f":"INPUT!G10","v":"0011"},{"$f":"INPUT!I10","v":"C+"},{"$f":"INPUT!J10","v":2.4},{"$f":"INPUT!M10","v":"C"},{"$f":"INPUT!N10","v":2},{"$f":"INPUT!P10","v":"C+"},{"$f":"INPUT!Q10","v":"0031"},{"$f":"INPUT!S10","v":"C+"},{"$f":"INPUT!T10","v":2.4},{"$f":"INPUT!W10","v":"C"},{"$f":"INPUT!X10","v":2},{"$f":"INPUT!Z10","v":"C+"},{"$f":"INPUT!AA10","v":"0051"},{"$f":"INPUT!AC10","v":"A"},{"$f":"INPUT!AD10","v":3.6},{"$f":"INPUT!AG10","v":"A+"},{"$f":"INPUT!AH10","v":4},{"$f":"INPUT!AJ10","v":"A+"},{"$f":"INPUT!AK10","v":1031},{"$f":"INPUT!AM10","v":"A"},{"$f":"INPUT!AN10","v":3.6},{"$f":"INPUT!AQ10","v":"A+"},{"$f":"INPUT!AR10","v":4},{"$f":"INPUT!AT10","v":"A+"},{"$f":"INPUT!AU10","v":4251},{"$f":"INPUT!AW10","v":"C+"},{"$f":"INPUT!AX10","v":2.4},{"$f":"INPUT!BA10","v":"A+"},{"$f":"INPUT!BB10","v":4},{"$f":"INPUT!BD10","v":"B"},{"$f":"INPUT!BE10","v":4171},{"$f":"INPUT!BG10","v":"A"},{"$f":"INPUT!BH10","v":3.6},{"$f":"INPUT!BK10","v":"ABS"},{"$f":"INPUT!BL10","v":"ABS"},{"$f":"INPUT!BN10","v":"*"},{"$f":"INPUT!BO10","v":"-"},{"$f":"INPUT!BP10","v":0},{"$f":"INPUT!BR10","v":"ABS"},{"$f":"INPUT!BS10","v":"ABS"},{"$f":"INPUT!BV10","v":"ABS"},{"$f":"INPUT!BW10","v":"ABS"},{"$f":"INPUT!BY10","v":""},"","","",null,null,null,null,null,{"$f":"AP10&\"_\"&COUNTIF($AP$5:AP10,AP10)","v":"-_3"}]
[null,{"$f":"INPUT!F11","v":11301326},{"$f":"INPUT!C11","v":"DIKESH RAI "},{"$f":"INPUT!D11","v":"2063-07-06"},{"$f":"INPUT!E11","v":"801130210007"},{"$f":"INPUT!G11","v":"0011"},{"$f":"INPUT!I11","v":"C"},{"$f":"INPUT!J11","v":2},{"$f":"INPUT!M11","v":"C"},{"$f":"INPUT!N11","v":2},{"$f":"INPUT!P11","v":"C"},{"$f":"INPUT!Q11","v":"0031"},{"$f":"INPUT!S11","v":"C"},{"$f":"INPUT!T11","v":2},{"$f":"INPUT!W11","v":"C"},{"$f":"INPUT!X11","v":2},{"$f":"INPUT!Z11","v":"C"},{"$f":"INPUT!AA11","v":"0051"},{"$f":"INPUT!AC11","v":"C"},{"$f":"INPUT!AD11","v":2},{"$f":"INPUT!AG11","v":"A"},{"$f":"INPUT!AH11","v":3.6},{"$f":"INPUT!AJ11","v":"C+"},{"$f":"INPUT!AK11","v":1031},{"$f":"INPUT!AM11","v":"B"},{"$f":"INPUT!AN11","v":2.8},{"$f":"INPUT!AQ11","v":"A"},{"$f":"INPUT!AR11","v":3.6},{"$f":"INPUT!AT11","v":"B+"},{"$f":"INPUT!AU11","v":4251},{"$f":"INPUT!AW11","v":"C+"},{"$f":"INPUT!AX11","v":2.4},{"$f":"INPUT!BA11","v":"A+"},{"$f":"INPUT!BB11","v":4},{"$f":"INPUT!BD11","v":"B"},{"$f":"INPUT!BE11","v":4171},{"$f":"INPUT!BG11","v":"A"},{"$f":"INPUT!BH11","v":3.6},{"$f":"INPUT!BK11","v":"ABS"},{"$f":"INPUT!BL11","v":"ABS"},{"$f":"INPUT!BN11","v":"*"},{"$f":"INPUT!BO11","v":"-"},{"$f":"INPUT!BP11","v":0},{"$f":"INPUT!BR11","v":"ABS"},{"$f":"INPUT!BS11","v":"ABS"},{"$f":"INPUT!BV11","v":"ABS"},{"$f":"INPUT!BW11","v":"ABS"},{"$f":"INPUT!BY11","v":""},"","","",null,null,null,null,null,{"$f":"AP11&\"_\"&COUNTIF($AP$5:AP11,AP11)","v":"-_4"}]
[null,{"$f":"INPUT!F12","v":11301327},{"$f":"INPUT!C12","v":"ERON BHUJEL "},{"$f":"INPUT!D12","v":"2064-06-02"},{"$f":"INPUT!E12","v":"801130210008"},{"$f":"INPUT!G12","v":"0011"},{"$f":"INPUT!I12","v":"C"},{"$f":"INPUT!J12","v":2},{"$f":"INPUT!M12","v":"C"},{"$f":"INPUT!N12","v":2},{"$f":"INPUT!P12","v":"C"},{"$f":"INPUT!Q12","v":"0031"},{"$f":"INPUT!S12","v":"C"},{"$f":"INPUT!T12","v":2},{"$f":"INPUT!W12","v":"C"},{"$f":"INPUT!X12","v":2},{"$f":"INPUT!Z12","v":"C"},{"$f":"INPUT!AA12","v":"0051"},{"$f":"INPUT!AC12","v":"A"},{"$f":"INPUT!AD12","v":3.6},{"$f":"INPUT!AG12","v":"A+"},{"$f":"INPUT!AH12","v":4},{"$f":"INPUT!AJ12","v":"A+"},{"$f":"INPUT!AK12","v":1031},{"$f":"INPUT!AM12","v":"B"},{"$f":"INPUT!AN12","v":2.8},{"$f":"INPUT!AQ12","v":"A"},{"$f":"INPUT!AR12","v":3.6},{"$f":"INPUT!AT12","v":"B+"},{"$f":"INPUT!AU12","v":4251},{"$f":"INPUT!AW12","v":"C+"},{"$f":"INPUT!AX12","v":2.4},{"$f":"INPUT!BA12","v":"A+"},{"$f":"INPUT!BB12","v":4},{"$f":"INPUT!BD12","v":"B"},{"$f":"INPUT!BE12","v":4171},{"$f":"INPUT!BG12","v":"B"},{"$f":"INPUT!BH12","v":2.8},{"$f":"INPUT!BK12","v":"ABS"},{"$f":"INPUT!BL12","v":"ABS"},{"$f":"INPUT!BN12","v":"*"},{"$f":"INPUT!BO12","v":"-"},{"$f":"INPUT!BP12","v":0},{"$f":"INPUT!BR12","v":"ABS"},{"$f":"INPUT!BS12","v":"ABS"},{"$f":"INPUT!BV12","v":"ABS"},{"$f":"INPUT!BW12","v":"ABS"},{"$f":"INPUT!BY12","v":""},"","","",null,null,null,null,{"$f":"BC5&\"_\"&COUNTIF($BC$5:BC5,BC5)","v":"2.8_1"},{"$f":"AP12&\"_\"&COUNTIF($AP$5:AP12,AP12)","v":"-_5"}]
[null,{"$f":"INPUT!F13","v":11301328},{"$f":"INPUT!C13","v":"ISMITA RAI "},{"$f":"INPUT!D13","v":"2062-06-05"},{"$f":"INPUT!E13","v":"801130210009"},{"$f":"INPUT!G13","v":"0011"},{"$f":"INPUT!I13","v":"C+"},{"$f":"INPUT!J13","v":2.4},{"$f":"INPUT!M13","v":"C"},{"$f":"INPUT!N13","v":2},{"$f":"INPUT!P13","v":"C+"},{"$f":"INPUT!Q13","v":"0031"},{"$f":"INPUT!S13","v":"C+"},{"$f":"INPUT!T13","v":2.4},{"$f":"INPUT!W13","v":"C"},{"$f":"INPUT!X13","v":2},{"$f":"INPUT!Z13","v":"C+"},{"$f":"INPUT!AA13","v":"0051"},{"$f":"INPUT!AC13","v":"A"},{"$f":"INPUT!AD13","v":3.6},{"$f":"INPUT!AG13","v":"A+"},{"$f":"INPUT!AH13","v":4},{"$f":"INPUT!AJ13","v":"A+"},{"$f":"INPUT!AK13","v":1031},{"$f":"INPUT!AM13","v":"B+"},{"$f":"INPUT!AN13","v":3.2},{"$f":"INPUT!AQ13","v":"A+"},{"$f":"INPUT!AR13","v":4},{"$f":"INPUT!AT13","v":"A"},{"$f":"INPUT!AU13","v":4251},{"$f":"INPUT!AW13","v":"C"},{"$f":"INPUT!AX13","v":2},{"$f":"INPUT!BA13","v":"A+"},{"$f":"INPUT!BB13","v":4},{"$f":"INPUT!BD13","v":"B"},{"$f":"INPUT!BE13","v":4171},{"$f":"INPUT!BG13","v":"B+"},{"$f":"INPUT!BH13","v":3.2},{"$f":"INPUT!BK13","v":"ABS"},{"$f":"INPUT!BL13","v":"ABS"},{"$f":"INPUT!BN13","v":"*"},{"$f":"INPUT!BO13","v":"-"},{"$f":"INPUT!BP13","v":0},{"$f":"INPUT!BR13","v":"ABS"},{"$f":"INPUT!BS13","v":"ABS"},{"$f":"INPUT!BV13","v":"ABS"},{"$f":"INPUT!BW13","v":"ABS"},{"$f":"INPUT!BY13","v":""},"","","",null,null,null,null,{"$f":"BC6&\"_\"&COUNTIF($BC$5:BC6,BC6)","v":"3.02222222222222_1"},{"$f":"AP13&\"_\"&COUNTIF($AP$5:AP13,AP13)","v":"-_6"}]
[null,{"$f":"INPUT!F14","v":11301329},{"$f":"INPUT!C14","v":"KANCHAN KHATRI "},{"$f":"INPUT!D14","v":"2063-12-05"},{"$f":"INPUT!E14","v":"801130210010"},{"$f":"INPUT!G14","v":"0011"},{"$f":"INPUT!I14","v":"C+"},{"$f":"INPUT!J14","v":2.4},{"$f":"INPUT!M14","v":"C"},{"$f":"INPUT!N14","v":2},{"$f":"INPUT!P14","v":"C+"},{"$f":"INPUT!Q14","v":"0031"},{"$f":"INPUT!S14","v":"C+"},{"$f":"INPUT!T14","v":2.4},{"$f":"INPUT!W14","v":"C"},{"$f":"INPUT!X14","v":2},{"$f":"INPUT!Z14","v":"C+"},{"$f":"INPUT!AA14","v":"0051"},{"$f":"INPUT!AC14","v":"B+"},{"$f":"INPUT!AD14","v":3.2},{"$f":"INPUT!AG14","v":"A+"},{"$f":"INPUT!AH14","v":4},{"$f":"INPUT!AJ14","v":"A"},{"$f":"INPUT!AK14","v":1031},{"$f":"INPUT!AM14","v":"B+"},{"$f":"INPUT!AN14","v":3.2},{"$f":"INPUT!AQ14","v":"A+"},{"$f":"INPUT!AR14","v":4},{"$f":"INPUT!AT14","v":"A"},{"$f":"INPUT!AU14","v":4251},{"$f":"INPUT!AW14","v":"C+"},{"$f":"INPUT!AX14","v":2.4},{"$f":"INPUT!BA14","v":"A+"},{"$f":"INPUT!BB14","v":4},{"$f":"INPUT!BD14","v":"B"},{"$f":"INPUT!BE14","v":4171},{"$f":"INPUT!BG14","v":"B+"},{"$f":"INPUT!BH14","v":3.2},{"$f":"INPUT!BK14","v":"ABS"},{"$f":"INPUT!BL14","v":"ABS"},{"$f":"INPUT!BN14","v":"*"},{"$f":"INPUT!BO14","v":"-"},{"$f":"INPUT!BP14","v":0},{"$f":"INPUT!BR14","v":"ABS"},{"$f":"INPUT!BS14","v":"ABS"},{"$f":"INPUT!BV14","v":"ABS"},{"$f":"INPUT!BW14","v":"ABS"},{"$f":"INPUT!BY14","v":""},"","","",null,null,null,null,{"$f":"BC7&\"_\"&COUNTIF($BC$5:BC7,BC7)","v":"3.15185185185185_1"},{"$f":"AP14&\"_\"&COUNTIF($AP$5:AP14,AP14)","v":"-_7"}]
[null,{"$f":"INPUT!F15","v":11301330},{"$f":"INPUT!C15","v":"KAUSTUV JUNG KHADKA "},{"$f":"INPUT!D15","v":"2064-03-11"},{"$f":"INPUT!E15","v":"801130210011"},{"$f":"INPUT!G15","v":"0011"},{"$f":"INPUT!I15","v":"B+"},{"$f":"INPUT!J15","v":3.2},{"$f":"INPUT!M15","v":"B"},{"$f":"INPUT!N15","v":2.8},{"$f":"INPUT!P15","v":"B+"},{"$f":"INPUT!Q15","v":"0031"},{"$f":"INPUT!S15","v":"B+"},{"$f":"INPUT!T15","v":3.2},{"$f":"INPUT!W15","v":"B"},{"$f":"INPUT!X15","v":2.8},{"$f":"INPUT!Z15","v":"B+"},{"$f":"INPUT!AA15","v":"0051"},{"$f":"INPUT!AC15","v":"A"},{"$f":"INPUT!AD15","v":3.6},{"$f":"INPUT!AG15","v":"A+"},{"$f":"INPUT!AH15","v":4},{"$f":"INPUT!AJ15","v":"A+"},{"$f":"INPUT!AK15","v":1031},{"$f":"INPUT!AM15","v":"A"},{"$f":"INPUT!AN15","v":3.6},{"$f":"INPUT!AQ15","v":"A+"},{"$f":"INPUT!AR15","v":4},{"$f":"INPUT!AT15","v":"A+"},{"$f":"INPUT!AU15","v":4251},{"$f":"INPUT!AW15","v":"C+"},{"$f":"INPUT!AX15","v":2.4},{"$f":"INPUT!BA15","v":"A+"},{"$f":"INPUT!BB15","v":4},{"$f":"INPUT!BD15","v":"B"},{"$f":"INPUT!BE15","v":4171},{"$f":"INPUT!BG15","v":"B+"},{"$f":"INPUT!BH15","v":3.2},{"$f":"INPUT!BK15","v":"ABS"},{"$f":"INPUT!BL15","v":"ABS"},{"$f":"INPUT!BN15","v":"*"},{"$f":"INPUT!BO15","v":"-"},{"$f":"INPUT!BP15","v":0},{"$f":"INPUT!BR15","v":"ABS"},{"$f":"INPUT!BS15","v":"ABS"},{"$f":"INPUT!BV15","v":"ABS"},{"$f":"INPUT!BW15","v":"ABS"},{"$f":"INPUT!BY15","v":""},"","","",null,null,null,null,{"$f":"BC8&\"_\"&COUNTIF($BC$5:BC8,BC8)","v":{"$error":"#NUM!"}},{"$f":"AP15&\"_\"&COUNTIF($AP$5:AP15,AP15)","v":"-_8"}]
[null,{"$f":"INPUT!F16","v":11301331},{"$f":"INPUT!C16","v":"KUSUM RAI "},{"$f":"INPUT!D16","v":"2063-01-19"},{"$f":"INPUT!E16","v":"801130210012"},{"$f":"INPUT!G16","v":"0011"},{"$f":"INPUT!I16","v":"C+"},{"$f":"INPUT!J16","v":2.4},{"$f":"INPUT!M16","v":"C"},{"$f":"INPUT!N16","v":2},{"$f":"INPUT!P16","v":"C+"},{"$f":"INPUT!Q16","v":"0031"},{"$f":"INPUT!S16","v":"C+"},{"$f":"INPUT!T16","v":2.4},{"$f":"INPUT!W16","v":"C"},{"$f":"INPUT!X16","v":2},{"$f":"INPUT!Z16","v":"C+"},{"$f":"INPUT!AA16","v":"0051"},{"$f":"INPUT!AC16","v":"B"},{"$f":"INPUT!AD16","v":2.8},{"$f":"INPUT!AG16","v":"A"},{"$f":"INPUT!AH16","v":3.6},{"$f":"INPUT!AJ16","v":"B+"},{"$f":"INPUT!AK16","v":1031},{"$f":"INPUT!AM16","v":"B+"},{"$f":"INPUT!AN16","v":3.2},{"$f":"INPUT!AQ16","v":"A"},{"$f":"INPUT!AR16","v":3.6},{"$f":"INPUT!AT16","v":"A"},{"$f":"INPUT!AU16","v":4251},{"$f":"INPUT!AW16","v":"C"},{"$f":"INPUT!AX16","v":2},{"$f":"INPUT!BA16","v":"A+"},{"$f":"INPUT!BB16","v":4},{"$f":"INPUT!BD16","v":"B"},{"$f":"INPUT!BE16","v":4171},{"$f":"INPUT!BG16","v":"B+"},{"$f":"INPUT!BH16","v":3.2},{"$f":"INPUT!BK16","v":"ABS"},{"$f":"INPUT!BL16","v":"ABS"},{"$f":"INPUT!BN16","v":"*"},{"$f":"INPUT!BO16","v":"-"},{"$f":"INPUT!BP16","v":0},{"$f":"INPUT!BR16","v":"ABS"},{"$f":"INPUT!BS16","v":"ABS"},{"$f":"INPUT!BV16","v":"ABS"},{"$f":"INPUT!BW16","v":"ABS"},{"$f":"INPUT!BY16","v":""},"","","",null,null,null,null,{"$f":"BC9&\"_\"&COUNTIF($BC$5:BC9,BC9)","v":{"$error":"#NUM!"}},{"$f":"AP16&\"_\"&COUNTIF($AP$5:AP16,AP16)","v":"-_9"}]
[null,{"$f":"INPUT!F17","v":11301332},{"$f":"INPUT!C17","v":"LEPMUHANG RAI "},{"$f":"INPUT!D17","v":"2062-04-23"},{"$f":"INPUT!E17","v":"801130210013"},{"$f":"INPUT!G17","v":"0011"},{"$f":"INPUT!I17","v":"C"},{"$f":"INPUT!J17","v":2},{"$f":"INPUT!M17","v":"C"},{"$f":"INPUT!N17","v":2},{"$f":"INPUT!P17","v":"C"},{"$f":"INPUT!Q17","v":"0031"},{"$f":"INPUT!S17","v":"C"},{"$f":"INPUT!T17","v":2},{"$f":"INPUT!W17","v":"C"},{"$f":"INPUT!X17","v":2},{"$f":"INPUT!Z17","v":"C"},{"$f":"INPUT!AA17","v":"0051"},{"$f":"INPUT!AC17","v":"B+"},{"$f":"INPUT!AD17","v":3.2},{"$f":"INPUT!AG17","v":"A"},{"$f":"INPUT!AH17","v":3.6},{"$f":"INPUT!AJ17","v":"A"},{"$f":"INPUT!AK17","v":1031},{"$f":"INPUT!AM17","v":"B+"},{"$f":"INPUT!AN17","v":3.2},{"$f":"INPUT!AQ17","v":"A"},{"$f":"INPUT!AR17","v":3.6},{"$f":"INPUT!AT17","v":"A"},{"$f":"INPUT!AU17","v":4251},{"$f":"INPUT!AW17","v":"C+"},{"$f":"INPUT!AX17","v":2.4},{"$f":"INPUT!BA17","v":"A+"},{"$f":"INPUT!BB17","v":4},{"$f":"INPUT!BD17","v":"B"},{"$f":"INPUT!BE17","v":4171},{"$f":"INPUT!BG17","v":"A"},{"$f":"INPUT!BH17","v":3.6},{"$f":"INPUT!BK17","v":"ABS"},{"$f":"INPUT!BL17","v":"ABS"},{"$f":"INPUT!BN17","v":"*"},{"$f":"INPUT!BO17","v":"-"},{"$f":"INPUT!BP17","v":0},{"$f":"INPUT!BR17","v":"ABS"},{"$f":"INPUT!BS17","v":"ABS"},{"$f":"INPUT!BV17","v":"ABS"},{"$f":"INPUT!BW17","v":"ABS"},{"$f":"INPUT!BY17","v":""},"","","",null,null,null,null,null,{"$f":"AP17&\"_\"&COUNTIF($AP$5:AP17,AP17)","v":"-_10"}]
[null,{"$f":"INPUT!F18","v":11301333},{"$f":"INPUT!C18","v":"MAHESH DAHAL "},{"$f":"INPUT!D18","v":"2061-04-01"},{"$f":"INPUT!E18","v":"801130210014"},{"$f":"INPUT!G18","v":"0011"},{"$f":"INPUT!I18","v":"C"},{"$f":"INPUT!J18","v":2},{"$f":"INPUT!M18","v":"C"},{"$f":"INPUT!N18","v":2},{"$f":"INPUT!P18","v":"C"},{"$f":"INPUT!Q18","v":"0031"},{"$f":"INPUT!S18","v":"C"},{"$f":"INPUT!T18","v":2},{"$f":"INPUT!W18","v":"C"},{"$f":"INPUT!X18","v":2},{"$f":"INPUT!Z18","v":"C"},{"$f":"INPUT!AA18","v":"0051"},{"$f":"INPUT!AC18","v":"B"},{"$f":"INPUT!AD18","v":2.8},{"$f":"INPUT!AG18","v":"A"},{"$f":"INPUT!AH18","v":3.6},{"$f":"INPUT!AJ18","v":"B+"},{"$f":"INPUT!AK18","v":1031},{"$f":"INPUT!AM18","v":"B"},{"$f":"INPUT!AN18","v":2.8},{"$f":"INPUT!AQ18","v":"A"},{"$f":"INPUT!AR18","v":3.6},{"$f":"INPUT!AT18","v":"B+"},{"$f":"INPUT!AU18","v":4251},{"$f":"INPUT!AW18","v":"C+"},{"$f":"INPUT!AX18","v":2.4},{"$f":"INPUT!BA18","v":"A+"},{"$f":"INPUT!BB18","v":4},{"$f":"INPUT!BD18","v":"B"},{"$f":"INPUT!BE18","v":4171},{"$f":"INPUT!BG18","v":"A"},{"$f":"INPUT!BH18","v":3.6},{"$f":"INPUT!BK18","v":"ABS"},{"$f":"INPUT!BL18","v":"ABS"},{"$f":"INPUT!BN18","v":"*"},{"$f":"INPUT!BO18","v":"-"},{"$f":"INPUT!BP18","v":0},{"$f":"INPUT!BR18","v":"ABS"},{"$f":"INPUT!BS18","v":"ABS"},{"$f":"INPUT!BV18","v":"ABS"},{"$f":"INPUT!BW18","v":"ABS"},{"$f":"INPUT!BY18","v":""},"","","",null,null,null,null,null,{"$f":"AP18&\"_\"&COUNTIF($AP$5:AP18,AP18)","v":"-_11"}]
[null,{"$f":"INPUT!F19","v":11301334},{"$f":"INPUT!C19","v":"MANISHA RAI "},{"$f":"INPUT!D19","v":"2064-01-15"},{"$f":"INPUT!E19","v":"801130210015"},{"$f":"INPUT!G19","v":"0011"},{"$f":"INPUT!I19","v":"A"},{"$f":"INPUT!J19","v":3.6},{"$f":"INPUT!M19","v":"A"},{"$f":"INPUT!N19","v":3.6},{"$f":"INPUT!P19","v":"A"},{"$f":"INPUT!Q19","v":"0031"},{"$f":"INPUT!S19","v":"A"},{"$f":"INPUT!T19","v":3.6},{"$f":"INPUT!W19","v":"A"},{"$f":"INPUT!X19","v":3.6},{"$f":"INPUT!Z19","v":"A"},{"$f":"INPUT!AA19","v":"0051"},{"$f":"INPUT!AC19","v":"A+"},{"$f":"INPUT!AD19","v":4},{"$f":"INPUT!AG19","v":"A+"},{"$f":"INPUT!AH19","v":4},{"$f":"INPUT!AJ19","v":"A+"},{"$f":"INPUT!AK19","v":1031},{"$f":"INPUT!AM19","v":"A+"},{"$f":"INPUT!AN19","v":4},{"$f":"INPUT!AQ19","v":"A+"},{"$f":"INPUT!AR19","v":4},{"$f":"INPUT!AT19","v":"A+"},{"$f":"INPUT!AU19","v":4251},{"$f":"INPUT!AW19","v":"C+"},{"$f":"INPUT!AX19","v":2.4},{"$f":"INPUT!BA19","v":"A+"},{"$f":"INPUT!BB19","v":4},{"$f":"INPUT!BD19","v":"B"},{"$f":"INPUT!BE19","v":4171},{"$f":"INPUT!BG19","v":"A"},{"$f":"INPUT!BH19","v":3.6},{"$f":"INPUT!BK19","v":"ABS"},{"$f":"INPUT!BL19","v":"ABS"},{"$f":"INPUT!BN19","v":"*"},{"$f":"INPUT!BO19","v":"-"},{"$f":"INPUT!BP19","v":0},{"$f":"INPUT!BR19","v":"ABS"},{"$f":"INPUT!BS19","v":"ABS"},{"$f":"INPUT!BV19","v":"ABS"},{"$f":"INPUT!BW19","v":"ABS"},{"$f":"INPUT!BY19","v":""},"","","",null,null,null,null,null,{"$f":"AP19&\"_\"&COUNTIF($AP$5:AP19,AP19)","v":"-_12"}]
[null,{"$f":"INPUT!F20","v":11301335},{"$f":"INPUT!C20","v":"MANISHA THAPA "},{"$f":"INPUT!D20","v":"2062-06-25"},{"$f":"INPUT!E20","v":"801130210016"},{"$f":"INPUT!G20","v":"0011"},{"$f":"INPUT!I20","v":"A"},{"$f":"INPUT!J20","v":3.6},{"$f":"INPUT!M20","v":"B+"},{"$f":"INPUT!N20","v":3.2},{"$f":"INPUT!P20","v":"A"},{"$f":"INPUT!Q20","v":"0031"},{"$f":"INPUT!S20","v":"A"},{"$f":"INPUT!T20","v":3.6},{"$f":"INPUT!W20","v":"B+"},{"$f":"INPUT!X20","v":3.2},{"$f":"INPUT!Z20","v":"A"},{"$f":"INPUT!AA20","v":"0051"},{"$f":"INPUT!AC20","v":"A"},{"$f":"INPUT!AD20","v":3.6},{"$f":"INPUT!AG20","v":"A+"},{"$f":"INPUT!AH20","v":4},{"$f":"INPUT!AJ20","v":"A+"},{"$f":"INPUT!AK20","v":1031},{"$f":"INPUT!AM20","v":"A+"},{"$f":"INPUT!AN20","v":4},{"$f":"INPUT!AQ20","v":"A+"},{"$f":"INPUT!AR20","v":4},{"$f":"INPUT!AT20","v":"A+"},{"$f":"INPUT!AU20","v":4251},{"$f":"INPUT!AW20","v":"C+"},{"$f":"INPUT!AX20","v":2.4},{"$f":"INPUT!BA20","v":"A+"},{"$f":"INPUT!BB20","v":4},{"$f":"INPUT!BD20","v":"B"},{"$f":"INPUT!BE20","v":4171},{"$f":"INPUT!BG20","v":"A"},{"$f":"INPUT!BH20","v":3.6},{"$f":"INPUT!BK20","v":"ABS"},{"$f":"INPUT!BL20","v":"ABS"},{"$f":"INPUT!BN20","v":"*"},{"$f":"INPUT!BO20","v":"-"},{"$f":"INPUT!BP20","v":0},{"$f":"INPUT!BR20","v":"ABS"},{"$f":"INPUT!BS20","v":"ABS"},{"$f":"INPUT!BV20","v":"ABS"},{"$f":"INPUT!BW20","v":"ABS"},{"$f":"INPUT!BY20","v":""},"","","",null,null,null,null,null,{"$f":"AP20&\"_\"&COUNTIF($AP$5:AP20,AP20)","v":"-_13"}]
[null,{"$f":"INPUT!F21","v":11301336},{"$f":"INPUT!C21","v":"MOUSAM RAI "},{"$f":"INPUT!D21","v":"2063-06-29"},{"$f":"INPUT!E21","v":"801130210017"},{"$f":"INPUT!G21","v":"0011"},{"$f":"INPUT!I21","v":"C+"},{"$f":"INPUT!J21","v":2.4},{"$f":"INPUT!M21","v":"C+"},{"$f":"INPUT!N21","v":2.4},{"$f":"INPUT!P21","v":"C+"},{"$f":"INPUT!Q21","v":"0031"},{"$f":"INPUT!S21","v":"C+"},{"$f":"INPUT!T21","v":2.4},{"$f":"INPUT!W21","v":"C+"},{"$f":"INPUT!X21","v":2.4},{"$f":"INPUT!Z21","v":"C+"},{"$f":"INPUT!AA21","v":"0051"},{"$f":"INPUT!AC21","v":"A"},{"$f":"INPUT!AD21","v":3.6},{"$f":"INPUT!AG21","v":"A+"},{"$f":"INPUT!AH21","v":4},{"$f":"INPUT!AJ21","v":"A+"},{"$f":"INPUT!AK21","v":1031},{"$f":"INPUT!AM21","v":"B"},{"$f":"INPUT!AN21","v":2.8},{"$f":"INPUT!AQ21","v":"A"},{"$f":"INPUT!AR21","v":3.6},{"$f":"INPUT!AT21","v":"B+"},{"$f":"INPUT!AU21","v":4251},{"$f":"INPUT!AW21","v":"C"},{"$f":"INPUT!AX21","v":2},{"$f":"INPUT!BA21","v":"A+"},{"$f":"INPUT!BB21","v":4},{"$f":"INPUT!BD21","v":"B"},{"$f":"INPUT!BE21","v":4171},{"$f":"INPUT!BG21","v":"C+"},{"$f":"INPUT!BH21","v":2.4},{"$f":"INPUT!BK21","v":"ABS"},{"$f":"INPUT!BL21","v":"ABS"},{"$f":"INPUT!BN21","v":"*"},{"$f":"INPUT!BO21","v":"-"},{"$f":"INPUT!BP21","v":0},{"$f":"INPUT!BR21","v":"ABS"},{"$f":"INPUT!BS21","v":"ABS"},{"$f":"INPUT!BV21","v":"ABS"},{"$f":"INPUT!BW21","v":"ABS"},{"$f":"INPUT!BY21","v":""},"","","",null,null,null,null,null,{"$f":"AP21&\"_\"&COUNTIF($AP$5:AP21,AP21)","v":"-_14"}]
[null,{"$f":"INPUT!F22","v":11301337},{"$f":"INPUT!C22","v":"NANIMA SHRESTHA "},{"$f":"INPUT!D22","v":"2064-11-16"},{"$f":"INPUT!E22","v":"801130210018"},{"$f":"INPUT!G22","v":"0011"},{"$f":"INPUT!I22","v":"C+"},{"$f":"INPUT!J22","v":2.4},{"$f":"INPUT!M22","v":"C"},{"$f":"INPUT!N22","v":2},{"$f":"INPUT!P22","v":"C+"},{"$f":"INPUT!Q22","v":"0031"},{"$f":"INPUT!S22","v":"C+"},{"$f":"INPUT!T22","v":2.4},{"$f":"INPUT!W22","v":"C"},{"$f":"INPUT!X22","v":2},{"$f":"INPUT!Z22","v":"C+"},{"$f":"INPUT!AA22","v":"0051"},{"$f":"INPUT!AC22","v":"A"},{"$f":"INPUT!AD22","v":3.6},{"$f":"INPUT!AG22","v":"A+"},{"$f":"INPUT!AH22","v":4},{"$f":"INPUT!AJ22","v":"A+"},{"$f":"INPUT!AK22","v":1031},{"$f":"INPUT!AM22","v":"B+"},{"$f":"INPUT!AN22","v":3.2},{"$f":"INPUT!AQ22","v":"A"},{"$f":"INPUT!AR22","v":3.6},{"$f":"INPUT!AT22","v":"A"},{"$f":"INPUT!AU22","v":4251},{"$f":"INPUT!AW22","v":"C"},{"$f":"INPUT!AX22","v":2},{"$f":"INPUT!BA22","v":"A+"},{"$f":"INPUT!BB22","v":4},{"$f":"INPUT!BD22","v":"B"},{"$f":"INPUT!BE22","v":4171},{"$f":"INPUT!BG22","v":"B"},{"$f":"INPUT!BH22","v":2.8},{"$f":"INPUT!BK22","v":"ABS"},{"$f":"INPUT!BL22","v":"ABS"},{"$f":"INPUT!BN22","v":"*"},{"$f":"INPUT!BO22","v":"-"},{"$f":"INPUT!BP22","v":0},{"$f":"INPUT!BR22","v":"ABS"},{"$f":"INPUT!BS22","v":"ABS"},{"$f":"INPUT!BV22","v":"ABS"},{"$f":"INPUT!BW22","v":"ABS"},{"$f":"INPUT!BY22","v":""},"","","",null,null,null,null,null,{"$f":"AP22&\"_\"&COUNTIF($AP$5:AP22,AP22)","v":"-_15"}]
[null,{"$f":"INPUT!F23","v":11301338},{"$f":"INPUT!C23","v":"PRABIN TAMANG "},{"$f":"INPUT!D23","v":"2062-02-27"},{"$f":"INPUT!E23","v":"801130210019"},{"$f":"INPUT!G23","v":"0011"},{"$f":"INPUT!I23","v":"C+"},{"$f":"INPUT!J23","v":2.4},{"$f":"INPUT!M23","v":"C+"},{"$f":"INPUT!N23","v":2.4},{"$f":"INPUT!P23","v":"C+"},{"$f":"INPUT!Q23","v":"0031"},{"$f":"INPUT!S23","v":"C+"},{"$f":"INPUT!T23","v":2.4},{"$f":"INPUT!W23","v":"C+"},{"$f":"INPUT!X23","v":2.4},{"$f":"INPUT!Z23","v":"C+"},{"$f":"INPUT!AA23","v":"0051"},{"$f":"INPUT!AC23","v":"A"},{"$f":"INPUT!AD23","v":3.6},{"$f":"INPUT!AG23","v":"A+"},{"$f":"INPUT!AH23","v":4},{"$f":"INPUT!AJ23","v":"A+"},{"$f":"INPUT!AK23","v":1031},{"$f":"INPUT!AM23","v":"B"},{"$f":"INPUT!AN23","v":2.8},{"$f":"INPUT!AQ23","v":"A"},{"$f":"INPUT!AR23","v":3.6},{"$f":"INPUT!AT23","v":"B+"},{"$f":"INPUT!AU23","v":4251},{"$f":"INPUT!AW23","v":"C"},{"$f":"INPUT!AX23","v":2},{"$f":"INPUT!BA23","v":"A+"},{"$f":"INPUT!BB23","v":4},{"$f":"INPUT!BD23","v":"B"},{"$f":"INPUT!BE23","v":4171},{"$f":"INPUT!BG23","v":"B"},{"$f":"INPUT!BH23","v":2.8},{"$f":"INPUT!BK23","v":"ABS"},{"$f":"INPUT!BL23","v":"ABS"},{"$f":"INPUT!BN23","v":"*"},{"$f":"INPUT!BO23","v":"-"},{"$f":"INPUT!BP23","v":0},{"$f":"INPUT!BR23","v":"ABS"},{"$f":"INPUT!BS23","v":"ABS"},{"$f":"INPUT!BV23","v":"ABS"},{"$f":"INPUT!BW23","v":"ABS"},{"$f":"INPUT!BY23","v":""},"","","",null,null,null,null,null,{"$f":"AP23&\"_\"&COUNTIF($AP$5:AP23,AP23)","v":"-_16"}]
[null,{"$f":"INPUT!F24","v":11301339},{"$f":"INPUT!C24","v":"PRAMISAN RAI "},{"$f":"INPUT!D24","v":"2063-05-27"},{"$f":"INPUT!E24","v":"801130210020"},{"$f":"INPUT!G24","v":"0011"},{"$f":"INPUT!I24","v":"C+"},{"$f":"INPUT!J24","v":2.4},{"$f":"INPUT!M24","v":"C+"},{"$f":"INPUT!N24","v":2.4},{"$f":"INPUT!P24","v":"C+"},{"$f":"INPUT!Q24","v":"0031"},{"$f":"INPUT!S24","v":"C+"},{"$f":"INPUT!T24","v":2.4},{"$f":"INPUT!W24","v":"C+"},{"$f":"INPUT!X24","v":2.4},{"$f":"INPUT!Z24","v":"C+"},{"$f":"INPUT!AA24","v":"0051"},{"$f":"INPUT!AC24","v":"A"},{"$f":"INPUT!AD24","v":3.6},{"$f":"INPUT!AG24","v":"A+"},{"$f":"INPUT!AH24","v":4},{"$f":"INPUT!AJ24","v":"A+"},{"$f":"INPUT!AK24","v":1031},{"$f":"INPUT!AM24","v":"B"},{"$f":"INPUT!AN24","v":2.8},{"$f":"INPUT!AQ24","v":"A"},{"$f":"INPUT!AR24","v":3.6},{"$f":"INPUT!AT24","v":"B+"},{"$f":"INPUT!AU24","v":4251},{"$f":"INPUT!AW24","v":"C+"},{"$f":"INPUT!AX24","v":2.4},{"$f":"INPUT!BA24","v":"A+"},{"$f":"INPUT!BB24","v":4},{"$f":"INPUT!BD24","v":"B"},{"$f":"INPUT!BE24","v":4171},{"$f":"INPUT!BG24","v":"C+"},{"$f":"INPUT!BH24","v":2.4},{"$f":"INPUT!BK24","v":"ABS"},{"$f":"INPUT!BL24","v":"ABS"},{"$f":"INPUT!BN24","v":"*"},{"$f":"INPUT!BO24","v":"-"},{"$f":"INPUT!BP24","v":0},{"$f":"INPUT!BR24","v":"ABS"},{"$f":"INPUT!BS24","v":"ABS"},{"$f":"INPUT!BV24","v":"ABS"},{"$f":"INPUT!BW24","v":"ABS"},{"$f":"INPUT!BY24","v":""},"","","",null,null,null,null,null,{"$f":"AP24&\"_\"&COUNTIF($AP$5:AP24,AP24)","v":"-_17"}]
[null,{"$f":"INPUT!F25","v":11301340},{"$f":"INPUT!C25","v":"REJINA RAI "},{"$f":"INPUT!D25","v":"2062-02-27"},{"$f":"INPUT!E25","v":"801130210021"},{"$f":"INPUT!G25","v":"0011"},{"$f":"INPUT!I25","v":"A+"},{"$f":"INPUT!J25","v":4},{"$f":"INPUT!M25","v":"A"},{"$f":"INPUT!N25","v":3.6},{"$f":"INPUT!P25","v":"A+"},{"$f":"INPUT!Q25","v":"0031"},{"$f":"INPUT!S25","v":"A+"},{"$f":"INPUT!T25","v":4},{"$f":"INPUT!W25","v":"A"},{"$f":"INPUT!X25","v":3.6},{"$f":"INPUT!Z25","v":"A+"},{"$f":"INPUT!AA25","v":"0051"},{"$f":"INPUT!AC25","v":"A+"},{"$f":"INPUT!AD25","v":4},{"$f":"INPUT!AG25","v":"A+"},{"$f":"INPUT!AH25","v":4},{"$f":"INPUT!AJ25","v":"A+"},{"$f":"INPUT!AK25","v":1031},{"$f":"INPUT!AM25","v":"A+"},{"$f":"INPUT!AN25","v":4},{"$f":"INPUT!AQ25","v":"A+"},{"$f":"INPUT!AR25","v":4},{"$f":"INPUT!AT25","v":"A+"},{"$f":"INPUT!AU25","v":4251},{"$f":"INPUT!AW25","v":"B"},{"$f":"INPUT!AX25","v":2.8},{"$f":"INPUT!BA25","v":"A+"},{"$f":"INPUT!BB25","v":4},{"$f":"INPUT!BD25","v":"B+"},{"$f":"INPUT!BE25","v":4051},{"$f":"INPUT!BG25","v":"A+"},{"$f":"INPUT!BH25","v":4},{"$f":"INPUT!BK25","v":"ABS"},{"$f":"INPUT!BL25","v":"ABS"},{"$f":"INPUT!BN25","v":"*"},{"$f":"INPUT!BO25","v":"-"},{"$f":"INPUT!BP25","v":0},{"$f":"INPUT!BR25","v":"ABS"},{"$f":"INPUT!BS25","v":"ABS"},{"$f":"INPUT!BV25","v":"ABS"},{"$f":"INPUT!BW25","v":"ABS"},{"$f":"INPUT!BY25","v":""},"","","",null,null,null,null,null,{"$f":"AP25&\"_\"&COUNTIF($AP$5:AP25,AP25)","v":"-_18"}]
[null,{"$f":"INPUT!F26","v":11301341},{"$f":"INPUT!C26","v":"ROHAN JOSHI "},{"$f":"INPUT!D26","v":"2062-04-08"},{"$f":"INPUT!E26","v":"801130210022"},{"$f":"INPUT!G26","v":"0011"},{"$f":"INPUT!I26","v":"B+"},{"$f":"INPUT!J26","v":3.2},{"$f":"INPUT!M26","v":"B+"},{"$f":"INPUT!N26","v":3.2},{"$f":"INPUT!P26","v":"B+"},{"$f":"INPUT!Q26","v":"0031"},{"$f":"INPUT!S26","v":"B+"},{"$f":"INPUT!T26","v":3.2},{"$f":"INPUT!W26","v":"B+"},{"$f":"INPUT!X26","v":3.2},{"$f":"INPUT!Z26","v":"B+"},{"$f":"INPUT!AA26","v":"0051"},{"$f":"INPUT!AC26","v":"B"},{"$f":"INPUT!AD26","v":2.8},{"$f":"INPUT!AG26","v":"A"},{"$f":"INPUT!AH26","v":3.6},{"$f":"INPUT!AJ26","v":"B+"},{"$f":"INPUT!AK26","v":1031},{"$f":"INPUT!AM26","v":"A"},{"$f":"INPUT!AN26","v":3.6},{"$f":"INPUT!AQ26","v":"A+"},{"$f":"INPUT!AR26","v":4},{"$f":"INPUT!AT26","v":"A+"},{"$f":"INPUT!AU26","v":4251},{"$f":"INPUT!AW26","v":"C+"},{"$f":"INPUT!AX26","v":2.4},{"$f":"INPUT!BA26","v":"A+"},{"$f":"INPUT!BB26","v":4},{"$f":"INPUT!BD26","v":"B"},{"$f":"INPUT!BE26","v":4051},{"$f":"INPUT!BG26","v":"A"},{"$f":"INPUT!BH26","v":3.6},{"$f":"INPUT!BK26","v":"ABS"},{"$f":"INPUT!BL26","v":"ABS"},{"$f":"INPUT!BN26","v":"*"},{"$f":"INPUT!BO26","v":"-"},{"$f":"INPUT!BP26","v":0},{"$f":"INPUT!BR26","v":"ABS"},{"$f":"INPUT!BS26","v":"ABS"},{"$f":"INPUT!BV26","v":"ABS"},{"$f":"INPUT!BW26","v":"ABS"},{"$f":"INPUT!BY26","v":""},"","","",null,null,null,null,null,{"$f":"AP26&\"_\"&COUNTIF($AP$5:AP26,AP26)","v":"-_19"}]
[null,{"$f":"INPUT!F27","v":11301342},{"$f":"INPUT!C27","v":"SALINA GAJMER "},{"$f":"INPUT!D27","v":"2063-04-25"},{"$f":"INPUT!E27","v":"801130210023"},{"$f":"INPUT!G27","v":"0011"},{"$f":"INPUT!I27","v":"C"},{"$f":"INPUT!J27","v":2},{"$f":"INPUT!M27","v":"C"},{"$f":"INPUT!N27","v":2},{"$f":"INPUT!P27","v":"C"},{"$f":"INPUT!Q27","v":"0031"},{"$f":"INPUT!S27","v":"C"},{"$f":"INPUT!T27","v":2},{"$f":"INPUT!W27","v":"C"},{"$f":"INPUT!X27","v":2},{"$f":"INPUT!Z27","v":"C"},{"$f":"INPUT!AA27","v":"0051"},{"$f":"INPUT!AC27","v":"B"},{"$f":"INPUT!AD27","v":2.8},{"$f":"INPUT!AG27","v":"A"},{"$f":"INPUT!AH27","v":3.6},{"$f":"INPUT!AJ27","v":"B+"},{"$f":"INPUT!AK27","v":1031},{"$f":"INPUT!AM27","v":"B+"},{"$f":"INPUT!AN27","v":3.2},{"$f":"INPUT!AQ27","v":"A"},{"$f":"INPUT!AR27","v":3.6},{"$f":"INPUT!AT27","v":"A"},{"$f":"INPUT!AU27","v":4251},{"$f":"INPUT!AW27","v":"C+"},{"$f":"INPUT!AX27","v":2.4},{"$f":"INPUT!BA27","v":"A+"},{"$f":"INPUT!BB27","v":4},{"$f":"INPUT!BD27","v":"B"},{"$f":"INPUT!BE27","v":4171},{"$f":"INPUT!BG27","v":"B+"},{"$f":"INPUT!BH27","v":3.2},{"$f":"INPUT!BK27","v":"ABS"},{"$f":"INPUT!BL27","v":"ABS"},{"$f":"INPUT!BN27","v":"*"},{"$f":"INPUT!BO27","v":"-"},{"$f":"INPUT!BP27","v":0},{"$f":"INPUT!BR27","v":"ABS"},{"$f":"INPUT!BS27","v":"ABS"},{"$f":"INPUT!BV27","v":"ABS"},{"$f":"INPUT!BW27","v":"ABS"},{"$f":"INPUT!BY27","v":""},"","","",null,null,null,null,null,{"$f":"AP27&\"_\"&COUNTIF($AP$5:AP27,AP27)","v":"-_20"}]
[null,{"$f":"INPUT!F28","v":11301343},{"$f":"INPUT!C28","v":"SAPHAL SHRESTHA "},{"$f":"INPUT!D28","v":"2062-08-06"},{"$f":"INPUT!E28","v":"801130210024"},{"$f":"INPUT!G28","v":"0011"},{"$f":"INPUT!I28","v":"B+"},{"$f":"INPUT!J28","v":3.2},{"$f":"INPUT!M28","v":"B+"},{"$f":"INPUT!N28","v":3.2},{"$f":"INPUT!P28","v":"B+"},{"$f":"INPUT!Q28","v":"0031"},{"$f":"INPUT!S28","v":"B+"},{"$f":"INPUT!T28","v":3.2},{"$f":"INPUT!W28","v":"B+"},{"$f":"INPUT!X28","v":3.2},{"$f":"INPUT!Z28","v":"B+"},{"$f":"INPUT!AA28","v":"0051"},{"$f":"INPUT!AC28","v":"B+"},{"$f":"INPUT!AD28","v":3.2},{"$f":"INPUT!AG28","v":"A"},{"$f":"INPUT!AH28","v":3.6},{"$f":"INPUT!AJ28","v":"A"},{"$f":"INPUT!AK28","v":1031},{"$f":"INPUT!AM28","v":"A+"},{"$f":"INPUT!AN28","v":4},{"$f":"INPUT!AQ28","v":"A+"},{"$f":"INPUT!AR28","v":4},{"$f":"INPUT!AT28","v":"A+"},{"$f":"INPUT!AU28","v":4251},{"$f":"INPUT!AW28","v":"C+"},{"$f":"INPUT!AX28","v":2.4},{"$f":"INPUT!BA28","v":"A+"},{"$f":"INPUT!BB28","v":4},{"$f":"INPUT!BD28","v":"B"},{"$f":"INPUT!BE28","v":4171},{"$f":"INPUT!BG28","v":"B+"},{"$f":"INPUT!BH28","v":3.2},{"$f":"INPUT!BK28","v":"ABS"},{"$f":"INPUT!BL28","v":"ABS"},{"$f":"INPUT!BN28","v":"*"},{"$f":"INPUT!BO28","v":"-"},{"$f":"INPUT!BP28","v":0},{"$f":"INPUT!BR28","v":"ABS"},{"$f":"INPUT!BS28","v":"ABS"},{"$f":"INPUT!BV28","v":"ABS"},{"$f":"INPUT!BW28","v":"ABS"},{"$f":"INPUT!BY28","v":""},"","","",null,null,null,null,null,{"$f":"AP28&\"_\"&COUNTIF($AP$5:AP28,AP28)","v":"-_21"}]
[null,{"$f":"INPUT!F29","v":11301344},{"$f":"INPUT!C29","v":"SAUGAT SHRESTHA "},{"$f":"INPUT!D29","v":"2062-01-05"},{"$f":"INPUT!E29","v":"801130210025"},{"$f":"INPUT!G29","v":"0011"},{"$f":"INPUT!I29","v":"C+"},{"$f":"INPUT!J29","v":2.4},{"$f":"INPUT!M29","v":"C"},{"$f":"INPUT!N29","v":2},{"$f":"INPUT!P29","v":"C+"},{"$f":"INPUT!Q29","v":"0031"},{"$f":"INPUT!S29","v":"C+"},{"$f":"INPUT!T29","v":2.4},{"$f":"INPUT!W29","v":"C"},{"$f":"INPUT!X29","v":2},{"$f":"INPUT!Z29","v":"C+"},{"$f":"INPUT!AA29","v":"0051"},{"$f":"INPUT!AC29","v":"B+"},{"$f":"INPUT!AD29","v":3.2},{"$f":"INPUT!AG29","v":"A"},{"$f":"INPUT!AH29","v":3.6},{"$f":"INPUT!AJ29","v":"A"},{"$f":"INPUT!AK29","v":1031},{"$f":"INPUT!AM29","v":"B"},{"$f":"INPUT!AN29","v":2.8},{"$f":"INPUT!AQ29","v":"A"},{"$f":"INPUT!AR29","v":3.6},{"$f":"INPUT!AT29","v":"B+"},{"$f":"INPUT!AU29","v":4251},{"$f":"INPUT!AW29","v":"C"},{"$f":"INPUT!AX29","v":2},{"$f":"INPUT!BA29","v":"A+"},{"$f":"INPUT!BB29","v":4},{"$f":"INPUT!BD29","v":"B"},{"$f":"INPUT!BE29","v":4171},{"$f":"INPUT!BG29","v":"C+"},{"$f":"INPUT!BH29","v":2.4},{"$f":"INPUT!BK29","v":"ABS"},{"$f":"INPUT!BL29","v":"ABS"},{"$f":"INPUT!BN29","v":"*"},{"$f":"INPUT!BO29","v":"-"},{"$f":"INPUT!BP29","v":0},{"$f":"INPUT!BR29","v":"ABS"},{"$f":"INPUT!BS29","v":"ABS"},{"$f":"INPUT!BV29","v":"ABS"},{"$f":"INPUT!BW29","v":"ABS"},{"$f":"INPUT!BY29","v":""},"","","",null,null,null,null,null,{"$f":"AP29&\"_\"&COUNTIF($AP$5:AP29,AP29)","v":"-_22"}]
[null,{"$f":"INPUT!F30","v":11301345},{"$f":"INPUT!C30","v":"SIKSHA RAI "},{"$f":"INPUT!D30","v":"2064-03-21"},{"$f":"INPUT!E30","v":"801130210026"},{"$f":"INPUT!G30","v":"0011"},{"$f":"INPUT!I30","v":"B"},{"$f":"INPUT!J30","v":2.8},{"$f":"INPUT!M30","v":"C+"},{"$f":"INPUT!N30","v":2.4},{"$f":"INPUT!P30","v":"B"},{"$f":"INPUT!Q30","v":"0031"},{"$f":"INPUT!S30","v":"B"},{"$f":"INPUT!T30","v":2.8},{"$f":"INPUT!W30","v":"C+"},{"$f":"INPUT!X30","v":2.4},{"$f":"INPUT!Z30","v":"B"},{"$f":"INPUT!AA30","v":"0051"},{"$f":"INPUT!AC30","v":"A+"},{"$f":"INPUT!AD30","v":4},{"$f":"INPUT!AG30","v":"A+"},{"$f":"INPUT!AH30","v":4},{"$f":"INPUT!AJ30","v":"A+"},{"$f":"INPUT!AK30","v":1031},{"$f":"INPUT!AM30","v":"A+"},{"$f":"INPUT!AN30","v":4},{"$f":"INPUT!AQ30","v":"A+"},{"$f":"INPUT!AR30","v":4},{"$f":"INPUT!AT30","v":"A+"},{"$f":"INPUT!AU30","v":4251},{"$f":"INPUT!AW30","v":"C+"},{"$f":"INPUT!AX30","v":2.4},{"$f":"INPUT!BA30","v":"A+"},{"$f":"INPUT!BB30","v":4},{"$f":"INPUT!BD30","v":"B"},{"$f":"INPUT!BE30","v":4051},{"$f":"INPUT!BG30","v":"A+"},{"$f":"INPUT!BH30","v":4},{"$f":"INPUT!BK30","v":"ABS"},{"$f":"INPUT!BL30","v":"ABS"},{"$f":"INPUT!BN30","v":"*"},{"$f":"INPUT!BO30","v":"-"},{"$f":"INPUT!BP30","v":0},{"$f":"INPUT!BR30","v":"ABS"},{"$f":"INPUT!BS30","v":"ABS"},{"$f":"INPUT!BV30","v":"ABS"},{"$f":"INPUT!BW30","v":"ABS"},{"$f":"INPUT!BY30","v":""},"","","",null,null,null,null,null,{"$f":"AP30&\"_\"&COUNTIF($AP$5:AP30,AP30)","v":"-_23"}]
[null,{"$f":"INPUT!F31","v":0},{"$f":"INPUT!C31","v":"ESAN  RAI"},{"$f":"INPUT!D31","v":"MALE"},{"$f":"INPUT!E31","v":58291},{"$f":"INPUT!G31","v":"0011"},{"$f":"INPUT!I31","v":"ABS"},{"$f":"INPUT!J31","v":"ABS"},{"$f":"INPUT!M31","v":"ABS"},{"$f":"INPUT!N31","v":"ABS"},{"$f":"INPUT!P31","v":"*"},{"$f":"INPUT!Q31","v":"0031"},{"$f":"INPUT!S31","v":"ABS"},{"$f":"INPUT!T31","v":"ABS"},{"$f":"INPUT!W31","v":"ABS"},{"$f":"INPUT!X31","v":"ABS"},{"$f":"INPUT!Z31","v":"*"},{"$f":"INPUT!AA31","v":"0051"},{"$f":"INPUT!AC31","v":"ABS"},{"$f":"INPUT!AD31","v":"ABS"},{"$f":"INPUT!AG31","v":"ABS"},{"$f":"INPUT!AH31","v":"ABS"},{"$f":"INPUT!AJ31","v":"*"},{"$f":"INPUT!AK31","v":0},{"$f":"INPUT!AM31","v":"ABS"},{"$f":"INPUT!AN31","v":"ABS"},{"$f":"INPUT!AQ31","v":"ABS"},{"$f":"INPUT!AR31","v":"ABS"},{"$f":"INPUT!AT31","v":"*"},{"$f":"INPUT!AU31","v":0},{"$f":"INPUT!AW31","v":"ABS"},{"$f":"INPUT!AX31","v":"ABS"},{"$f":"INPUT!BA31","v":"ABS"},{"$f":"INPUT!BB31","v":"ABS"},{"$f":"INPUT!BD31","v":"*"},{"$f":"INPUT!BE31","v":0},{"$f":"INPUT!BG31","v":"ABS"},{"$f":"INPUT!BH31","v":"ABS"},{"$f":"INPUT!BK31","v":"ABS"},{"$f":"INPUT!BL31","v":"ABS"},{"$f":"INPUT!BN31","v":"*"},{"$f":"INPUT!BO31","v":"-"},{"$f":"INPUT!BP31","v":0},{"$f":"INPUT!BR31","v":"ABS"},{"$f":"INPUT!BS31","v":"ABS"},{"$f":"INPUT!BV31","v":"ABS"},{"$f":"INPUT!BW31","v":"ABS"},{"$f":"INPUT!BY31","v":""},"","ABS","",null,null,null,null,null,{"$f":"AP31&\"_\"&COUNTIF($AP$5:AP31,AP31)","v":"-_24"}]
[null,{"$f":"INPUT!F32","v":0},{"$f":"INPUT!C32","v":"ESHAN  RAI"},{"$f":"INPUT!D32","v":"MALE"},{"$f":"INPUT!E32","v":59856},{"$f":"INPUT!G32","v":"0011"},{"$f":"INPUT!I32","v":"ABS"},{"$f":"INPUT!J32","v":"ABS"},{"$f":"INPUT!M32","v":"ABS"},{"$f":"INPUT!N32","v":"ABS"},{"$f":"INPUT!P32","v":"*"},{"$f":"INPUT!Q32","v":"0031"},{"$f":"INPUT!S32","v":"ABS"},{"$f":"INPUT!T32","v":"ABS"},{"$f":"INPUT!W32","v":"ABS"},{"$f":"INPUT!X32","v":"ABS"},{"$f":"INPUT!Z32","v":"*"},{"$f":"INPUT!AA32","v":"0051"},{"$f":"INPUT!AC32","v":"ABS"},{"$f":"INPUT!AD32","v":"ABS"},{"$f":"INPUT!AG32","v":"ABS"},{"$f":"INPUT!AH32","v":"ABS"},{"$f":"INPUT!AJ32","v":"*"},{"$f":"INPUT!AK32","v":0},{"$f":"INPUT!AM32","v":"ABS"},{"$f":"INPUT!AN32","v":"ABS"},{"$f":"INPUT!AQ32","v":"ABS"},{"$f":"INPUT!AR32","v":"ABS"},{"$f":"INPUT!AT32","v":"*"},{"$f":"INPUT!AU32","v":0},{"$f":"INPUT!AW32","v":"ABS"},{"$f":"INPUT!AX32","v":"ABS"},{"$f":"INPUT!BA32","v":"ABS"},{"$f":"INPUT!BB32","v":"ABS"},{"$f":"INPUT!BD32","v":"*"},{"$f":"INPUT!BE32","v":0},{"$f":"INPUT!BG32","v":"ABS"},{"$f":"INPUT!BH32","v":"ABS"},{"$f":"INPUT!BK32","v":"ABS"},{"$f":"INPUT!BL32","v":"ABS"},{"$f":"INPUT!BN32","v":"*"},{"$f":"INPUT!BO32","v":"-"},{"$f":"INPUT!BP32","v":0},{"$f":"INPUT!BR32","v":"ABS"},{"$f":"INPUT!BS32","v":"ABS"},{"$f":"INPUT!BV32","v":"ABS"},{"$f":"INPUT!BW32","v":"ABS"},{"$f":"INPUT!BY32","v":""},"","ABS","",null,null,null,null,null,{"$f":"AP32&\"_\"&COUNTIF($AP$5:AP32,AP32)","v":"-_25"}]
[null,{"$f":"INPUT!F33","v":0},{"$f":"INPUT!C33","v":"INDESH  RAI"},{"$f":"INPUT!D33","v":"MALE"},{"$f":"INPUT!E33","v":58546},{"$f":"INPUT!G33","v":"0011"},{"$f":"INPUT!I33","v":"ABS"},{"$f":"INPUT!J33","v":"ABS"},{"$f":"INPUT!M33","v":"ABS"},{"$f":"INPUT!N33","v":"ABS"},{"$f":"INPUT!P33","v":"*"},{"$f":"INPUT!Q33","v":"0031"},{"$f":"INPUT!S33","v":"ABS"},{"$f":"INPUT!T33","v":"ABS"},{"$f":"INPUT!W33","v":"ABS"},{"$f":"INPUT!X33","v":"ABS"},{"$f":"INPUT!Z33","v":"*"},{"$f":"INPUT!AA33","v":"0051"},{"$f":"INPUT!AC33","v":"ABS"},{"$f":"INPUT!AD33","v":"ABS"},{"$f":"INPUT!AG33","v":"ABS"},{"$f":"INPUT!AH33","v":"ABS"},{"$f":"INPUT!AJ33","v":"*"},{"$f":"INPUT!AK33","v":0},{"$f":"INPUT!AM33","v":"ABS"},{"$f":"INPUT!AN33","v":"ABS"},{"$f":"INPUT!AQ33","v":"ABS"},{"$f":"INPUT!AR33","v":"ABS"},{"$f":"INPUT!AT33","v":"*"},{"$f":"INPUT!AU33","v":0},{"$f":"INPUT!AW33","v":"ABS"},{"$f":"INPUT!AX33","v":"ABS"},{"$f":"INPUT!BA33","v":"ABS"},{"$f":"INPUT!BB33","v":"ABS"},{"$f":"INPUT!BD33","v":"*"},{"$f":"INPUT!BE33","v":0},{"$f":"INPUT!BG33","v":"ABS"},{"$f":"INPUT!BH33","v":"ABS"},{"$f":"INPUT!BK33","v":"ABS"},{"$f":"INPUT!BL33","v":"ABS"},{"$f":"INPUT!BN33","v":"*"},{"$f":"INPUT!BO33","v":"-"},{"$f":"INPUT!BP33","v":0},{"$f":"INPUT!BR33","v":"ABS"},{"$f":"INPUT!BS33","v":"ABS"},{"$f":"INPUT!BV33","v":"ABS"},{"$f":"INPUT!BW33","v":"ABS"},{"$f":"INPUT!BY33","v":""},"","ABS","",null,null,null,null,null,{"$f":"AP33&\"_\"&COUNTIF($AP$5:AP33,AP33)","v":"-_26"}]
[null,{"$f":"INPUT!F34","v":0},{"$f":"INPUT!C34","v":"JENY  RAI"},{"$f":"INPUT!D34","v":"FEMALE"},{"$f":"INPUT!E34","v":58353},{"$f":"INPUT!G34","v":"0011"},{"$f":"INPUT!I34","v":"ABS"},{"$f":"INPUT!J34","v":"ABS"},{"$f":"INPUT!M34","v":"ABS"},{"$f":"INPUT!N34","v":"ABS"},{"$f":"INPUT!P34","v":"*"},{"$f":"INPUT!Q34","v":"0031"},{"$f":"INPUT!S34","v":"ABS"},{"$f":"INPUT!T34","v":"ABS"},{"$f":"INPUT!W34","v":"ABS"},{"$f":"INPUT!X34","v":"ABS"},{"$f":"INPUT!Z34","v":"*"},{"$f":"INPUT!AA34","v":"0051"},{"$f":"INPUT!AC34","v":"ABS"},{"$f":"INPUT!AD34","v":"ABS"},{"$f":"INPUT!AG34","v":"ABS"},{"$f":"INPUT!AH34","v":"ABS"},{"$f":"INPUT!AJ34","v":"*"},{"$f":"INPUT!AK34","v":0},{"$f":"INPUT!AM34","v":"ABS"},{"$f":"INPUT!AN34","v":"ABS"},{"$f":"INPUT!AQ34","v":"ABS"},{"$f":"INPUT!AR34","v":"ABS"},{"$f":"INPUT!AT34","v":"*"},{"$f":"INPUT!AU34","v":0},{"$f":"INPUT!AW34","v":"ABS"},{"$f":"INPUT!AX34","v":"ABS"},{"$f":"INPUT!BA34","v":"ABS"},{"$f":"INPUT!BB34","v":"ABS"},{"$f":"INPUT!BD34","v":"*"},{"$f":"INPUT!BE34","v":0},{"$f":"INPUT!BG34","v":"ABS"},{"$f":"INPUT!BH34","v":"ABS"},{"$f":"INPUT!BK34","v":"ABS"},{"$f":"INPUT!BL34","v":"ABS"},{"$f":"INPUT!BN34","v":"*"},{"$f":"INPUT!BO34","v":"-"},{"$f":"INPUT!BP34","v":0},{"$f":"INPUT!BR34","v":"ABS"},{"$f":"INPUT!BS34","v":"ABS"},{"$f":"INPUT!BV34","v":"ABS"},{"$f":"INPUT!BW34","v":"ABS"},{"$f":"INPUT!BY34","v":""},"","ABS","",null,null,null,null,null,{"$f":"AP34&\"_\"&COUNTIF($AP$5:AP34,AP34)","v":"-_27"}]
[null,{"$f":"INPUT!F35","v":0},{"$f":"INPUT!C35","v":"MANOJ  MAGAR"},{"$f":"INPUT!D35","v":"MALE"},{"$f":"INPUT!E35","v":59378},{"$f":"INPUT!G35","v":"0011"},{"$f":"INPUT!I35","v":"ABS"},{"$f":"INPUT!J35","v":"ABS"},{"$f":"INPUT!M35","v":"ABS"},{"$f":"INPUT!N35","v":"ABS"},{"$f":"INPUT!P35","v":"*"},{"$f":"INPUT!Q35","v":"0031"},{"$f":"INPUT!S35","v":"ABS"},{"$f":"INPUT!T35","v":"ABS"},{"$f":"INPUT!W35","v":"ABS"},{"$f":"INPUT!X35","v":"ABS"},{"$f":"INPUT!Z35","v":"*"},{"$f":"INPUT!AA35","v":"0051"},{"$f":"INPUT!AC35","v":"ABS"},{"$f":"INPUT!AD35","v":"ABS"},{"$f":"INPUT!AG35","v":"ABS"},{"$f":"INPUT!AH35","v":"ABS"},{"$f":"INPUT!AJ35","v":"*"},{"$f":"INPUT!AK35","v":0},{"$f":"INPUT!AM35","v":"ABS"},{"$f":"INPUT!AN35","v":"ABS"},{"$f":"INPUT!AQ35","v":"ABS"},{"$f":"INPUT!AR35","v":"ABS"},{"$f":"INPUT!AT35","v":"*"},{"$f":"INPUT!AU35","v":0},{"$f":"INPUT!AW35","v":"ABS"},{"$f":"INPUT!AX35","v":"ABS"},{"$f":"INPUT!BA35","v":"ABS"},{"$f":"INPUT!BB35","v":"ABS"},{"$f":"INPUT!BD35","v":"*"},{"$f":"INPUT!BE35","v":0},{"$f":"INPUT!BG35","v":"ABS"},{"$f":"INPUT!BH35","v":"ABS"},{"$f":"INPUT!BK35","v":"ABS"},{"$f":"INPUT!BL35","v":"ABS"},{"$f":"INPUT!BN35","v":"*"},{"$f":"INPUT!BO35","v":"-"},{"$f":"INPUT!BP35","v":0},{"$f":"INPUT!BR35","v":"ABS"},{"$f":"INPUT!BS35","v":"ABS"},{"$f":"INPUT!BV35","v":"ABS"},{"$f":"INPUT!BW35","v":"ABS"},{"$f":"INPUT!BY35","v":""},"","ABS","",null,null,null,null,null,{"$f":"AP35&\"_\"&COUNTIF($AP$5:AP35,AP35)","v":"-_28"}]
[null,{"$f":"INPUT!F36","v":0},{"$f":"INPUT!C36","v":0},{"$f":"INPUT!D36","v":"00:00:00"},{"$f":"INPUT!E36","v":0},{"$f":"INPUT!G36","v":"0011"},{"$f":"INPUT!I36","v":"ABS"},{"$f":"INPUT!J36","v":"ABS"},{"$f":"INPUT!M36","v":"ABS"},{"$f":"INPUT!N36","v":"ABS"},{"$f":"INPUT!P36","v":"*"},{"$f":"INPUT!Q36","v":"0031"},{"$f":"INPUT!S36","v":"ABS"},{"$f":"INPUT!T36","v":"ABS"},{"$f":"INPUT!W36","v":"ABS"},{"$f":"INPUT!X36","v":"ABS"},{"$f":"INPUT!Z36","v":"*"},{"$f":"INPUT!AA36","v":"0051"},{"$f":"INPUT!AC36","v":"ABS"},{"$f":"INPUT!AD36","v":"ABS"},{"$f":"INPUT!AG36","v":"ABS"},{"$f":"INPUT!AH36","v":"ABS"},{"$f":"INPUT!AJ36","v":"*"},{"$f":"INPUT!AK36","v":0},{"$f":"INPUT!AM36","v":"ABS"},{"$f":"INPUT!AN36","v":"ABS"},{"$f":"INPUT!AQ36","v":"ABS"},{"$f":"INPUT!AR36","v":"ABS"},{"$f":"INPUT!AT36","v":"*"},{"$f":"INPUT!AU36","v":0},{"$f":"INPUT!AW36","v":"ABS"},{"$f":"INPUT!AX36","v":"ABS"},{"$f":"INPUT!BA36","v":"ABS"},{"$f":"INPUT!BB36","v":"ABS"},{"$f":"INPUT!BD36","v":"*"},{"$f":"INPUT!BE36","v":0},{"$f":"INPUT!BG36","v":"ABS"},{"$f":"INPUT!BH36","v":"ABS"},{"$f":"INPUT!BK36","v":"ABS"},{"$f":"INPUT!BL36","v":"ABS"},{"$f":"INPUT!BN36","v":"*"},{"$f":"INPUT!BO36","v":"-"},{"$f":"INPUT!BP36","v":0},{"$f":"INPUT!BR36","v":"ABS"},{"$f":"INPUT!BS36","v":"ABS"},{"$f":"INPUT!BV36","v":"ABS"},{"$f":"INPUT!BW36","v":"ABS"},{"$f":"INPUT!BY36","v":""},"","ABS","",null,null,null,null,null,{"$f":"AP36&\"_\"&COUNTIF($AP$5:AP36,AP36)","v":"-_29"}]
[null,{"$f":"INPUT!F37","v":0},{"$f":"INPUT!C37","v":0},{"$f":"INPUT!D37","v":"00:00:00"},{"$f":"INPUT!E37","v":0},{"$f":"INPUT!G37","v":"0011"},{"$f":"INPUT!I37","v":"ABS"},{"$f":"INPUT!J37","v":"ABS"},{"$f":"INPUT!M37","v":"ABS"},{"$f":"INPUT!N37","v":"ABS"},{"$f":"INPUT!P37","v":"*"},{"$f":"INPUT!Q37","v":"0031"},{"$f":"INPUT!S37","v":"ABS"},{"$f":"INPUT!T37","v":"ABS"},{"$f":"INPUT!W37","v":"ABS"},{"$f":"INPUT!X37","v":"ABS"},{"$f":"INPUT!Z37","v":"*"},{"$f":"INPUT!AA37","v":"0051"},{"$f":"INPUT!AC37","v":"ABS"},{"$f":"INPUT!AD37","v":"ABS"},{"$f":"INPUT!AG37","v":"ABS"},{"$f":"INPUT!AH37","v":"ABS"},{"$f":"INPUT!AJ37","v":"*"},{"$f":"INPUT!AK37","v":0},{"$f":"INPUT!AM37","v":"ABS"},{"$f":"INPUT!AN37","v":"ABS"},{"$f":"INPUT!AQ37","v":"ABS"},{"$f":"INPUT!AR37","v":"ABS"},{"$f":"INPUT!AT37","v":"*"},{"$f":"INPUT!AU37","v":0},{"$f":"INPUT!AW37","v":"ABS"},{"$f":"INPUT!AX37","v":"ABS"},{"$f":"INPUT!BA37","v":"ABS"},{"$f":"INPUT!BB37","v":"ABS"},{"$f":"INPUT!BD37","v":"*"},{"$f":"INPUT!BE37","v":0},{"$f":"INPUT!BG37","v":"ABS"},{"$f":"INPUT!BH37","v":"ABS"},{"$f":"INPUT!BK37","v":"ABS"},{"$f":"INPUT!BL37","v":"ABS"},{"$f":"INPUT!BN37","v":"*"},{"$f":"INPUT!BO37","v":"-"},{"$f":"INPUT!BP37","v":0},{"$f":"INPUT!BR37","v":"ABS"},{"$f":"INPUT!BS37","v":"ABS"},{"$f":"INPUT!BV37","v":"ABS"},{"$f":"INPUT!BW37","v":"ABS"},{"$f":"INPUT!BY37","v":""},"","ABS","",null,null,null,null,null,{"$f":"AP37&\"_\"&COUNTIF($AP$5:AP37,AP37)","v":"-_30"}]
[null,{"$f":"INPUT!F38","v":0},{"$f":"INPUT!C38","v":0},{"$f":"INPUT!D38","v":"00:00:00"},{"$f":"INPUT!E38","v":0},{"$f":"INPUT!G38","v":"0011"},{"$f":"INPUT!I38","v":"ABS"},{"$f":"INPUT!J38","v":"ABS"},{"$f":"INPUT!M38","v":"ABS"},{"$f":"INPUT!N38","v":"ABS"},{"$f":"INPUT!P38","v":"*"},{"$f":"INPUT!Q38","v":"0031"},{"$f":"INPUT!S38","v":"ABS"},{"$f":"INPUT!T38","v":"ABS"},{"$f":"INPUT!W38","v":"ABS"},{"$f":"INPUT!X38","v":"ABS"},{"$f":"INPUT!Z38","v":"*"},{"$f":"INPUT!AA38","v":"0051"},{"$f":"INPUT!AC38","v":"ABS"},{"$f":"INPUT!AD38","v":"ABS"},{"$f":"INPUT!AG38","v":"ABS"},{"$f":"INPUT!AH38","v":"ABS"},{"$f":"INPUT!AJ38","v":"*"},{"$f":"INPUT!AK38","v":0},{"$f":"INPUT!AM38","v":"ABS"},{"$f":"INPUT!AN38","v":"ABS"},{"$f":"INPUT!AQ38","v":"ABS"},{"$f":"INPUT!AR38","v":"ABS"},{"$f":"INPUT!AT38","v":"*"},{"$f":"INPUT!AU38","v":0},{"$f":"INPUT!AW38","v":"ABS"},{"$f":"INPUT!AX38","v":"ABS"},{"$f":"INPUT!BA38","v":"ABS"},{"$f":"INPUT!BB38","v":"ABS"},{"$f":"INPUT!BD38","v":"*"},{"$f":"INPUT!BE38","v":0},{"$f":"INPUT!BG38","v":"ABS"},{"$f":"INPUT!BH38","v":"ABS"},{"$f":"INPUT!BK38","v":"ABS"},{"$f":"INPUT!BL38","v":"ABS"},{"$f":"INPUT!BN38","v":"*"},{"$f":"INPUT!BO38","v":"-"},{"$f":"INPUT!BP38","v":0},{"$f":"INPUT!BR38","v":"ABS"},{"$f":"INPUT!BS38","v":"ABS"},{"$f":"INPUT!BV38","v":"ABS"},{"$f":"INPUT!BW38","v":"ABS"},{"$f":"INPUT!BY38","v":""},"","ABS","",null,null,null,null,null,{"$f":"AP38&\"_\"&COUNTIF($AP$5:AP38,AP38)","v":"-_31"}]
[null,{"$f":"INPUT!F39","v":0},{"$f":"INPUT!C39","v":0},{"$f":"INPUT!D39","v":"00:00:00"},{"$f":"INPUT!E39","v":0},{"$f":"INPUT!G39","v":"0011"},{"$f":"INPUT!I39","v":"ABS"},{"$f":"INPUT!J39","v":"ABS"},{"$f":"INPUT!M39","v":"ABS"},{"$f":"INPUT!N39","v":"ABS"},{"$f":"INPUT!P39","v":"*"},{"$f":"INPUT!Q39","v":"0031"},{"$f":"INPUT!S39","v":"ABS"},{"$f":"INPUT!T39","v":"ABS"},{"$f":"INPUT!W39","v":"ABS"},{"$f":"INPUT!X39","v":"ABS"},{"$f":"INPUT!Z39","v":"*"},{"$f":"INPUT!AA39","v":"0051"},{"$f":"INPUT!AC39","v":"ABS"},{"$f":"INPUT!AD39","v":"ABS"},{"$f":"INPUT!AG39","v":"ABS"},{"$f":"INPUT!AH39","v":"ABS"},{"$f":"INPUT!AJ39","v":"*"},{"$f":"INPUT!AK39","v":0},{"$f":"INPUT!AM39","v":"ABS"},{"$f":"INPUT!AN39","v":"ABS"},{"$f":"INPUT!AQ39","v":"ABS"},{"$f":"INPUT!AR39","v":"ABS"},{"$f":"INPUT!AT39","v":"*"},{"$f":"INPUT!AU39","v":0},{"$f":"INPUT!AW39","v":"ABS"},{"$f":"INPUT!AX39","v":"ABS"},{"$f":"INPUT!BA39","v":"ABS"},{"$f":"INPUT!BB39","v":"ABS"},{"$f":"INPUT!BD39","v":"*"},{"$f":"INPUT!BE39","v":0},{"$f":"INPUT!BG39","v":"ABS"},{"$f":"INPUT!BH39","v":"ABS"},{"$f":"INPUT!BK39","v":"ABS"},{"$f":"INPUT!BL39","v":"ABS"},{"$f":"INPUT!BN39","v":"*"},{"$f":"INPUT!BO39","v":"-"},{"$f":"INPUT!BP39","v":0},{"$f":"INPUT!BR39","v":"ABS"},{"$f":"INPUT!BS39","v":"ABS"},{"$f":"INPUT!BV39","v":"ABS"},{"$f":"INPUT!BW39","v":"ABS"},{"$f":"INPUT!BY39","v":""},"","ABS","",null,null,null,null,null,{"$f":"AP39&\"_\"&COUNTIF($AP$5:AP39,AP39)","v":"-_32"}]
[null,{"$f":"INPUT!F40","v":0},{"$f":"INPUT!C40","v":0},{"$f":"INPUT!D40","v":"00:00:00"},{"$f":"INPUT!E40","v":0},{"$f":"INPUT!G40","v":"0011"},{"$f":"INPUT!I40","v":"ABS"},{"$f":"INPUT!J40","v":"ABS"},{"$f":"INPUT!M40","v":"ABS"},{"$f":"INPUT!N40","v":"ABS"},{"$f":"INPUT!P40","v":"*"},{"$f":"INPUT!Q40","v":"0031"},{"$f":"INPUT!S40","v":"ABS"},{"$f":"INPUT!T40","v":"ABS"},{"$f":"INPUT!W40","v":"ABS"},{"$f":"INPUT!X40","v":"ABS"},{"$f":"INPUT!Z40","v":"*"},{"$f":"INPUT!AA40","v":"0051"},{"$f":"INPUT!AC40","v":"ABS"},{"$f":"INPUT!AD40","v":"ABS"},{"$f":"INPUT!AG40","v":"ABS"},{"$f":"INPUT!AH40","v":"ABS"},{"$f":"INPUT!AJ40","v":"*"},{"$f":"INPUT!AK40","v":0},{"$f":"INPUT!AM40","v":"ABS"},{"$f":"INPUT!AN40","v":"ABS"},{"$f":"INPUT!AQ40","v":"ABS"},{"$f":"INPUT!AR40","v":"ABS"},{"$f":"INPUT!AT40","v":"*"},{"$f":"INPUT!AU40","v":0},{"$f":"INPUT!AW40","v":"ABS"},{"$f":"INPUT!AX40","v":"ABS"},{"$f":"INPUT!BA40","v":"ABS"},{"$f":"INPUT!BB40","v":"ABS"},{"$f":"INPUT!BD40","v":"*"},{"$f":"INPUT!BE40","v":0},{"$f":"INPUT!BG40","v":"ABS"},{"$f":"INPUT!BH40","v":"ABS"},{"$f":"INPUT!BK40","v":"ABS"},{"$f":"INPUT!BL40","v":"ABS"},{"$f":"INPUT!BN40","v":"*"},{"$f":"INPUT!BO40","v":"-"},{"$f":"INPUT!BP40","v":0},{"$f":"INPUT!BR40","v":"ABS"},{"$f":"INPUT!BS40","v":"ABS"},{"$f":"INPUT!BV40","v":"ABS"},{"$f":"INPUT!BW40","v":"ABS"},{"$f":"INPUT!BY40","v":""},"","ABS","",null,null,null,null,null,{"$f":"AP40&\"_\"&COUNTIF($AP$5:AP40,AP40)","v":"-_33"}]
[null,{"$f":"INPUT!F41","v":0},{"$f":"INPUT!C41","v":0},{"$f":"INPUT!D41","v":"00:00:00"},{"$f":"INPUT!E41","v":0},{"$f":"INPUT!G41","v":"0011"},{"$f":"INPUT!I41","v":"ABS"},{"$f":"INPUT!J41","v":"ABS"},{"$f":"INPUT!M41","v":"ABS"},{"$f":"INPUT!N41","v":"ABS"},{"$f":"INPUT!P41","v":"*"},{"$f":"INPUT!Q41","v":"0031"},{"$f":"INPUT!S41","v":"ABS"},{"$f":"INPUT!T41","v":"ABS"},{"$f":"INPUT!W41","v":"ABS"},{"$f":"INPUT!X41","v":"ABS"},{"$f":"INPUT!Z41","v":"*"},{"$f":"INPUT!AA41","v":"0051"},{"$f":"INPUT!AC41","v":"ABS"},{"$f":"INPUT!AD41","v":"ABS"},{"$f":"INPUT!AG41","v":"ABS"},{"$f":"INPUT!AH41","v":"ABS"},{"$f":"INPUT!AJ41","v":"*"},{"$f":"INPUT!AK41","v":0},{"$f":"INPUT!AM41","v":"ABS"},{"$f":"INPUT!AN41","v":"ABS"},{"$f":"INPUT!AQ41","v":"ABS"},{"$f":"INPUT!AR41","v":"ABS"},{"$f":"INPUT!AT41","v":"*"},{"$f":"INPUT!AU41","v":0},{"$f":"INPUT!AW41","v":"ABS"},{"$f":"INPUT!AX41","v":"ABS"},{"$f":"INPUT!BA41","v":"ABS"},{"$f":"INPUT!BB41","v":"ABS"},{"$f":"INPUT!BD41","v":"*"},{"$f":"INPUT!BE41","v":0},{"$f":"INPUT!BG41","v":"ABS"},{"$f":"INPUT!BH41","v":"ABS"},{"$f":"INPUT!BK41","v":"ABS"},{"$f":"INPUT!BL41","v":"ABS"},{"$f":"INPUT!BN41","v":"*"},{"$f":"INPUT!BO41","v":"-"},{"$f":"INPUT!BP41","v":0},{"$f":"INPUT!BR41","v":"ABS"},{"$f":"INPUT!BS41","v":"ABS"},{"$f":"INPUT!BV41","v":"ABS"},{"$f":"INPUT!BW41","v":"ABS"},{"$f":"INPUT!BY41","v":""},"","ABS","",null,null,null,null,null,{"$f":"AP41&\"_\"&COUNTIF($AP$5:AP41,AP41)","v":"-_34"}]
[null,{"$f":"INPUT!F42","v":0},{"$f":"INPUT!C42","v":0},{"$f":"INPUT!D42","v":"00:00:00"},{"$f":"INPUT!E42","v":0},{"$f":"INPUT!G42","v":"0011"},{"$f":"INPUT!I42","v":"ABS"},{"$f":"INPUT!J42","v":"ABS"},{"$f":"INPUT!M42","v":"ABS"},{"$f":"INPUT!N42","v":"ABS"},{"$f":"INPUT!P42","v":"*"},{"$f":"INPUT!Q42","v":"0031"},{"$f":"INPUT!S42","v":"ABS"},{"$f":"INPUT!T42","v":"ABS"},{"$f":"INPUT!W42","v":"ABS"},{"$f":"INPUT!X42","v":"ABS"},{"$f":"INPUT!Z42","v":"*"},{"$f":"INPUT!AA42","v":"0051"},{"$f":"INPUT!AC42","v":"ABS"},{"$f":"INPUT!AD42","v":"ABS"},{"$f":"INPUT!AG42","v":"ABS"},{"$f":"INPUT!AH42","v":"ABS"},{"$f":"INPUT!AJ42","v":"*"},{"$f":"INPUT!AK42","v":0},{"$f":"INPUT!AM42","v":"ABS"},{"$f":"INPUT!AN42","v":"ABS"},{"$f":"INPUT!AQ42","v":"ABS"},{"$f":"INPUT!AR42","v":"ABS"},{"$f":"INPUT!AT42","v":"*"},{"$f":"INPUT!AU42","v":0},{"$f":"INPUT!AW42","v":"ABS"},{"$f":"INPUT!AX42","v":"ABS"},{"$f":"INPUT!BA42","v":"ABS"},{"$f":"INPUT!BB42","v":"ABS"},{"$f":"INPUT!BD42","v":"*"},{"$f":"INPUT!BE42","v":0},{"$f":"INPUT!BG42","v":"ABS"},{"$f":"INPUT!BH42","v":"ABS"},{"$f":"INPUT!BK42","v":"ABS"},{"$f":"INPUT!BL42","v":"ABS"},{"$f":"INPUT!BN42","v":"*"},{"$f":"INPUT!BO42","v":"-"},{"$f":"INPUT!BP42","v":0},{"$f":"INPUT!BR42","v":"ABS"},{"$f":"INPUT!BS42","v":"ABS"},{"$f":"INPUT!BV42","v":"ABS"},{"$f":"INPUT!BW42","v":"ABS"},{"$f":"INPUT!BY42","v":""},"","ABS","",null,null,null,null,null,{"$f":"AP42&\"_\"&COUNTIF($AP$5:AP42,AP42)","v":"-_35"}]
[null,{"$f":"INPUT!F43","v":0},{"$f":"INPUT!C43","v":0},{"$f":"INPUT!D43","v":"00:00:00"},{"$f":"INPUT!E43","v":0},{"$f":"INPUT!G43","v":"0011"},{"$f":"INPUT!I43","v":"ABS"},{"$f":"INPUT!J43","v":"ABS"},{"$f":"INPUT!M43","v":"ABS"},{"$f":"INPUT!N43","v":"ABS"},{"$f":"INPUT!P43","v":"*"},{"$f":"INPUT!Q43","v":"0031"},{"$f":"INPUT!S43","v":"ABS"},{"$f":"INPUT!T43","v":"ABS"},{"$f":"INPUT!W43","v":"ABS"},{"$f":"INPUT!X43","v":"ABS"},{"$f":"INPUT!Z43","v":"*"},{"$f":"INPUT!AA43","v":"0051"},{"$f":"INPUT!AC43","v":"ABS"},{"$f":"INPUT!AD43","v":"ABS"},{"$f":"INPUT!AG43","v":"ABS"},{"$f":"INPUT!AH43","v":"ABS"},{"$f":"INPUT!AJ43","v":"*"},{"$f":"INPUT!AK43","v":0},{"$f":"INPUT!AM43","v":"ABS"},{"$f":"INPUT!AN43","v":"ABS"},{"$f":"INPUT!AQ43","v":"ABS"},{"$f":"INPUT!AR43","v":"ABS"},{"$f":"INPUT!AT43","v":"*"},{"$f":"INPUT!AU43","v":0},{"$f":"INPUT!AW43","v":"ABS"},{"$f":"INPUT!AX43","v":"ABS"},{"$f":"INPUT!BA43","v":"ABS"},{"$f":"INPUT!BB43","v":"ABS"},{"$f":"INPUT!BD43","v":"*"},{"$f":"INPUT!BE43","v":0},{"$f":"INPUT!BG43","v":"ABS"},{"$f":"INPUT!BH43","v":"ABS"},{"$f":"INPUT!BK43","v":"ABS"},{"$f":"INPUT!BL43","v":"ABS"},{"$f":"INPUT!BN43","v":"*"},{"$f":"INPUT!BO43","v":"-"},{"$f":"INPUT!BP43","v":0},{"$f":"INPUT!BR43","v":"ABS"},{"$f":"INPUT!BS43","v":"ABS"},{"$f":"INPUT!BV43","v":"ABS"},{"$f":"INPUT!BW43","v":"ABS"},{"$f":"INPUT!BY43","v":""},"","ABS","",null,null,null,null,null,{"$f":"AP43&\"_\"&COUNTIF($AP$5:AP43,AP43)","v":"-_36"}]
[null,{"$f":"INPUT!F44","v":0},{"$f":"INPUT!C44","v":0},{"$f":"INPUT!D44","v":"00:00:00"},{"$f":"INPUT!E44","v":0},{"$f":"INPUT!G44","v":"0011"},{"$f":"INPUT!I44","v":"ABS"},{"$f":"INPUT!J44","v":"ABS"},{"$f":"INPUT!M44","v":"ABS"},{"$f":"INPUT!N44","v":"ABS"},{"$f":"INPUT!P44","v":"*"},{"$f":"INPUT!Q44","v":"0031"},{"$f":"INPUT!S44","v":"ABS"},{"$f":"INPUT!T44","v":"ABS"},{"$f":"INPUT!W44","v":"ABS"},{"$f":"INPUT!X44","v":"ABS"},{"$f":"INPUT!Z44","v":"*"},{"$f":"INPUT!AA44","v":"0051"},{"$f":"INPUT!AC44","v":"ABS"},{"$f":"INPUT!AD44","v":"ABS"},{"$f":"INPUT!AG44","v":"ABS"},{"$f":"INPUT!AH44","v":"ABS"},{"$f":"INPUT!AJ44","v":"*"},{"$f":"INPUT!AK44","v":0},{"$f":"INPUT!AM44","v":"ABS"},{"$f":"INPUT!AN44","v":"ABS"},{"$f":"INPUT!AQ44","v":"ABS"},{"$f":"INPUT!AR44","v":"ABS"},{"$f":"INPUT!AT44","v":"*"},{"$f":"INPUT!AU44","v":0},{"$f":"INPUT!AW44","v":"ABS"},{"$f":"INPUT!AX44","v":"ABS"},{"$f":"INPUT!BA44","v":"ABS"},{"$f":"INPUT!BB44","v":"ABS"},{"$f":"INPUT!BD44","v":"*"},{"$f":"INPUT!BE44","v":0},{"$f":"INPUT!BG44","v":"ABS"},{"$f":"INPUT!BH44","v":"ABS"},{"$f":"INPUT!BK44","v":"ABS"},{"$f":"INPUT!BL44","v":"ABS"},{"$f":"INPUT!BN44","v":"*"},{"$f":"INPUT!BO44","v":"-"},{"$f":"INPUT!BP44","v":0},{"$f":"INPUT!BR44","v":"ABS"},{"$f":"INPUT!BS44","v":"ABS"},{"$f":"INPUT!BV44","v":"ABS"},{"$f":"INPUT!BW44","v":"ABS"},{"$f":"INPUT!BY44","v":""},"","ABS","",null,null,null,null,null,{"$f":"AP44&\"_\"&COUNTIF($AP$5:AP44,AP44)","v":"-_37"}]
[null,{"$f":"INPUT!F45","v":0},{"$f":"INPUT!C45","v":0},{"$f":"INPUT!D45","v":"00:00:00"},{"$f":"INPUT!E45","v":0},{"$f":"INPUT!G45","v":"0011"},{"$f":"INPUT!I45","v":"ABS"},{"$f":"INPUT!J45","v":"ABS"},{"$f":"INPUT!M45","v":"ABS"},{"$f":"INPUT!N45","v":"ABS"},{"$f":"INPUT!P45","v":"*"},{"$f":"INPUT!Q45","v":"0031"},{"$f":"INPUT!S45","v":"ABS"},{"$f":"INPUT!T45","v":"ABS"},{"$f":"INPUT!W45","v":"ABS"},{"$f":"INPUT!X45","v":"ABS"},{"$f":"INPUT!Z45","v":"*"},{"$f":"INPUT!AA45","v":"0051"},{"$f":"INPUT!AC45","v":"ABS"},{"$f":"INPUT!AD45","v":"ABS"},{"$f":"INPUT!AG45","v":"ABS"},{"$f":"INPUT!AH45","v":"ABS"},{"$f":"INPUT!AJ45","v":"*"},{"$f":"INPUT!AK45","v":0},{"$f":"INPUT!AM45","v":"ABS"},{"$f":"INPUT!AN45","v":"ABS"},{"$f":"INPUT!AQ45","v":"ABS"},{"$f":"INPUT!AR45","v":"ABS"},{"$f":"INPUT!AT45","v":"*"},{"$f":"INPUT!AU45","v":0},{"$f":"INPUT!AW45","v":"ABS"},{"$f":"INPUT!AX45","v":"ABS"},{"$f":"INPUT!BA45","v":"ABS"},{"$f":"INPUT!BB45","v":"ABS"},{"$f":"INPUT!BD45","v":"*"},{"$f":"INPUT!BE45","v":0},{"$f":"INPUT!BG45","v":"ABS"},{"$f":"INPUT!BH45","v":"ABS"},{"$f":"INPUT!BK45","v":"ABS"},{"$f":"INPUT!BL45","v":"ABS"},{"$f":"INPUT!BN45","v":"*"},{"$f":"INPUT!BO45","v":"-"},{"$f":"INPUT!BP45","v":0},{"$f":"INPUT!BR45","v":"ABS"},{"$f":"INPUT!BS45","v":"ABS"},{"$f":"INPUT!BV45","v":"ABS"},{"$f":"INPUT!BW45","v":"ABS"},{"$f":"INPUT!BY45","v":""},"","ABS","",null,null,null,null,null,{"$f":"AP45&\"_\"&COUNTIF($AP$5:AP45,AP45)","v":"-_38"}]
[null,{"$f":"INPUT!F46","v":0},{"$f":"INPUT!C46","v":0},{"$f":"INPUT!D46","v":"00:00:00"},{"$f":"INPUT!E46","v":0},{"$f":"INPUT!G46","v":"0011"},{"$f":"INPUT!I46","v":"ABS"},{"$f":"INPUT!J46","v":"ABS"},{"$f":"INPUT!M46","v":"ABS"},{"$f":"INPUT!N46","v":"ABS"},{"$f":"INPUT!P46","v":"*"},{"$f":"INPUT!Q46","v":"0031"},{"$f":"INPUT!S46","v":"ABS"},{"$f":"INPUT!T46","v":"ABS"},{"$f":"INPUT!W46","v":"ABS"},{"$f":"INPUT!X46","v":"ABS"},{"$f":"INPUT!Z46","v":"*"},{"$f":"INPUT!AA46","v":"0051"},{"$f":"INPUT!AC46","v":"ABS"},{"$f":"INPUT!AD46","v":"ABS"},{"$f":"INPUT!AG46","v":"ABS"},{"$f":"INPUT!AH46","v":"ABS"},{"$f":"INPUT!AJ46","v":"*"},{"$f":"INPUT!AK46","v":0},{"$f":"INPUT!AM46","v":"ABS"},{"$f":"INPUT!AN46","v":"ABS"},{"$f":"INPUT!AQ46","v":"ABS"},{"$f":"INPUT!AR46","v":"ABS"},{"$f":"INPUT!AT46","v":"*"},{"$f":"INPUT!AU46","v":0},{"$f":"INPUT!AW46","v":"ABS"},{"$f":"INPUT!AX46","v":"ABS"},{"$f":"INPUT!BA46","v":"ABS"},{"$f":"INPUT!BB46","v":"ABS"},{"$f":"INPUT!BD46","v":"*"},{"$f":"INPUT!BE46","v":0},{"$f":"INPUT!BG46","v":"ABS"},{"$f":"INPUT!BH46","v":"ABS"},{"$f":"INPUT!BK46","v":"ABS"},{"$f":"INPUT!BL46","v":"ABS"},{"$f":"INPUT!BN46","v":"*"},{"$f":"INPUT!BO46","v":"-"},{"$f":"INPUT!BP46","v":0},{"$f":"INPUT!BR46","v":"ABS"},{"$f":"INPUT!BS46","v":"ABS"},{"$f":"INPUT!BV46","v":"ABS"},{"$f":"INPUT!BW46","v":"ABS"},{"$f":"INPUT!BY46","v":""},"","ABS","",null,null,null,null,null,{"$f":"AP46&\"_\"&COUNTIF($AP$5:AP46,AP46)","v":"-_39"}]
[null,{"$f":"INPUT!F47","v":0},{"$f":"INPUT!C47","v":0},{"$f":"INPUT!D47","v":"00:00:00"},{"$f":"INPUT!E47","v":0},{"$f":"INPUT!G47","v":"0011"},{"$f":"INPUT!I47","v":"ABS"},{"$f":"INPUT!J47","v":"ABS"},{"$f":"INPUT!M47","v":"ABS"},{"$f":"INPUT!N47","v":"ABS"},{"$f":"INPUT!P47","v":"*"},{"$f":"INPUT!Q47","v":"0031"},{"$f":"INPUT!S47","v":"ABS"},{"$f":"INPUT!T47","v":"ABS"},{"$f":"INPUT!W47","v":"ABS"},{"$f":"INPUT!X47","v":"ABS"},{"$f":"INPUT!Z47","v":"*"},{"$f":"INPUT!AA47","v":"0051"},{"$f":"INPUT!AC47","v":"ABS"},{"$f":"INPUT!AD47","v":"ABS"},{"$f":"INPUT!AG47","v":"ABS"},{"$f":"INPUT!AH47","v":"ABS"},{"$f":"INPUT!AJ47","v":"*"},{"$f":"INPUT!AK47","v":0},{"$f":"INPUT!AM47","v":"ABS"},{"$f":"INPUT!AN47","v":"ABS"},{"$f":"INPUT!AQ47","v":"ABS"},{"$f":"INPUT!AR47","v":"ABS"},{"$f":"INPUT!AT47","v":"*"},{"$f":"INPUT!AU47","v":0},{"$f":"INPUT!AW47","v":"ABS"},{"$f":"INPUT!AX47","v":"ABS"},{"$f":"INPUT!BA47","v":"ABS"},{"$f":"INPUT!BB47","v":"ABS"},{"$f":"INPUT!BD47","v":"*"},{"$f":"INPUT!BE47","v":0},{"$f":"INPUT!BG47","v":"ABS"},{"$f":"INPUT!BH47","v":"ABS"},{"$f":"INPUT!BK47","v":"ABS"},{"$f":"INPUT!BL47","v":"ABS"},{"$f":"INPUT!BN47","v":"*"},{"$f":"INPUT!BO47","v":"-"},{"$f":"INPUT!BP47","v":0},{"$f":"INPUT!BR47","v":"ABS"},{"$f":"INPUT!BS47","v":"ABS"},{"$f":"INPUT!BV47","v":"ABS"},{"$f":"INPUT!BW47","v":"ABS"},{"$f":"INPUT!BY47","v":""},"","ABS","",null,null,null,null,null,{"$f":"AP47&\"_\"&COUNTIF($AP$5:AP47,AP47)","v":"-_40"}]
[null,{"$f":"INPUT!F48","v":0},{"$f":"INPUT!C48","v":0},{"$f":"INPUT!D48","v":"00:00:00"},{"$f":"INPUT!E48","v":0},{"$f":"INPUT!G48","v":"0011"},{"$f":"INPUT!I48","v":"ABS"},{"$f":"INPUT!J48","v":"ABS"},{"$f":"INPUT!M48","v":"ABS"},{"$f":"INPUT!N48","v":"ABS"},{"$f":"INPUT!P48","v":"*"},{"$f":"INPUT!Q48","v":"0031"},{"$f":"INPUT!S48","v":"ABS"},{"$f":"INPUT!T48","v":"ABS"},{"$f":"INPUT!W48","v":"ABS"},{"$f":"INPUT!X48","v":"ABS"},{"$f":"INPUT!Z48","v":"*"},{"$f":"INPUT!AA48","v":"0051"},{"$f":"INPUT!AC48","v":"ABS"},{"$f":"INPUT!AD48","v":"ABS"},{"$f":"INPUT!AG48","v":"ABS"},{"$f":"INPUT!AH48","v":"ABS"},{"$f":"INPUT!AJ48","v":"*"},{"$f":"INPUT!AK48","v":0},{"$f":"INPUT!AM48","v":"ABS"},{"$f":"INPUT!AN48","v":"ABS"},{"$f":"INPUT!AQ48","v":"ABS"},{"$f":"INPUT!AR48","v":"ABS"},{"$f":"INPUT!AT48","v":"*"},{"$f":"INPUT!AU48","v":0},{"$f":"INPUT!AW48","v":"ABS"},{"$f":"INPUT!AX48","v":"ABS"},{"$f":"INPUT!BA48","v":"ABS"},{"$f":"INPUT!BB48","v":"ABS"},{"$f":"INPUT!BD48","v":"*"},{"$f":"INPUT!BE48","v":0},{"$f":"INPUT!BG48","v":"ABS"},{"$f":"INPUT!BH48","v":"ABS"},{"$f":"INPUT!BK48","v":"ABS"},{"$f":"INPUT!BL48","v":"ABS"},{"$f":"INPUT!BN48","v":"*"},{"$f":"INPUT!BO48","v":"-"},{"$f":"INPUT!BP48","v":0},{"$f":"INPUT!BR48","v":"ABS"},{"$f":"INPUT!BS48","v":"ABS"},{"$f":"INPUT!BV48","v":"ABS"},{"$f":"INPUT!BW48","v":"ABS"},{"$f":"INPUT!BY48","v":""},"","ABS","",null,null,null,null,null,{"$f":"AP48&\"_\"&COUNTIF($AP$5:AP48,AP48)","v":"-_41"}]
[null,{"$f":"INPUT!F49","v":0},{"$f":"INPUT!C49","v":0},{"$f":"INPUT!D49","v":"00:00:00"},{"$f":"INPUT!E49","v":0},{"$f":"INPUT!G49","v":"0011"},{"$f":"INPUT!I49","v":"ABS"},{"$f":"INPUT!J49","v":"ABS"},{"$f":"INPUT!M49","v":"ABS"},{"$f":"INPUT!N49","v":"ABS"},{"$f":"INPUT!P49","v":"*"},{"$f":"INPUT!Q49","v":"0031"},{"$f":"INPUT!S49","v":"ABS"},{"$f":"INPUT!T49","v":"ABS"},{"$f":"INPUT!W49","v":"ABS"},{"$f":"INPUT!X49","v":"ABS"},{"$f":"INPUT!Z49","v":"*"},{"$f":"INPUT!AA49","v":"0051"},{"$f":"INPUT!AC49","v":"ABS"},{"$f":"INPUT!AD49","v":"ABS"},{"$f":"INPUT!AG49","v":"ABS"},{"$f":"INPUT!AH49","v":"ABS"},{"$f":"INPUT!AJ49","v":"*"},{"$f":"INPUT!AK49","v":0},{"$f":"INPUT!AM49","v":"ABS"},{"$f":"INPUT!AN49","v":"ABS"},{"$f":"INPUT!AQ49","v":"ABS"},{"$f":"INPUT!AR49","v":"ABS"},{"$f":"INPUT!AT49","v":"*"},{"$f":"INPUT!AU49","v":0},{"$f":"INPUT!AW49","v":"ABS"},{"$f":"INPUT!AX49","v":"ABS"},{"$f":"INPUT!BA49","v":"ABS"},{"$f":"INPUT!BB49","v":"ABS"},{"$f":"INPUT!BD49","v":"*"},{"$f":"INPUT!BE49","v":0},{"$f":"INPUT!BG49","v":"ABS"},{"$f":"INPUT!BH49","v":"ABS"},{"$f":"INPUT!BK49","v":"ABS"},{"$f":"INPUT!BL49","v":"ABS"},{"$f":"INPUT!BN49","v":"*"},{"$f":"INPUT!BO49","v":"-"},{"$f":"INPUT!BP49","v":0},{"$f":"INPUT!BR49","v":"ABS"},{"$f":"INPUT!BS49","v":"ABS"},{"$f":"INPUT!BV49","v":"ABS"},{"$f":"INPUT!BW49","v":"ABS"},{"$f":"INPUT!BY49","v":""},"","ABS","",null,null,null,null,null,{"$f":"AP49&\"_\"&COUNTIF($AP$5:AP49,AP49)","v":"-_42"}]
[null,{"$f":"INPUT!F50","v":0},{"$f":"INPUT!C50","v":0},{"$f":"INPUT!D50","v":"00:00:00"},{"$f":"INPUT!E50","v":0},{"$f":"INPUT!G50","v":"0011"},{"$f":"INPUT!I50","v":"ABS"},{"$f":"INPUT!J50","v":"ABS"},{"$f":"INPUT!M50","v":"ABS"},{"$f":"INPUT!N50","v":"ABS"},{"$f":"INPUT!P50","v":"*"},{"$f":"INPUT!Q50","v":"0031"},{"$f":"INPUT!S50","v":"ABS"},{"$f":"INPUT!T50","v":"ABS"},{"$f":"INPUT!W50","v":"ABS"},{"$f":"INPUT!X50","v":"ABS"},{"$f":"INPUT!Z50","v":"*"},{"$f":"INPUT!AA50","v":"0051"},{"$f":"INPUT!AC50","v":"ABS"},{"$f":"INPUT!AD50","v":"ABS"},{"$f":"INPUT!AG50","v":"ABS"},{"$f":"INPUT!AH50","v":"ABS"},{"$f":"INPUT!AJ50","v":"*"},{"$f":"INPUT!AK50","v":0},{"$f":"INPUT!AM50","v":"ABS"},{"$f":"INPUT!AN50","v":"ABS"},{"$f":"INPUT!AQ50","v":"ABS"},{"$f":"INPUT!AR50","v":"ABS"},{"$f":"INPUT!AT50","v":"*"},{"$f":"INPUT!AU50","v":0},{"$f":"INPUT!AW50","v":"ABS"},{"$f":"INPUT!AX50","v":"ABS"},{"$f":"INPUT!BA50","v":"ABS"},{"$f":"INPUT!BB50","v":"ABS"},{"$f":"INPUT!BD50","v":"*"},{"$f":"INPUT!BE50","v":0},{"$f":"INPUT!BG50","v":"ABS"},{"$f":"INPUT!BH50","v":"ABS"},{"$f":"INPUT!BK50","v":"ABS"},{"$f":"INPUT!BL50","v":"ABS"},{"$f":"INPUT!BN50","v":"*"},{"$f":"INPUT!BO50","v":"-"},{"$f":"INPUT!BP50","v":0},{"$f":"INPUT!BR50","v":"ABS"},{"$f":"INPUT!BS50","v":"ABS"},{"$f":"INPUT!BV50","v":"ABS"},{"$f":"INPUT!BW50","v":"ABS"},{"$f":"INPUT!BY50","v":""},"","ABS","",null,null,null,null,null,{"$f":"AP50&\"_\"&COUNTIF($AP$5:AP50,AP50)","v":"-_43"}]
[null,{"$f":"INPUT!F51","v":0},{"$f":"INPUT!C51","v":0},{"$f":"INPUT!D51","v":"00:00:00"},{"$f":"INPUT!E51","v":0},{"$f":"INPUT!G51","v":"0011"},{"$f":"INPUT!I51","v":"ABS"},{"$f":"INPUT!J51","v":"ABS"},{"$f":"INPUT!M51","v":"ABS"},{"$f":"INPUT!N51","v":"ABS"},{"$f":"INPUT!P51","v":"*"},{"$f":"INPUT!Q51","v":"0031"},{"$f":"INPUT!S51","v":"ABS"},{"$f":"INPUT!T51","v":"ABS"},{"$f":"INPUT!W51","v":"ABS"},{"$f":"INPUT!X51","v":"ABS"},{"$f":"INPUT!Z51","v":"*"},{"$f":"INPUT!AA51","v":"0051"},{"$f":"INPUT!AC51","v":"ABS"},{"$f":"INPUT!AD51","v":"ABS"},{"$f":"INPUT!AG51","v":"ABS"},{"$f":"INPUT!AH51","v":"ABS"},{"$f":"INPUT!AJ51","v":"*"},{"$f":"INPUT!AK51","v":0},{"$f":"INPUT!AM51","v":"ABS"},{"$f":"INPUT!AN51","v":"ABS"},{"$f":"INPUT!AQ51","v":"ABS"},{"$f":"INPUT!AR51","v":"ABS"},{"$f":"INPUT!AT51","v":"*"},{"$f":"INPUT!AU51","v":0},{"$f":"INPUT!AW51","v":"ABS"},{"$f":"INPUT!AX51","v":"ABS"},{"$f":"INPUT!BA51","v":"ABS"},{"$f":"INPUT!BB51","v":"ABS"},{"$f":"INPUT!BD51","v":"*"},{"$f":"INPUT!BE51","v":0},{"$f":"INPUT!BG51","v":"ABS"},{"$f":"INPUT!BH51","v":"ABS"},{"$f":"INPUT!BK51","v":"ABS"},{"$f":"INPUT!BL51","v":"ABS"},{"$f":"INPUT!BN51","v":"*"},{"$f":"INPUT!BO51","v":"-"},{"$f":"INPUT!BP51","v":0},{"$f":"INPUT!BR51","v":"ABS"},{"$f":"INPUT!BS51","v":"ABS"},{"$f":"INPUT!BV51","v":"ABS"},{"$f":"INPUT!BW51","v":"ABS"},{"$f":"INPUT!BY51","v":""},"","ABS","",null,null,null,null,null,{"$f":"AP51&\"_\"&COUNTIF($AP$5:AP51,AP51)","v":"-_44"}]
[null,{"$f":"INPUT!F52","v":0},{"$f":"INPUT!C52","v":0},{"$f":"INPUT!D52","v":"00:00:00"},{"$f":"INPUT!E52","v":0},{"$f":"INPUT!G52","v":"0011"},{"$f":"INPUT!I52","v":"ABS"},{"$f":"INPUT!J52","v":"ABS"},{"$f":"INPUT!M52","v":"ABS"},{"$f":"INPUT!N52","v":"ABS"},{"$f":"INPUT!P52","v":"*"},{"$f":"INPUT!Q52","v":"0031"},{"$f":"INPUT!S52","v":"ABS"},{"$f":"INPUT!T52","v":"ABS"},{"$f":"INPUT!W52","v":"ABS"},{"$f":"INPUT!X52","v":"ABS"},{"$f":"INPUT!Z52","v":"*"},{"$f":"INPUT!AA52","v":"0051"},{"$f":"INPUT!AC52","v":"ABS"},{"$f":"INPUT!AD52","v":"ABS"},{"$f":"INPUT!AG52","v":"ABS"},{"$f":"INPUT!AH52","v":"ABS"},{"$f":"INPUT!AJ52","v":"*"},{"$f":"INPUT!AK52","v":0},{"$f":"INPUT!AM52","v":"ABS"},{"$f":"INPUT!AN52","v":"ABS"},{"$f":"INPUT!AQ52","v":"ABS"},{"$f":"INPUT!AR52","v":"ABS"},{"$f":"INPUT!AT52","v":"*"},{"$f":"INPUT!AU52","v":0},{"$f":"INPUT!AW52","v":"ABS"},{"$f":"INPUT!AX52","v":"ABS"},{"$f":"INPUT!BA52","v":"ABS"},{"$f":"INPUT!BB52","v":"ABS"},{"$f":"INPUT!BD52","v":"*"},{"$f":"INPUT!BE52","v":0},{"$f":"INPUT!BG52","v":"ABS"},{"$f":"INPUT!BH52","v":"ABS"},{"$f":"INPUT!BK52","v":"ABS"},{"$f":"INPUT!BL52","v":"ABS"},{"$f":"INPUT!BN52","v":"*"},{"$f":"INPUT!BO52","v":"-"},{"$f":"INPUT!BP52","v":0},{"$f":"INPUT!BR52","v":"ABS"},{"$f":"INPUT!BS52","v":"ABS"},{"$f":"INPUT!BV52","v":"ABS"},{"$f":"INPUT!BW52","v":"ABS"},{"$f":"INPUT!BY52","v":""},"","ABS","",null,null,null,null,null,{"$f":"AP52&\"_\"&COUNTIF($AP$5:AP52,AP52)","v":"-_45"}]
[null,{"$f":"INPUT!F53","v":0},{"$f":"INPUT!C53","v":0},{"$f":"INPUT!D53","v":"00:00:00"},{"$f":"INPUT!E53","v":0},{"$f":"INPUT!G53","v":"0011"},{"$f":"INPUT!I53","v":"ABS"},{"$f":"INPUT!J53","v":"ABS"},{"$f":"INPUT!M53","v":"ABS"},{"$f":"INPUT!N53","v":"ABS"},{"$f":"INPUT!P53","v":"*"},{"$f":"INPUT!Q53","v":"0031"},{"$f":"INPUT!S53","v":"ABS"},{"$f":"INPUT!T53","v":"ABS"},{"$f":"INPUT!W53","v":"ABS"},{"$f":"INPUT!X53","v":"ABS"},{"$f":"INPUT!Z53","v":"*"},{"$f":"INPUT!AA53","v":"0051"},{"$f":"INPUT!AC53","v":"ABS"},{"$f":"INPUT!AD53","v":"ABS"},{"$f":"INPUT!AG53","v":"ABS"},{"$f":"INPUT!AH53","v":"ABS"},{"$f":"INPUT!AJ53","v":"*"},{"$f":"INPUT!AK53","v":0},{"$f":"INPUT!AM53","v":"ABS"},{"$f":"INPUT!AN53","v":"ABS"},{"$f":"INPUT!AQ53","v":"ABS"},{"$f":"INPUT!AR53","v":"ABS"},{"$f":"INPUT!AT53","v":"*"},{"$f":"INPUT!AU53","v":0},{"$f":"INPUT!AW53","v":"ABS"},{"$f":"INPUT!AX53","v":"ABS"},{"$f":"INPUT!BA53","v":"ABS"},{"$f":"INPUT!BB53","v":"ABS"},{"$f":"INPUT!BD53","v":"*"},{"$f":"INPUT!BE53","v":0},{"$f":"INPUT!BG53","v":"ABS"},{"$f":"INPUT!BH53","v":"ABS"},{"$f":"INPUT!BK53","v":"ABS"},{"$f":"INPUT!BL53","v":"ABS"},{"$f":"INPUT!BN53","v":"*"},{"$f":"INPUT!BO53","v":"-"},{"$f":"INPUT!BP53","v":0},{"$f":"INPUT!BR53","v":"ABS"},{"$f":"INPUT!BS53","v":"ABS"},{"$f":"INPUT!BV53","v":"ABS"},{"$f":"INPUT!BW53","v":"ABS"},{"$f":"INPUT!BY53","v":""},"","ABS","",null,null,null,null,null,{"$f":"AP53&\"_\"&COUNTIF($AP$5:AP53,AP53)","v":"-_46"}]
[null,{"$f":"INPUT!F54","v":0},{"$f":"INPUT!C54","v":0},{"$f":"INPUT!D54","v":"00:00:00"},{"$f":"INPUT!E54","v":0},{"$f":"INPUT!G54","v":"0011"},{"$f":"INPUT!I54","v":"ABS"},{"$f":"INPUT!J54","v":"ABS"},{"$f":"INPUT!M54","v":"ABS"},{"$f":"INPUT!N54","v":"ABS"},{"$f":"INPUT!P54","v":"*"},{"$f":"INPUT!Q54","v":"0031"},{"$f":"INPUT!S54","v":"ABS"},{"$f":"INPUT!T54","v":"ABS"},{"$f":"INPUT!W54","v":"ABS"},{"$f":"INPUT!X54","v":"ABS"},{"$f":"INPUT!Z54","v":"*"},{"$f":"INPUT!AA54","v":"0051"},{"$f":"INPUT!AC54","v":"ABS"},{"$f":"INPUT!AD54","v":"ABS"},{"$f":"INPUT!AG54","v":"ABS"},{"$f":"INPUT!AH54","v":"ABS"},{"$f":"INPUT!AJ54","v":"*"},{"$f":"INPUT!AK54","v":0},{"$f":"INPUT!AM54","v":"ABS"},{"$f":"INPUT!AN54","v":"ABS"},{"$f":"INPUT!AQ54","v":"ABS"},{"$f":"INPUT!AR54","v":"ABS"},{"$f":"INPUT!AT54","v":"*"},{"$f":"INPUT!AU54","v":0},{"$f":"INPUT!AW54","v":"ABS"},{"$f":"INPUT!AX54","v":"ABS"},{"$f":"INPUT!BA54","v":"ABS"},{"$f":"INPUT!BB54","v":"ABS"},{"$f":"INPUT!BD54","v":"*"},{"$f":"INPUT!BE54","v":0},{"$f":"INPUT!BG54","v":"ABS"},{"$f":"INPUT!BH54","v":"ABS"},{"$f":"INPUT!BK54","v":"ABS"},{"$f":"INPUT!BL54","v":"ABS"},{"$f":"INPUT!BN54","v":"*"},{"$f":"INPUT!BO54","v":"-"},{"$f":"INPUT!BP54","v":0},{"$f":"INPUT!BR54","v":"ABS"},{"$f":"INPUT!BS54","v":"ABS"},{"$f":"INPUT!BV54","v":"ABS"},{"$f":"INPUT!BW54","v":"ABS"},{"$f":"INPUT!BY54","v":""},"","ABS","",null,null,null,null,null,{"$f":"AP54&\"_\"&COUNTIF($AP$5:AP54,AP54)","v":"-_47"}]
[null,{"$f":"INPUT!F55","v":0},{"$f":"INPUT!C55","v":0},{"$f":"INPUT!D55","v":"00:00:00"},{"$f":"INPUT!E55","v":0},{"$f":"INPUT!G55","v":"0011"},{"$f":"INPUT!I55","v":"ABS"},{"$f":"INPUT!J55","v":"ABS"},{"$f":"INPUT!M55","v":"ABS"},{"$f":"INPUT!N55","v":"ABS"},{"$f":"INPUT!P55","v":"*"},{"$f":"INPUT!Q55","v":"0031"},{"$f":"INPUT!S55","v":"ABS"},{"$f":"INPUT!T55","v":"ABS"},{"$f":"INPUT!W55","v":"ABS"},{"$f":"INPUT!X55","v":"ABS"},{"$f":"INPUT!Z55","v":"*"},{"$f":"INPUT!AA55","v":"0051"},{"$f":"INPUT!AC55","v":"ABS"},{"$f":"INPUT!AD55","v":"ABS"},{"$f":"INPUT!AG55","v":"ABS"},{"$f":"INPUT!AH55","v":"ABS"},{"$f":"INPUT!AJ55","v":"*"},{"$f":"INPUT!AK55","v":0},{"$f":"INPUT!AM55","v":"ABS"},{"$f":"INPUT!AN55","v":"ABS"},{"$f":"INPUT!AQ55","v":"ABS"},{"$f":"INPUT!AR55","v":"ABS"},{"$f":"INPUT!AT55","v":"*"},{"$f":"INPUT!AU55","v":0},{"$f":"INPUT!AW55","v":"ABS"},{"$f":"INPUT!AX55","v":"ABS"},{"$f":"INPUT!BA55","v":"ABS"},{"$f":"INPUT!BB55","v":"ABS"},{"$f":"INPUT!BD55","v":"*"},{"$f":"INPUT!BE55","v":0},{"$f":"INPUT!BG55","v":"ABS"},{"$f":"INPUT!BH55","v":"ABS"},{"$f":"INPUT!BK55","v":"ABS"},{"$f":"INPUT!BL55","v":"ABS"},{"$f":"INPUT!BN55","v":"*"},{"$f":"INPUT!BO55","v":"-"},{"$f":"INPUT!BP55","v":0},{"$f":"INPUT!BR55","v":"ABS"},{"$f":"INPUT!BS55","v":"ABS"},{"$f":"INPUT!BV55","v":"ABS"},{"$f":"INPUT!BW55","v":"ABS"},{"$f":"INPUT!BY55","v":""},"","ABS","",null,null,null,null,null,{"$f":"AP55&\"_\"&COUNTIF($AP$5:AP55,AP55)","v":"-_48"}]
[null,{"$f":"INPUT!F56","v":0},{"$f":"INPUT!C56","v":0},{"$f":"INPUT!D56","v":"00:00:00"},{"$f":"INPUT!E56","v":0},{"$f":"INPUT!G56","v":"0011"},{"$f":"INPUT!I56","v":"ABS"},{"$f":"INPUT!J56","v":"ABS"},{"$f":"INPUT!M56","v":"ABS"},{"$f":"INPUT!N56","v":"ABS"},{"$f":"INPUT!P56","v":"*"},{"$f":"INPUT!Q56","v":"0031"},{"$f":"INPUT!S56","v":"ABS"},{"$f":"INPUT!T56","v":"ABS"},{"$f":"INPUT!W56","v":"ABS"},{"$f":"INPUT!X56","v":"ABS"},{"$f":"INPUT!Z56","v":"*"},{"$f":"INPUT!AA56","v":"0051"},{"$f":"INPUT!AC56","v":"ABS"},{"$f":"INPUT!AD56","v":"ABS"},{"$f":"INPUT!AG56","v":"ABS"},{"$f":"INPUT!AH56","v":"ABS"},{"$f":"INPUT!AJ56","v":"*"},{"$f":"INPUT!AK56","v":0},{"$f":"INPUT!AM56","v":"ABS"},{"$f":"INPUT!AN56","v":"ABS"},{"$f":"INPUT!AQ56","v":"ABS"},{"$f":"INPUT!AR56","v":"ABS"},{"$f":"INPUT!AT56","v":"*"},{"$f":"INPUT!AU56","v":0},{"$f":"INPUT!AW56","v":"ABS"},{"$f":"INPUT!AX56","v":"ABS"},{"$f":"INPUT!BA56","v":"ABS"},{"$f":"INPUT!BB56","v":"ABS"},{"$f":"INPUT!BD56","v":"*"},{"$f":"INPUT!BE56","v":0},{"$f":"INPUT!BG56","v":"ABS"},{"$f":"INPUT!BH56","v":"ABS"},{"$f":"INPUT!BK56","v":"ABS"},{"$f":"INPUT!BL56","v":"ABS"},{"$f":"INPUT!BN56","v":"*"},{"$f":"INPUT!BO56","v":"-"},{"$f":"INPUT!BP56","v":0},{"$f":"INPUT!BR56","v":"ABS"},{"$f":"INPUT!BS56","v":"ABS"},{"$f":"INPUT!BV56","v":"ABS"},{"$f":"INPUT!BW56","v":"ABS"},{"$f":"INPUT!BY56","v":""},"","ABS","",null,null,null,null,null,{"$f":"AP56&\"_\"&COUNTIF($AP$5:AP56,AP56)","v":"-_49"}]
[null,{"$f":"INPUT!F57","v":0},{"$f":"INPUT!C57","v":0},{"$f":"INPUT!D57","v":"00:00:00"},{"$f":"INPUT!E57","v":0},{"$f":"INPUT!G57","v":"0011"},{"$f":"INPUT!I57","v":"ABS"},{"$f":"INPUT!J57","v":"ABS"},{"$f":"INPUT!M57","v":"ABS"},{"$f":"INPUT!N57","v":"ABS"},{"$f":"INPUT!P57","v":"*"},{"$f":"INPUT!Q57","v":"0031"},{"$f":"INPUT!S57","v":"ABS"},{"$f":"INPUT!T57","v":"ABS"},{"$f":"INPUT!W57","v":"ABS"},{"$f":"INPUT!X57","v":"ABS"},{"$f":"INPUT!Z57","v":"*"},{"$f":"INPUT!AA57","v":"0051"},{"$f":"INPUT!AC57","v":"ABS"},{"$f":"INPUT!AD57","v":"ABS"},{"$f":"INPUT!AG57","v":"ABS"},{"$f":"INPUT!AH57","v":"ABS"},{"$f":"INPUT!AJ57","v":"*"},{"$f":"INPUT!AK57","v":0},{"$f":"INPUT!AM57","v":"ABS"},{"$f":"INPUT!AN57","v":"ABS"},{"$f":"INPUT!AQ57","v":"ABS"},{"$f":"INPUT!AR57","v":"ABS"},{"$f":"INPUT!AT57","v":"*"},{"$f":"INPUT!AU57","v":0},{"$f":"INPUT!AW57","v":"ABS"},{"$f":"INPUT!AX57","v":"ABS"},{"$f":"INPUT!BA57","v":"ABS"},{"$f":"INPUT!BB57","v":"ABS"},{"$f":"INPUT!BD57","v":"*"},{"$f":"INPUT!BE57","v":0},{"$f":"INPUT!BG57","v":"ABS"},{"$f":"INPUT!BH57","v":"ABS"},{"$f":"INPUT!BK57","v":"ABS"},{"$f":"INPUT!BL57","v":"ABS"},{"$f":"INPUT!BN57","v":"*"},{"$f":"INPUT!BO57","v":"-"},{"$f":"INPUT!BP57","v":0},{"$f":"INPUT!BR57","v":"ABS"},{"$f":"INPUT!BS57","v":"ABS"},{"$f":"INPUT!BV57","v":"ABS"},{"$f":"INPUT!BW57","v":"ABS"},{"$f":"INPUT!BY57","v":""},"","ABS","",null,null,null,null,null,{"$f":"AP57&\"_\"&COUNTIF($AP$5:AP57,AP57)","v":"-_50"}]
[null,{"$f":"INPUT!F58","v":0},{"$f":"INPUT!C58","v":0},{"$f":"INPUT!D58","v":"00:00:00"},{"$f":"INPUT!E58","v":0},{"$f":"INPUT!G58","v":"0011"},{"$f":"INPUT!I58","v":"ABS"},{"$f":"INPUT!J58","v":"ABS"},{"$f":"INPUT!M58","v":"ABS"},{"$f":"INPUT!N58","v":"ABS"},{"$f":"INPUT!P58","v":"*"},{"$f":"INPUT!Q58","v":"0031"},{"$f":"INPUT!S58","v":"ABS"},{"$f":"INPUT!T58","v":"ABS"},{"$f":"INPUT!W58","v":"ABS"},{"$f":"INPUT!X58","v":"ABS"},{"$f":"INPUT!Z58","v":"*"},{"$f":"INPUT!AA58","v":"0051"},{"$f":"INPUT!AC58","v":"ABS"},{"$f":"INPUT!AD58","v":"ABS"},{"$f":"INPUT!AG58","v":"ABS"},{"$f":"INPUT!AH58","v":"ABS"},{"$f":"INPUT!AJ58","v":"*"},{"$f":"INPUT!AK58","v":0},{"$f":"INPUT!AM58","v":"ABS"},{"$f":"INPUT!AN58","v":"ABS"},{"$f":"INPUT!AQ58","v":"ABS"},{"$f":"INPUT!AR58","v":"ABS"},{"$f":"INPUT!AT58","v":"*"},{"$f":"INPUT!AU58","v":0},{"$f":"INPUT!AW58","v":"ABS"},{"$f":"INPUT!AX58","v":"ABS"},{"$f":"INPUT!BA58","v":"ABS"},{"$f":"INPUT!BB58","v":"ABS"},{"$f":"INPUT!BD58","v":"*"},{"$f":"INPUT!BE58","v":0},{"$f":"INPUT!BG58","v":"ABS"},{"$f":"INPUT!BH58","v":"ABS"},{"$f":"INPUT!BK58","v":"ABS"},{"$f":"INPUT!BL58","v":"ABS"},{"$f":"INPUT!BN58","v":"*"},{"$f":"INPUT!BO58","v":"-"},{"$f":"INPUT!BP58","v":0},{"$f":"INPUT!BR58","v":"ABS"},{"$f":"INPUT!BS58","v":"ABS"},{"$f":"INPUT!BV58","v":"ABS"},{"$f":"INPUT!BW58","v":"ABS"},{"$f":"INPUT!BY58","v":""},"","ABS","",null,null,null,null,null,{"$f":"AP58&\"_\"&COUNTIF($AP$5:AP58,AP58)","v":"-_51"}]
[null,{"$f":"INPUT!F59","v":0},{"$f":"INPUT!C59","v":0},{"$f":"INPUT!D59","v":"00:00:00"},{"$f":"INPUT!E59","v":0},{"$f":"INPUT!G59","v":"0011"},{"$f":"INPUT!I59","v":"ABS"},{"$f":"INPUT!J59","v":"ABS"},{"$f":"INPUT!M59","v":"ABS"},{"$f":"INPUT!N59","v":"ABS"},{"$f":"INPUT!P59","v":"*"},{"$f":"INPUT!Q59","v":"0031"},{"$f":"INPUT!S59","v":"ABS"},{"$f":"INPUT!T59","v":"ABS"},{"$f":"INPUT!W59","v":"ABS"},{"$f":"INPUT!X59","v":"ABS"},{"$f":"INPUT!Z59","v":"*"},{"$f":"INPUT!AA59","v":"0051"},{"$f":"INPUT!AC59","v":"ABS"},{"$f":"INPUT!AD59","v":"ABS"},{"$f":"INPUT!AG59","v":"ABS"},{"$f":"INPUT!AH59","v":"ABS"},{"$f":"INPUT!AJ59","v":"*"},{"$f":"INPUT!AK59","v":0},{"$f":"INPUT!AM59","v":"ABS"},{"$f":"INPUT!AN59","v":"ABS"},{"$f":"INPUT!AQ59","v":"ABS"},{"$f":"INPUT!AR59","v":"ABS"},{"$f":"INPUT!AT59","v":"*"},{"$f":"INPUT!AU59","v":0},{"$f":"INPUT!AW59","v":"ABS"},{"$f":"INPUT!AX59","v":"ABS"},{"$f":"INPUT!BA59","v":"ABS"},{"$f":"INPUT!BB59","v":"ABS"},{"$f":"INPUT!BD59","v":"*"},{"$f":"INPUT!BE59","v":0},{"$f":"INPUT!BG59","v":"ABS"},{"$f":"INPUT!BH59","v":"ABS"},{"$f":"INPUT!BK59","v":"ABS"},{"$f":"INPUT!BL59","v":"ABS"},{"$f":"INPUT!BN59","v":"*"},{"$f":"INPUT!BO59","v":"-"},{"$f":"INPUT!BP59","v":0},{"$f":"INPUT!BR59","v":"ABS"},{"$f":"INPUT!BS59","v":"ABS"},{"$f":"INPUT!BV59","v":"ABS"},{"$f":"INPUT!BW59","v":"ABS"},{"$f":"INPUT!BY59","v":""},"","ABS","",null,null,null,null,null,{"$f":"AP59&\"_\"&COUNTIF($AP$5:AP59,AP59)","v":"-_52"}]
[null,{"$f":"INPUT!F60","v":0},{"$f":"INPUT!C60","v":0},{"$f":"INPUT!D60","v":"00:00:00"},{"$f":"INPUT!E60","v":0},{"$f":"INPUT!G60","v":"0011"},{"$f":"INPUT!I60","v":"ABS"},{"$f":"INPUT!J60","v":"ABS"},{"$f":"INPUT!M60","v":"ABS"},{"$f":"INPUT!N60","v":"ABS"},{"$f":"INPUT!P60","v":"*"},{"$f":"INPUT!Q60","v":"0031"},{"$f":"INPUT!S60","v":"ABS"},{"$f":"INPUT!T60","v":"ABS"},{"$f":"INPUT!W60","v":"ABS"},{"$f":"INPUT!X60","v":"ABS"},{"$f":"INPUT!Z60","v":"*"},{"$f":"INPUT!AA60","v":"0051"},{"$f":"INPUT!AC60","v":"ABS"},{"$f":"INPUT!AD60","v":"ABS"},{"$f":"INPUT!AG60","v":"ABS"},{"$f":"INPUT!AH60","v":"ABS"},{"$f":"INPUT!AJ60","v":"*"},{"$f":"INPUT!AK60","v":0},{"$f":"INPUT!AM60","v":"ABS"},{"$f":"INPUT!AN60","v":"ABS"},{"$f":"INPUT!AQ60","v":"ABS"},{"$f":"INPUT!AR60","v":"ABS"},{"$f":"INPUT!AT60","v":"*"},{"$f":"INPUT!AU60","v":0},{"$f":"INPUT!AW60","v":"ABS"},{"$f":"INPUT!AX60","v":"ABS"},{"$f":"INPUT!BA60","v":"ABS"},{"$f":"INPUT!BB60","v":"ABS"},{"$f":"INPUT!BD60","v":"*"},{"$f":"INPUT!BE60","v":0},{"$f":"INPUT!BG60","v":"ABS"},{"$f":"INPUT!BH60","v":"ABS"},{"$f":"INPUT!BK60","v":"ABS"},{"$f":"INPUT!BL60","v":"ABS"},{"$f":"INPUT!BN60","v":"*"},{"$f":"INPUT!BO60","v":"-"},{"$f":"INPUT!BP60","v":0},{"$f":"INPUT!BR60","v":"ABS"},{"$f":"INPUT!BS60","v":"ABS"},{"$f":"INPUT!BV60","v":"ABS"},{"$f":"INPUT!BW60","v":"ABS"},{"$f":"INPUT!BY60","v":""},"","ABS","",null,null,null,null,null,{"$f":"AP60&\"_\"&COUNTIF($AP$5:AP60,AP60)","v":"-_53"}]
[null,{"$f":"INPUT!F61","v":0},{"$f":"INPUT!C61","v":0},{"$f":"INPUT!D61","v":"00:00:00"},{"$f":"INPUT!E61","v":0},{"$f":"INPUT!G61","v":"0011"},{"$f":"INPUT!I61","v":"ABS"},{"$f":"INPUT!J61","v":"ABS"},{"$f":"INPUT!M61","v":"ABS"},{"$f":"INPUT!N61","v":"ABS"},{"$f":"INPUT!P61","v":"*"},{"$f":"INPUT!Q61","v":"0031"},{"$f":"INPUT!S61","v":"ABS"},{"$f":"INPUT!T61","v":"ABS"},{"$f":"INPUT!W61","v":"ABS"},{"$f":"INPUT!X61","v":"ABS"},{"$f":"INPUT!Z61","v":"*"},{"$f":"INPUT!AA61","v":"0051"},{"$f":"INPUT!AC61","v":"ABS"},{"$f":"INPUT!AD61","v":"ABS"},{"$f":"INPUT!AG61","v":"ABS"},{"$f":"INPUT!AH61","v":"ABS"},{"$f":"INPUT!AJ61","v":"*"},{"$f":"INPUT!AK61","v":0},{"$f":"INPUT!AM61","v":"ABS"},{"$f":"INPUT!AN61","v":"ABS"},{"$f":"INPUT!AQ61","v":"ABS"},{"$f":"INPUT!AR61","v":"ABS"},{"$f":"INPUT!AT61","v":"*"},{"$f":"INPUT!AU61","v":0},{"$f":"INPUT!AW61","v":"ABS"},{"$f":"INPUT!AX61","v":"ABS"},{"$f":"INPUT!BA61","v":"ABS"},{"$f":"INPUT!BB61","v":"ABS"},{"$f":"INPUT!BD61","v":"*"},{"$f":"INPUT!BE61","v":0},{"$f":"INPUT!BG61","v":"ABS"},{"$f":"INPUT!BH61","v":"ABS"},{"$f":"INPUT!BK61","v":"ABS"},{"$f":"INPUT!BL61","v":"ABS"},{"$f":"INPUT!BN61","v":"*"},{"$f":"INPUT!BO61","v":"-"},{"$f":"INPUT!BP61","v":0},{"$f":"INPUT!BR61","v":"ABS"},{"$f":"INPUT!BS61","v":"ABS"},{"$f":"INPUT!BV61","v":"ABS"},{"$f":"INPUT!BW61","v":"ABS"},{"$f":"INPUT!BY61","v":""},"","ABS","",null,null,null,null,null,{"$f":"AP61&\"_\"&COUNTIF($AP$5:AP61,AP61)","v":"-_54"}]
[null,{"$f":"INPUT!F62","v":0},{"$f":"INPUT!C62","v":0},{"$f":"INPUT!D62","v":"00:00:00"},{"$f":"INPUT!E62","v":0},{"$f":"INPUT!G62","v":"0011"},{"$f":"INPUT!I62","v":"ABS"},{"$f":"INPUT!J62","v":"ABS"},{"$f":"INPUT!M62","v":"ABS"},{"$f":"INPUT!N62","v":"ABS"},{"$f":"INPUT!P62","v":"*"},{"$f":"INPUT!Q62","v":"0031"},{"$f":"INPUT!S62","v":"ABS"},{"$f":"INPUT!T62","v":"ABS"},{"$f":"INPUT!W62","v":"ABS"},{"$f":"INPUT!X62","v":"ABS"},{"$f":"INPUT!Z62","v":"*"},{"$f":"INPUT!AA62","v":"0051"},{"$f":"INPUT!AC62","v":"ABS"},{"$f":"INPUT!AD62","v":"ABS"},{"$f":"INPUT!AG62","v":"ABS"},{"$f":"INPUT!AH62","v":"ABS"},{"$f":"INPUT!AJ62","v":"*"},{"$f":"INPUT!AK62","v":0},{"$f":"INPUT!AM62","v":"ABS"},{"$f":"INPUT!AN62","v":"ABS"},{"$f":"INPUT!AQ62","v":"ABS"},{"$f":"INPUT!AR62","v":"ABS"},{"$f":"INPUT!AT62","v":"*"},{"$f":"INPUT!AU62","v":0},{"$f":"INPUT!AW62","v":"ABS"},{"$f":"INPUT!AX62","v":"ABS"},{"$f":"INPUT!BA62","v":"ABS"},{"$f":"INPUT!BB62","v":"ABS"},{"$f":"INPUT!BD62","v":"*"},{"$f":"INPUT!BE62","v":0},{"$f":"INPUT!BG62","v":"ABS"},{"$f":"INPUT!BH62","v":"ABS"},{"$f":"INPUT!BK62","v":"ABS"},{"$f":"INPUT!BL62","v":"ABS"},{"$f":"INPUT!BN62","v":"*"},{"$f":"INPUT!BO62","v":"-"},{"$f":"INPUT!BP62","v":0},{"$f":"INPUT!BR62","v":"ABS"},{"$f":"INPUT!BS62","v":"ABS"},{"$f":"INPUT!BV62","v":"ABS"},{"$f":"INPUT!BW62","v":"ABS"},{"$f":"INPUT!BY62","v":""},"","ABS","",null,null,null,null,null,{"$f":"AP62&\"_\"&COUNTIF($AP$5:AP62,AP62)","v":"-_55"}]
[null,{"$f":"INPUT!F63","v":0},{"$f":"INPUT!C63","v":0},{"$f":"INPUT!D63","v":"00:00:00"},{"$f":"INPUT!E63","v":0},{"$f":"INPUT!G63","v":"0011"},{"$f":"INPUT!I63","v":"ABS"},{"$f":"INPUT!J63","v":"ABS"},{"$f":"INPUT!M63","v":"ABS"},{"$f":"INPUT!N63","v":"ABS"},{"$f":"INPUT!P63","v":"*"},{"$f":"INPUT!Q63","v":"0031"},{"$f":"INPUT!S63","v":"ABS"},{"$f":"INPUT!T63","v":"ABS"},{"$f":"INPUT!W63","v":"ABS"},{"$f":"INPUT!X63","v":"ABS"},{"$f":"INPUT!Z63","v":"*"},{"$f":"INPUT!AA63","v":"0051"},{"$f":"INPUT!AC63","v":"ABS"},{"$f":"INPUT!AD63","v":"ABS"},{"$f":"INPUT!AG63","v":"ABS"},{"$f":"INPUT!AH63","v":"ABS"},{"$f":"INPUT!AJ63","v":"*"},{"$f":"INPUT!AK63","v":0},{"$f":"INPUT!AM63","v":"ABS"},{"$f":"INPUT!AN63","v":"ABS"},{"$f":"INPUT!AQ63","v":"ABS"},{"$f":"INPUT!AR63","v":"ABS"},{"$f":"INPUT!AT63","v":"*"},{"$f":"INPUT!AU63","v":0},{"$f":"INPUT!AW63","v":"ABS"},{"$f":"INPUT!AX63","v":"ABS"},{"$f":"INPUT!BA63","v":"ABS"},{"$f":"INPUT!BB63","v":"ABS"},{"$f":"INPUT!BD63","v":"*"},{"$f":"INPUT!BE63","v":0},{"$f":"INPUT!BG63","v":"ABS"},{"$f":"INPUT!BH63","v":"ABS"},{"$f":"INPUT!BK63","v":"ABS"},{"$f":"INPUT!BL63","v":"ABS"},{"$f":"INPUT!BN63","v":"*"},{"$f":"INPUT!BO63","v":"-"},{"$f":"INPUT!BP63","v":0},{"$f":"INPUT!BR63","v":"ABS"},{"$f":"INPUT!BS63","v":"ABS"},{"$f":"INPUT!BV63","v":"ABS"},{"$f":"INPUT!BW63","v":"ABS"},{"$f":"INPUT!BY63","v":""},"","ABS","",null,null,null,null,null,{"$f":"AP63&\"_\"&COUNTIF($AP$5:AP63,AP63)","v":"-_56"}]
[null,{"$f":"INPUT!F64","v":0},{"$f":"INPUT!C64","v":0},{"$f":"INPUT!D64","v":"00:00:00"},{"$f":"INPUT!E64","v":0},{"$f":"INPUT!G64","v":"0011"},{"$f":"INPUT!I64","v":"ABS"},{"$f":"INPUT!J64","v":"ABS"},{"$f":"INPUT!M64","v":"ABS"},{"$f":"INPUT!N64","v":"ABS"},{"$f":"INPUT!P64","v":"*"},{"$f":"INPUT!Q64","v":"0031"},{"$f":"INPUT!S64","v":"ABS"},{"$f":"INPUT!T64","v":"ABS"},{"$f":"INPUT!W64","v":"ABS"},{"$f":"INPUT!X64","v":"ABS"},{"$f":"INPUT!Z64","v":"*"},{"$f":"INPUT!AA64","v":"0051"},{"$f":"INPUT!AC64","v":"ABS"},{"$f":"INPUT!AD64","v":"ABS"},{"$f":"INPUT!AG64","v":"ABS"},{"$f":"INPUT!AH64","v":"ABS"},{"$f":"INPUT!AJ64","v":"*"},{"$f":"INPUT!AK64","v":0},{"$f":"INPUT!AM64","v":"ABS"},{"$f":"INPUT!AN64","v":"ABS"},{"$f":"INPUT!AQ64","v":"ABS"},{"$f":"INPUT!AR64","v":"ABS"},{"$f":"INPUT!AT64","v":"*"},{"$f":"INPUT!AU64","v":0},{"$f":"INPUT!AW64","v":"ABS"},{"$f":"INPUT!AX64","v":"ABS"},{"$f":"INPUT!BA64","v":"ABS"},{"$f":"INPUT!BB64","v":"ABS"},{"$f":"INPUT!BD64","v":"*"},{"$f":"INPUT!BE64","v":0},{"$f":"INPUT!BG64","v":"ABS"},{"$f":"INPUT!BH64","v":"ABS"},{"$f":"INPUT!BK64","v":"ABS"},{"$f":"INPUT!BL64","v":"ABS"},{"$f":"INPUT!BN64","v":"*"},{"$f":"INPUT!BO64","v":"-"},{"$f":"INPUT!BP64","v":0},{"$f":"INPUT!BR64","v":"ABS"},{"$f":"INPUT!BS64","v":"ABS"},{"$f":"INPUT!BV64","v":"ABS"},{"$f":"INPUT!BW64","v":"ABS"},{"$f":"INPUT!BY64","v":""},"","ABS","",null,null,null,null,null,{"$f":"AP64&\"_\"&COUNTIF($AP$5:AP64,AP64)","v":"-_57"}]
[null,{"$f":"INPUT!F65","v":0},{"$f":"INPUT!C65","v":0},{"$f":"INPUT!D65","v":"00:00:00"},{"$f":"INPUT!E65","v":0},{"$f":"INPUT!G65","v":"0011"},{"$f":"INPUT!I65","v":"ABS"},{"$f":"INPUT!J65","v":"ABS"},{"$f":"INPUT!M65","v":"ABS"},{"$f":"INPUT!N65","v":"ABS"},{"$f":"INPUT!P65","v":"*"},{"$f":"INPUT!Q65","v":"0031"},{"$f":"INPUT!S65","v":"ABS"},{"$f":"INPUT!T65","v":"ABS"},{"$f":"INPUT!W65","v":"ABS"},{"$f":"INPUT!X65","v":"ABS"},{"$f":"INPUT!Z65","v":"*"},{"$f":"INPUT!AA65","v":"0051"},{"$f":"INPUT!AC65","v":"ABS"},{"$f":"INPUT!AD65","v":"ABS"},{"$f":"INPUT!AG65","v":"ABS"},{"$f":"INPUT!AH65","v":"ABS"},{"$f":"INPUT!AJ65","v":"*"},{"$f":"INPUT!AK65","v":0},{"$f":"INPUT!AM65","v":"ABS"},{"$f":"INPUT!AN65","v":"ABS"},{"$f":"INPUT!AQ65","v":"ABS"},{"$f":"INPUT!AR65","v":"ABS"},{"$f":"INPUT!AT65","v":"*"},{"$f":"INPUT!AU65","v":0},{"$f":"INPUT!AW65","v":"ABS"},{"$f":"INPUT!AX65","v":"ABS"},{"$f":"INPUT!BA65","v":"ABS"},{"$f":"INPUT!BB65","v":"ABS"},{"$f":"INPUT!BD65","v":"*"},{"$f":"INPUT!BE65","v":0},{"$f":"INPUT!BG65","v":"ABS"},{"$f":"INPUT!BH65","v":"ABS"},{"$f":"INPUT!BK65","v":"ABS"},{"$f":"INPUT!BL65","v":"ABS"},{"$f":"INPUT!BN65","v":"*"},{"$f":"INPUT!BO65","v":"-"},{"$f":"INPUT!BP65","v":0},{"$f":"INPUT!BR65","v":"ABS"},{"$f":"INPUT!BS65","v":"ABS"},{"$f":"INPUT!BV65","v":"ABS"},{"$f":"INPUT!BW65","v":"ABS"},{"$f":"INPUT!BY65","v":""},"","ABS","",null,null,null,null,null,{"$f":"AP65&\"_\"&COUNTIF($AP$5:AP65,AP65)","v":"-_58"}]
[null,{"$f":"INPUT!F66","v":0},{"$f":"INPUT!C66","v":0},{"$f":"INPUT!D66","v":"00:00:00"},{"$f":"INPUT!E66","v":0},{"$f":"INPUT!G66","v":"0011"},{"$f":"INPUT!I66","v":"ABS"},{"$f":"INPUT!J66","v":"ABS"},{"$f":"INPUT!M66","v":"ABS"},{"$f":"INPUT!N66","v":"ABS"},{"$f":"INPUT!P66","v":"*"},{"$f":"INPUT!Q66","v":"0031"},{"$f":"INPUT!S66","v":"ABS"},{"$f":"INPUT!T66","v":"ABS"},{"$f":"INPUT!W66","v":"ABS"},{"$f":"INPUT!X66","v":"ABS"},{"$f":"INPUT!Z66","v":"*"},{"$f":"INPUT!AA66","v":"0051"},{"$f":"INPUT!AC66","v":"ABS"},{"$f":"INPUT!AD66","v":"ABS"},{"$f":"INPUT!AG66","v":"ABS"},{"$f":"INPUT!AH66","v":"ABS"},{"$f":"INPUT!AJ66","v":"*"},{"$f":"INPUT!AK66","v":0},{"$f":"INPUT!AM66","v":"ABS"},{"$f":"INPUT!AN66","v":"ABS"},{"$f":"INPUT!AQ66","v":"ABS"},{"$f":"INPUT!AR66","v":"ABS"},{"$f":"INPUT!AT66","v":"*"},{"$f":"INPUT!AU66","v":0},{"$f":"INPUT!AW66","v":"ABS"},{"$f":"INPUT!AX66","v":"ABS"},{"$f":"INPUT!BA66","v":"ABS"},{"$f":"INPUT!BB66","v":"ABS"},{"$f":"INPUT!BD66","v":"*"},{"$f":"INPUT!BE66","v":0},{"$f":"INPUT!BG66","v":"ABS"},{"$f":"INPUT!BH66","v":"ABS"},{"$f":"INPUT!BK66","v":"ABS"},{"$f":"INPUT!BL66","v":"ABS"},{"$f":"INPUT!BN66","v":"*"},{"$f":"INPUT!BO66","v":"-"},{"$f":"INPUT!BP66","v":0},{"$f":"INPUT!BR66","v":"ABS"},{"$f":"INPUT!BS66","v":"ABS"},{"$f":"INPUT!BV66","v":"ABS"},{"$f":"INPUT!BW66","v":"ABS"},{"$f":"INPUT!BY66","v":""},"","ABS","",null,null,null,null,null,{"$f":"AP66&\"_\"&COUNTIF($AP$5:AP66,AP66)","v":"-_59"}]
[null,{"$f":"INPUT!F67","v":0},{"$f":"INPUT!C67","v":0},{"$f":"INPUT!D67","v":"00:00:00"},{"$f":"INPUT!E67","v":0},{"$f":"INPUT!G67","v":"0011"},{"$f":"INPUT!I67","v":"ABS"},{"$f":"INPUT!J67","v":"ABS"},{"$f":"INPUT!M67","v":"ABS"},{"$f":"INPUT!N67","v":"ABS"},{"$f":"INPUT!P67","v":"*"},{"$f":"INPUT!Q67","v":"0031"},{"$f":"INPUT!S67","v":"ABS"},{"$f":"INPUT!T67","v":"ABS"},{"$f":"INPUT!W67","v":"ABS"},{"$f":"INPUT!X67","v":"ABS"},{"$f":"INPUT!Z67","v":"*"},{"$f":"INPUT!AA67","v":"0051"},{"$f":"INPUT!AC67","v":"ABS"},{"$f":"INPUT!AD67","v":"ABS"},{"$f":"INPUT!AG67","v":"ABS"},{"$f":"INPUT!AH67","v":"ABS"},{"$f":"INPUT!AJ67","v":"*"},{"$f":"INPUT!AK67","v":0},{"$f":"INPUT!AM67","v":"ABS"},{"$f":"INPUT!AN67","v":"ABS"},{"$f":"INPUT!AQ67","v":"ABS"},{"$f":"INPUT!AR67","v":"ABS"},{"$f":"INPUT!AT67","v":"*"},{"$f":"INPUT!AU67","v":0},{"$f":"INPUT!AW67","v":"ABS"},{"$f":"INPUT!AX67","v":"ABS"},{"$f":"INPUT!BA67","v":"ABS"},{"$f":"INPUT!BB67","v":"ABS"},{"$f":"INPUT!BD67","v":"*"},{"$f":"INPUT!BE67","v":0},{"$f":"INPUT!BG67","v":"ABS"},{"$f":"INPUT!BH67","v":"ABS"},{"$f":"INPUT!BK67","v":"ABS"},{"$f":"INPUT!BL67","v":"ABS"},{"$f":"INPUT!BN67","v":"*"},{"$f":"INPUT!BO67","v":"-"},{"$f":"INPUT!BP67","v":0},{"$f":"INPUT!BR67","v":"ABS"},{"$f":"INPUT!BS67","v":"ABS"},{"$f":"INPUT!BV67","v":"ABS"},{"$f":"INPUT!BW67","v":"ABS"},{"$f":"INPUT!BY67","v":""},"","ABS","",null,null,null,null,null,{"$f":"AP67&\"_\"&COUNTIF($AP$5:AP67,AP67)","v":"-_60"}]
[null,{"$f":"INPUT!F68","v":0},{"$f":"INPUT!C68","v":0},{"$f":"INPUT!D68","v":"00:00:00"},{"$f":"INPUT!E68","v":0},{"$f":"INPUT!G68","v":"0011"},{"$f":"INPUT!I68","v":"ABS"},{"$f":"INPUT!J68","v":"ABS"},{"$f":"INPUT!M68","v":"ABS"},{"$f":"INPUT!N68","v":"ABS"},{"$f":"INPUT!P68","v":"*"},{"$f":"INPUT!Q68","v":"0031"},{"$f":"INPUT!S68","v":"ABS"},{"$f":"INPUT!T68","v":"ABS"},{"$f":"INPUT!W68","v":"ABS"},{"$f":"INPUT!X68","v":"ABS"},{"$f":"INPUT!Z68","v":"*"},{"$f":"INPUT!AA68","v":"0051"},{"$f":"INPUT!AC68","v":"ABS"},{"$f":"INPUT!AD68","v":"ABS"},{"$f":"INPUT!AG68","v":"ABS"},{"$f":"INPUT!AH68","v":"ABS"},{"$f":"INPUT!AJ68","v":"*"},{"$f":"INPUT!AK68","v":0},{"$f":"INPUT!AM68","v":"ABS"},{"$f":"INPUT!AN68","v":"ABS"},{"$f":"INPUT!AQ68","v":"ABS"},{"$f":"INPUT!AR68","v":"ABS"},{"$f":"INPUT!AT68","v":"*"},{"$f":"INPUT!AU68","v":0},{"$f":"INPUT!AW68","v":"ABS"},{"$f":"INPUT!AX68","v":"ABS"},{"$f":"INPUT!BA68","v":"ABS"},{"$f":"INPUT!BB68","v":"ABS"},{"$f":"INPUT!BD68","v":"*"},{"$f":"INPUT!BE68","v":0},{"$f":"INPUT!BG68","v":"ABS"},{"$f":"INPUT!BH68","v":"ABS"},{"$f":"INPUT!BK68","v":"ABS"},{"$f":"INPUT!BL68","v":"ABS"},{"$f":"INPUT!BN68","v":"*"},{"$f":"INPUT!BO68","v":"-"},{"$f":"INPUT!BP68","v":0},{"$f":"INPUT!BR68","v":"ABS"},{"$f":"INPUT!BS68","v":"ABS"},{"$f":"INPUT!BV68","v":"ABS"},{"$f":"INPUT!BW68","v":"ABS"},{"$f":"INPUT!BY68","v":""},"","ABS","",null,null,null,null,null,{"$f":"AP68&\"_\"&COUNTIF($AP$5:AP68,AP68)","v":"-_61"}]
[null,{"$f":"INPUT!F69","v":0},{"$f":"INPUT!C69","v":0},{"$f":"INPUT!D69","v":"00:00:00"},{"$f":"INPUT!E69","v":0},{"$f":"INPUT!G69","v":"0011"},{"$f":"INPUT!I69","v":"ABS"},{"$f":"INPUT!J69","v":"ABS"},{"$f":"INPUT!M69","v":"ABS"},{"$f":"INPUT!N69","v":"ABS"},{"$f":"INPUT!P69","v":"*"},{"$f":"INPUT!Q69","v":"0031"},{"$f":"INPUT!S69","v":"ABS"},{"$f":"INPUT!T69","v":"ABS"},{"$f":"INPUT!W69","v":"ABS"},{"$f":"INPUT!X69","v":"ABS"},{"$f":"INPUT!Z69","v":"*"},{"$f":"INPUT!AA69","v":"0051"},{"$f":"INPUT!AC69","v":"ABS"},{"$f":"INPUT!AD69","v":"ABS"},{"$f":"INPUT!AG69","v":"ABS"},{"$f":"INPUT!AH69","v":"ABS"},{"$f":"INPUT!AJ69","v":"*"},{"$f":"INPUT!AK69","v":0},{"$f":"INPUT!AM69","v":"ABS"},{"$f":"INPUT!AN69","v":"ABS"},{"$f":"INPUT!AQ69","v":"ABS"},{"$f":"INPUT!AR69","v":"ABS"},{"$f":"INPUT!AT69","v":"*"},{"$f":"INPUT!AU69","v":0},{"$f":"INPUT!AW69","v":"ABS"},{"$f":"INPUT!AX69","v":"ABS"},{"$f":"INPUT!BA69","v":"ABS"},{"$f":"INPUT!BB69","v":"ABS"},{"$f":"INPUT!BD69","v":"*"},{"$f":"INPUT!BE69","v":0},{"$f":"INPUT!BG69","v":"ABS"},{"$f":"INPUT!BH69","v":"ABS"},{"$f":"INPUT!BK69","v":"ABS"},{"$f":"INPUT!BL69","v":"ABS"},{"$f":"INPUT!BN69","v":"*"},{"$f":"INPUT!BO69","v":"-"},{"$f":"INPUT!BP69","v":0},{"$f":"INPUT!BR69","v":"ABS"},{"$f":"INPUT!BS69","v":"ABS"},{"$f":"INPUT!BV69","v":"ABS"},{"$f":"INPUT!BW69","v":"ABS"},{"$f":"INPUT!BY69","v":""},"","ABS","",null,null,null,null,null,{"$f":"AP69&\"_\"&COUNTIF($AP$5:AP69,AP69)","v":"-_62"}]
[null,{"$f":"INPUT!F70","v":0},{"$f":"INPUT!C70","v":0},{"$f":"INPUT!D70","v":"00:00:00"},{"$f":"INPUT!E70","v":0},{"$f":"INPUT!G70","v":"0011"},{"$f":"INPUT!I70","v":"ABS"},{"$f":"INPUT!J70","v":"ABS"},{"$f":"INPUT!M70","v":"ABS"},{"$f":"INPUT!N70","v":"ABS"},{"$f":"INPUT!P70","v":"*"},{"$f":"INPUT!Q70","v":"0031"},{"$f":"INPUT!S70","v":"ABS"},{"$f":"INPUT!T70","v":"ABS"},{"$f":"INPUT!W70","v":"ABS"},{"$f":"INPUT!X70","v":"ABS"},{"$f":"INPUT!Z70","v":"*"},{"$f":"INPUT!AA70","v":"0051"},{"$f":"INPUT!AC70","v":"ABS"},{"$f":"INPUT!AD70","v":"ABS"},{"$f":"INPUT!AG70","v":"ABS"},{"$f":"INPUT!AH70","v":"ABS"},{"$f":"INPUT!AJ70","v":"*"},{"$f":"INPUT!AK70","v":0},{"$f":"INPUT!AM70","v":"ABS"},{"$f":"INPUT!AN70","v":"ABS"},{"$f":"INPUT!AQ70","v":"ABS"},{"$f":"INPUT!AR70","v":"ABS"},{"$f":"INPUT!AT70","v":"*"},{"$f":"INPUT!AU70","v":0},{"$f":"INPUT!AW70","v":"ABS"},{"$f":"INPUT!AX70","v":"ABS"},{"$f":"INPUT!BA70","v":"ABS"},{"$f":"INPUT!BB70","v":"ABS"},{"$f":"INPUT!BD70","v":"*"},{"$f":"INPUT!BE70","v":0},{"$f":"INPUT!BG70","v":"ABS"},{"$f":"INPUT!BH70","v":"ABS"},{"$f":"INPUT!BK70","v":"ABS"},{"$f":"INPUT!BL70","v":"ABS"},{"$f":"INPUT!BN70","v":"*"},{"$f":"INPUT!BO70","v":"-"},{"$f":"INPUT!BP70","v":0},{"$f":"INPUT!BR70","v":"ABS"},{"$f":"INPUT!BS70","v":"ABS"},{"$f":"INPUT!BV70","v":"ABS"},{"$f":"INPUT!BW70","v":"ABS"},{"$f":"INPUT!BY70","v":""},{"$f":"IF(OR(G70=\"NG\",M70=\"NG\",S70=\"NG\",Y70=\"NG\",AE70=\"NG\",AK70=\"NG\"),\"NG\",\"\")","v":""},{"$f":"IF(OR(H70=\"ABS\",N70=\"ABS\",T70=\"ABS\",Z70=\"ABS\",AF70=\"ABS\",AL70=\"ABS\"),\"ABS\",\"\")","v":"ABS"},{"$f":"IF(OR(J70=\"-\",P70=\"-\",V70=\"-\",AB70=\"-\",AH70=\"-\",AN70=\"NG\",AW70=\"NG\"),\"W\",\"\")","v":""},null,null,null,null,null,{"$f":"AP70&\"_\"&COUNTIF($AP$5:AP70,AP70)","v":"-_63"}]
[null,{"$f":"INPUT!F71","v":0},{"$f":"INPUT!C71","v":0},{"$f":"INPUT!D71","v":"00:00:00"},{"$f":"INPUT!E71","v":0},{"$f":"INPUT!G71","v":"0011"},{"$f":"INPUT!I71","v":"ABS"},{"$f":"INPUT!J71","v":"ABS"},{"$f":"INPUT!M71","v":"ABS"},{"$f":"INPUT!N71","v":"ABS"},{"$f":"INPUT!P71","v":"*"},{"$f":"INPUT!Q71","v":"0031"},{"$f":"INPUT!S71","v":"ABS"},{"$f":"INPUT!T71","v":"ABS"},{"$f":"INPUT!W71","v":"ABS"},{"$f":"INPUT!X71","v":"ABS"},{"$f":"INPUT!Z71","v":"*"},{"$f":"INPUT!AA71","v":"0051"},{"$f":"INPUT!AC71","v":"ABS"},{"$f":"INPUT!AD71","v":"ABS"},{"$f":"INPUT!AG71","v":"ABS"},{"$f":"INPUT!AH71","v":"ABS"},{"$f":"INPUT!AJ71","v":"*"},{"$f":"INPUT!AK71","v":0},{"$f":"INPUT!AM71","v":"ABS"},{"$f":"INPUT!AN71","v":"ABS"},{"$f":"INPUT!AQ71","v":"ABS"},{"$f":"INPUT!AR71","v":"ABS"},{"$f":"INPUT!AT71","v":"*"},{"$f":"INPUT!AU71","v":0},{"$f":"INPUT!AW71","v":"ABS"},{"$f":"INPUT!AX71","v":"ABS"},{"$f":"INPUT!BA71","v":"ABS"},{"$f":"INPUT!BB71","v":"ABS"},{"$f":"INPUT!BD71","v":"*"},{"$f":"INPUT!BE71","v":0},{"$f":"INPUT!BG71","v":"ABS"},{"$f":"INPUT!BH71","v":"ABS"},{"$f":"INPUT!BK71","v":"ABS"},{"$f":"INPUT!BL71","v":"ABS"},{"$f":"INPUT!BN71","v":"*"},{"$f":"INPUT!BO71","v":"-"},{"$f":"INPUT!BP71","v":0},{"$f":"INPUT!BR71","v":"ABS"},{"$f":"INPUT!BS71","v":"ABS"},{"$f":"INPUT!BV71","v":"ABS"},{"$f":"INPUT!BW71","v":"ABS"},{"$f":"INPUT!BY71","v":""},"","ABS","",null,null,null,null,null,{"$f":"AP71&\"_\"&COUNTIF($AP$5:AP71,AP71)","v":"-_64"}]
[null,{"$f":"INPUT!F72","v":0},{"$f":"INPUT!C72","v":0},{"$f":"INPUT!D72","v":"00:00:00"},{"$f":"INPUT!E72","v":0},{"$f":"INPUT!G72","v":"0011"},{"$f":"INPUT!I72","v":"ABS"},{"$f":"INPUT!J72","v":"ABS"},{"$f":"INPUT!M72","v":"ABS"},{"$f":"INPUT!N72","v":"ABS"},{"$f":"INPUT!P72","v":"*"},{"$f":"INPUT!Q72","v":"0031"},{"$f":"INPUT!S72","v":"ABS"},{"$f":"INPUT!T72","v":"ABS"},{"$f":"INPUT!W72","v":"ABS"},{"$f":"INPUT!X72","v":"ABS"},{"$f":"INPUT!Z72","v":"*"},{"$f":"INPUT!AA72","v":"0051"},{"$f":"INPUT!AC72","v":"ABS"},{"$f":"INPUT!AD72","v":"ABS"},{"$f":"INPUT!AG72","v":"ABS"},{"$f":"INPUT!AH72","v":"ABS"},{"$f":"INPUT!AJ72","v":"*"},{"$f":"INPUT!AK72","v":0},{"$f":"INPUT!AM72","v":"ABS"},{"$f":"INPUT!AN72","v":"ABS"},{"$f":"INPUT!AQ72","v":"ABS"},{"$f":"INPUT!AR72","v":"ABS"},{"$f":"INPUT!AT72","v":"*"},{"$f":"INPUT!AU72","v":0},{"$f":"INPUT!AW72","v":"ABS"},{"$f":"INPUT!AX72","v":"ABS"},{"$f":"INPUT!BA72","v":"ABS"},{"$f":"INPUT!BB72","v":"ABS"},{"$f":"INPUT!BD72","v":"*"},{"$f":"INPUT!BE72","v":0},{"$f":"INPUT!BG72","v":"ABS"},{"$f":"INPUT!BH72","v":"ABS"},{"$f":"INPUT!BK72","v":"ABS"},{"$f":"INPUT!BL72","v":"ABS"},{"$f":"INPUT!BN72","v":"*"},{"$f":"INPUT!BO72","v":"-"},{"$f":"INPUT!BP72","v":0},{"$f":"INPUT!BR72","v":"ABS"},{"$f":"INPUT!BS72","v":"ABS"},{"$f":"INPUT!BV72","v":"ABS"},{"$f":"INPUT!BW72","v":"ABS"},{"$f":"INPUT!BY72","v":""},"","ABS","",null,null,null,null,null,{"$f":"AP72&\"_\"&COUNTIF($AP$5:AP72,AP72)","v":"-_65"}]
[null,{"$f":"INPUT!F73","v":0},{"$f":"INPUT!C73","v":0},{"$f":"INPUT!D73","v":"00:00:00"},{"$f":"INPUT!E73","v":0},{"$f":"INPUT!G73","v":"0011"},{"$f":"INPUT!I73","v":"ABS"},{"$f":"INPUT!J73","v":"ABS"},{"$f":"INPUT!M73","v":"ABS"},{"$f":"INPUT!N73","v":"ABS"},{"$f":"INPUT!P73","v":"*"},{"$f":"INPUT!Q73","v":"0031"},{"$f":"INPUT!S73","v":"ABS"},{"$f":"INPUT!T73","v":"ABS"},{"$f":"INPUT!W73","v":"ABS"},{"$f":"INPUT!X73","v":"ABS"},{"$f":"INPUT!Z73","v":"*"},{"$f":"INPUT!AA73","v":"0051"},{"$f":"INPUT!AC73","v":"ABS"},{"$f":"INPUT!AD73","v":"ABS"},{"$f":"INPUT!AG73","v":"ABS"},{"$f":"INPUT!AH73","v":"ABS"},{"$f":"INPUT!AJ73","v":"*"},{"$f":"INPUT!AK73","v":0},{"$f":"INPUT!AM73","v":"ABS"},{"$f":"INPUT!AN73","v":"ABS"},{"$f":"INPUT!AQ73","v":"ABS"},{"$f":"INPUT!AR73","v":"ABS"},{"$f":"INPUT!AT73","v":"*"},{"$f":"INPUT!AU73","v":0},{"$f":"INPUT!AW73","v":"ABS"},{"$f":"INPUT!AX73","v":"ABS"},{"$f":"INPUT!BA73","v":"ABS"},{"$f":"INPUT!BB73","v":"ABS"},{"$f":"INPUT!BD73","v":"*"},{"$f":"INPUT!BE73","v":0},{"$f":"INPUT!BG73","v":"ABS"},{"$f":"INPUT!BH73","v":"ABS"},{"$f":"INPUT!BK73","v":"ABS"},{"$f":"INPUT!BL73","v":"ABS"},{"$f":"INPUT!BN73","v":"*"},{"$f":"INPUT!BO73","v":"-"},{"$f":"INPUT!BP73","v":0},{"$f":"INPUT!BR73","v":"ABS"},{"$f":"INPUT!BS73","v":"ABS"},{"$f":"INPUT!BV73","v":"ABS"},{"$f":"INPUT!BW73","v":"ABS"},{"$f":"INPUT!BY73","v":""},"","ABS","",null,null,null,null,null,{"$f":"AP73&\"_\"&COUNTIF($AP$5:AP73,AP73)","v":"-_66"}]
[null,{"$f":"INPUT!F74","v":0},{"$f":"INPUT!C74","v":0},{"$f":"INPUT!D74","v":"00:00:00"},{"$f":"INPUT!E74","v":0},{"$f":"INPUT!G74","v":"0011"},{"$f":"INPUT!I74","v":"ABS"},{"$f":"INPUT!J74","v":"ABS"},{"$f":"INPUT!M74","v":"ABS"},{"$f":"INPUT!N74","v":"ABS"},{"$f":"INPUT!P74","v":"*"},{"$f":"INPUT!Q74","v":"0031"},{"$f":"INPUT!S74","v":"ABS"},{"$f":"INPUT!T74","v":"ABS"},{"$f":"INPUT!W74","v":"ABS"},{"$f":"INPUT!X74","v":"ABS"},{"$f":"INPUT!Z74","v":"*"},{"$f":"INPUT!AA74","v":"0051"},{"$f":"INPUT!AC74","v":"ABS"},{"$f":"INPUT!AD74","v":"ABS"},{"$f":"INPUT!AG74","v":"ABS"},{"$f":"INPUT!AH74","v":"ABS"},{"$f":"INPUT!AJ74","v":"*"},{"$f":"INPUT!AK74","v":0},{"$f":"INPUT!AM74","v":"ABS"},{"$f":"INPUT!AN74","v":"ABS"},{"$f":"INPUT!AQ74","v":"ABS"},{"$f":"INPUT!AR74","v":"ABS"},{"$f":"INPUT!AT74","v":"*"},{"$f":"INPUT!AU74","v":0},{"$f":"INPUT!AW74","v":"ABS"},{"$f":"INPUT!AX74","v":"ABS"},{"$f":"INPUT!BA74","v":"ABS"},{"$f":"INPUT!BB74","v":"ABS"},{"$f":"INPUT!BD74","v":"*"},{"$f":"INPUT!BE74","v":0},{"$f":"INPUT!BG74","v":"ABS"},{"$f":"INPUT!BH74","v":"ABS"},{"$f":"INPUT!BK74","v":"ABS"},{"$f":"INPUT!BL74","v":"ABS"},{"$f":"INPUT!BN74","v":"*"},{"$f":"INPUT!BO74","v":"-"},{"$f":"INPUT!BP74","v":0},{"$f":"INPUT!BR74","v":"ABS"},{"$f":"INPUT!BS74","v":"ABS"},{"$f":"INPUT!BV74","v":"ABS"},{"$f":"INPUT!BW74","v":"ABS"},{"$f":"INPUT!BY74","v":""},"","ABS","",null,null,null,null,null,{"$f":"AP74&\"_\"&COUNTIF($AP$5:AP74,AP74)","v":"-_67"}]
[null,{"$f":"INPUT!F75","v":0},{"$f":"INPUT!C75","v":0},{"$f":"INPUT!D75","v":"00:00:00"},{"$f":"INPUT!E75","v":0},{"$f":"INPUT!G75","v":"0011"},{"$f":"INPUT!I75","v":"ABS"},{"$f":"INPUT!J75","v":"ABS"},{"$f":"INPUT!M75","v":"ABS"},{"$f":"INPUT!N75","v":"ABS"},{"$f":"INPUT!P75","v":"*"},{"$f":"INPUT!Q75","v":"0031"},{"$f":"INPUT!S75","v":"ABS"},{"$f":"INPUT!T75","v":"ABS"},{"$f":"INPUT!W75","v":"ABS"},{"$f":"INPUT!X75","v":"ABS"},{"$f":"INPUT!Z75","v":"*"},{"$f":"INPUT!AA75","v":"0051"},{"$f":"INPUT!AC75","v":"ABS"},{"$f":"INPUT!AD75","v":"ABS"},{"$f":"INPUT!AG75","v":"ABS"},{"$f":"INPUT!AH75","v":"ABS"},{"$f":"INPUT!AJ75","v":"*"},{"$f":"INPUT!AK75","v":0},{"$f":"INPUT!AM75","v":"ABS"},{"$f":"INPUT!AN75","v":"ABS"},{"$f":"INPUT!AQ75","v":"ABS"},{"$f":"INPUT!AR75","v":"ABS"},{"$f":"INPUT!AT75","v":"*"},{"$f":"INPUT!AU75","v":0},{"$f":"INPUT!AW75","v":"ABS"},{"$f":"INPUT!AX75","v":"ABS"},{"$f":"INPUT!BA75","v":"ABS"},{"$f":"INPUT!BB75","v":"ABS"},{"$f":"INPUT!BD75","v":"*"},{"$f":"INPUT!BE75","v":0},{"$f":"INPUT!BG75","v":"ABS"},{"$f":"INPUT!BH75","v":"ABS"},{"$f":"INPUT!BK75","v":"ABS"},{"$f":"INPUT!BL75","v":"ABS"},{"$f":"INPUT!BN75","v":"*"},{"$f":"INPUT!BO75","v":"-"},{"$f":"INPUT!BP75","v":0},{"$f":"INPUT!BR75","v":"ABS"},{"$f":"INPUT!BS75","v":"ABS"},{"$f":"INPUT!BV75","v":"ABS"},{"$f":"INPUT!BW75","v":"ABS"},{"$f":"INPUT!BY75","v":""},"","ABS","",null,null,null,null,null,{"$f":"AP75&\"_\"&COUNTIF($AP$5:AP75,AP75)","v":"-_68"}]
[null,{"$f":"INPUT!F76","v":0},{"$f":"INPUT!C76","v":0},{"$f":"INPUT!D76","v":"00:00:00"},{"$f":"INPUT!E76","v":0},{"$f":"INPUT!G76","v":"0011"},{"$f":"INPUT!I76","v":"ABS"},{"$f":"INPUT!J76","v":"ABS"},{"$f":"INPUT!M76","v":"ABS"},{"$f":"INPUT!N76","v":"ABS"},{"$f":"INPUT!P76","v":"*"},{"$f":"INPUT!Q76","v":"0031"},{"$f":"INPUT!S76","v":"ABS"},{"$f":"INPUT!T76","v":"ABS"},{"$f":"INPUT!W76","v":"ABS"},{"$f":"INPUT!X76","v":"ABS"},{"$f":"INPUT!Z76","v":"*"},{"$f":"INPUT!AA76","v":"0051"},{"$f":"INPUT!AC76","v":"ABS"},{"$f":"INPUT!AD76","v":"ABS"},{"$f":"INPUT!AG76","v":"ABS"},{"$f":"INPUT!AH76","v":"ABS"},{"$f":"INPUT!AJ76","v":"*"},{"$f":"INPUT!AK76","v":0},{"$f":"INPUT!AM76","v":"ABS"},{"$f":"INPUT!AN76","v":"ABS"},{"$f":"INPUT!AQ76","v":"ABS"},{"$f":"INPUT!AR76","v":"ABS"},{"$f":"INPUT!AT76","v":"*"},{"$f":"INPUT!AU76","v":0},{"$f":"INPUT!AW76","v":"ABS"},{"$f":"INPUT!AX76","v":"ABS"},{"$f":"INPUT!BA76","v":"ABS"},{"$f":"INPUT!BB76","v":"ABS"},{"$f":"INPUT!BD76","v":"*"},{"$f":"INPUT!BE76","v":0},{"$f":"INPUT!BG76","v":"ABS"},{"$f":"INPUT!BH76","v":"ABS"},{"$f":"INPUT!BK76","v":"ABS"},{"$f":"INPUT!BL76","v":"ABS"},{"$f":"INPUT!BN76","v":"*"},{"$f":"INPUT!BO76","v":"-"},{"$f":"INPUT!BP76","v":0},{"$f":"INPUT!BR76","v":"ABS"},{"$f":"INPUT!BS76","v":"ABS"},{"$f":"INPUT!BV76","v":"ABS"},{"$f":"INPUT!BW76","v":"ABS"},{"$f":"INPUT!BY76","v":""},"","ABS","",null,null,null,null,null,{"$f":"AP76&\"_\"&COUNTIF($AP$5:AP76,AP76)","v":"-_69"}]
[null,{"$f":"INPUT!F77","v":0},{"$f":"INPUT!C77","v":0},{"$f":"INPUT!D77","v":"00:00:00"},{"$f":"INPUT!E77","v":0},{"$f":"INPUT!G77","v":"0011"},{"$f":"INPUT!I77","v":"ABS"},{"$f":"INPUT!J77","v":"ABS"},{"$f":"INPUT!M77","v":"ABS"},{"$f":"INPUT!N77","v":"ABS"},{"$f":"INPUT!P77","v":"*"},{"$f":"INPUT!Q77","v":"0031"},{"$f":"INPUT!S77","v":"ABS"},{"$f":"INPUT!T77","v":"ABS"},{"$f":"INPUT!W77","v":"ABS"},{"$f":"INPUT!X77","v":"ABS"},{"$f":"INPUT!Z77","v":"*"},{"$f":"INPUT!AA77","v":"0051"},{"$f":"INPUT!AC77","v":"ABS"},{"$f":"INPUT!AD77","v":"ABS"},{"$f":"INPUT!AG77","v":"ABS"},{"$f":"INPUT!AH77","v":"ABS"},{"$f":"INPUT!AJ77","v":"*"},{"$f":"INPUT!AK77","v":0},{"$f":"INPUT!AM77","v":"ABS"},{"$f":"INPUT!AN77","v":"ABS"},{"$f":"INPUT!AQ77","v":"ABS"},{"$f":"INPUT!AR77","v":"ABS"},{"$f":"INPUT!AT77","v":"*"},{"$f":"INPUT!AU77","v":0},{"$f":"INPUT!AW77","v":"ABS"},{"$f":"INPUT!AX77","v":"ABS"},{"$f":"INPUT!BA77","v":"ABS"},{"$f":"INPUT!BB77","v":"ABS"},{"$f":"INPUT!BD77","v":"*"},{"$f":"INPUT!BE77","v":0},{"$f":"INPUT!BG77","v":"ABS"},{"$f":"INPUT!BH77","v":"ABS"},{"$f":"INPUT!BK77","v":"ABS"},{"$f":"INPUT!BL77","v":"ABS"},{"$f":"INPUT!BN77","v":"*"},{"$f":"INPUT!BO77","v":"-"},{"$f":"INPUT!BP77","v":0},{"$f":"INPUT!BR77","v":"ABS"},{"$f":"INPUT!BS77","v":"ABS"},{"$f":"INPUT!BV77","v":"ABS"},{"$f":"INPUT!BW77","v":"ABS"},{"$f":"INPUT!BY77","v":""},"","ABS","",null,null,null,null,null,{"$f":"AP77&\"_\"&COUNTIF($AP$5:AP77,AP77)","v":"-_70"}]
[null,{"$f":"INPUT!F78","v":0},{"$f":"INPUT!C78","v":0},{"$f":"INPUT!D78","v":"00:00:00"},{"$f":"INPUT!E78","v":0},{"$f":"INPUT!G78","v":"0011"},{"$f":"INPUT!I78","v":"ABS"},{"$f":"INPUT!J78","v":"ABS"},{"$f":"INPUT!M78","v":"ABS"},{"$f":"INPUT!N78","v":"ABS"},{"$f":"INPUT!P78","v":"*"},{"$f":"INPUT!Q78","v":"0031"},{"$f":"INPUT!S78","v":"ABS"},{"$f":"INPUT!T78","v":"ABS"},{"$f":"INPUT!W78","v":"ABS"},{"$f":"INPUT!X78","v":"ABS"},{"$f":"INPUT!Z78","v":"*"},{"$f":"INPUT!AA78","v":"0051"},{"$f":"INPUT!AC78","v":"ABS"},{"$f":"INPUT!AD78","v":"ABS"},{"$f":"INPUT!AG78","v":"ABS"},{"$f":"INPUT!AH78","v":"ABS"},{"$f":"INPUT!AJ78","v":"*"},{"$f":"INPUT!AK78","v":0},{"$f":"INPUT!AM78","v":"ABS"},{"$f":"INPUT!AN78","v":"ABS"},{"$f":"INPUT!AQ78","v":"ABS"},{"$f":"INPUT!AR78","v":"ABS"},{"$f":"INPUT!AT78","v":"*"},{"$f":"INPUT!AU78","v":0},{"$f":"INPUT!AW78","v":"ABS"},{"$f":"INPUT!AX78","v":"ABS"},{"$f":"INPUT!BA78","v":"ABS"},{"$f":"INPUT!BB78","v":"ABS"},{"$f":"INPUT!BD78","v":"*"},{"$f":"INPUT!BE78","v":0},{"$f":"INPUT!BG78","v":"ABS"},{"$f":"INPUT!BH78","v":"ABS"},{"$f":"INPUT!BK78","v":"ABS"},{"$f":"INPUT!BL78","v":"ABS"},{"$f":"INPUT!BN78","v":"*"},{"$f":"INPUT!BO78","v":"-"},{"$f":"INPUT!BP78","v":0},{"$f":"INPUT!BR78","v":"ABS"},{"$f":"INPUT!BS78","v":"ABS"},{"$f":"INPUT!BV78","v":"ABS"},{"$f":"INPUT!BW78","v":"ABS"},{"$f":"INPUT!BY78","v":""},"","ABS","",null,null,null,null,null,{"$f":"AP78&\"_\"&COUNTIF($AP$5:AP78,AP78)","v":"-_71"}]
[null,{"$f":"INPUT!F79","v":0},{"$f":"INPUT!C79","v":0},{"$f":"INPUT!D79","v":"00:00:00"},{"$f":"INPUT!E79","v":0},{"$f":"INPUT!G79","v":"0011"},{"$f":"INPUT!I79","v":"ABS"},{"$f":"INPUT!J79","v":"ABS"},{"$f":"INPUT!M79","v":"ABS"},{"$f":"INPUT!N79","v":"ABS"},{"$f":"INPUT!P79","v":"*"},{"$f":"INPUT!Q79","v":"0031"},{"$f":"INPUT!S79","v":"ABS"},{"$f":"INPUT!T79","v":"ABS"},{"$f":"INPUT!W79","v":"ABS"},{"$f":"INPUT!X79","v":"ABS"},{"$f":"INPUT!Z79","v":"*"},{"$f":"INPUT!AA79","v":"0051"},{"$f":"INPUT!AC79","v":"ABS"},{"$f":"INPUT!AD79","v":"ABS"},{"$f":"INPUT!AG79","v":"ABS"},{"$f":"INPUT!AH79","v":"ABS"},{"$f":"INPUT!AJ79","v":"*"},{"$f":"INPUT!AK79","v":0},{"$f":"INPUT!AM79","v":"ABS"},{"$f":"INPUT!AN79","v":"ABS"},{"$f":"INPUT!AQ79","v":"ABS"},{"$f":"INPUT!AR79","v":"ABS"},{"$f":"INPUT!AT79","v":"*"},{"$f":"INPUT!AU79","v":0},{"$f":"INPUT!AW79","v":"ABS"},{"$f":"INPUT!AX79","v":"ABS"},{"$f":"INPUT!BA79","v":"ABS"},{"$f":"INPUT!BB79","v":"ABS"},{"$f":"INPUT!BD79","v":"*"},{"$f":"INPUT!BE79","v":0},{"$f":"INPUT!BG79","v":"ABS"},{"$f":"INPUT!BH79","v":"ABS"},{"$f":"INPUT!BK79","v":"ABS"},{"$f":"INPUT!BL79","v":"ABS"},{"$f":"INPUT!BN79","v":"*"},{"$f":"INPUT!BO79","v":"-"},{"$f":"INPUT!BP79","v":0},{"$f":"INPUT!BR79","v":"ABS"},{"$f":"INPUT!BS79","v":"ABS"},{"$f":"INPUT!BV79","v":"ABS"},{"$f":"INPUT!BW79","v":"ABS"},{"$f":"INPUT!BY79","v":""},"","ABS","",null,null,null,null,null,{"$f":"AP79&\"_\"&COUNTIF($AP$5:AP79,AP79)","v":"-_72"}]
[null,{"$f":"INPUT!F80","v":0},{"$f":"INPUT!C80","v":0},{"$f":"INPUT!D80","v":"00:00:00"},{"$f":"INPUT!E80","v":0},{"$f":"INPUT!G80","v":"0011"},{"$f":"INPUT!I80","v":"ABS"},{"$f":"INPUT!J80","v":"ABS"},{"$f":"INPUT!M80","v":"ABS"},{"$f":"INPUT!N80","v":"ABS"},{"$f":"INPUT!P80","v":"*"},{"$f":"INPUT!Q80","v":"0031"},{"$f":"INPUT!S80","v":"ABS"},{"$f":"INPUT!T80","v":"ABS"},{"$f":"INPUT!W80","v":"ABS"},{"$f":"INPUT!X80","v":"ABS"},{"$f":"INPUT!Z80","v":"*"},{"$f":"INPUT!AA80","v":"0051"},{"$f":"INPUT!AC80","v":"ABS"},{"$f":"INPUT!AD80","v":"ABS"},{"$f":"INPUT!AG80","v":"ABS"},{"$f":"INPUT!AH80","v":"ABS"},{"$f":"INPUT!AJ80","v":"*"},{"$f":"INPUT!AK80","v":0},{"$f":"INPUT!AM80","v":"ABS"},{"$f":"INPUT!AN80","v":"ABS"},{"$f":"INPUT!AQ80","v":"ABS"},{"$f":"INPUT!AR80","v":"ABS"},{"$f":"INPUT!AT80","v":"*"},{"$f":"INPUT!AU80","v":0},{"$f":"INPUT!AW80","v":"ABS"},{"$f":"INPUT!AX80","v":"ABS"},{"$f":"INPUT!BA80","v":"ABS"},{"$f":"INPUT!BB80","v":"ABS"},{"$f":"INPUT!BD80","v":"*"},{"$f":"INPUT!BE80","v":0},{"$f":"INPUT!BG80","v":"ABS"},{"$f":"INPUT!BH80","v":"ABS"},{"$f":"INPUT!BK80","v":"ABS"},{"$f":"INPUT!BL80","v":"ABS"},{"$f":"INPUT!BN80","v":"*"},{"$f":"INPUT!BO80","v":"-"},{"$f":"INPUT!BP80","v":0},{"$f":"INPUT!BR80","v":"ABS"},{"$f":"INPUT!BS80","v":"ABS"},{"$f":"INPUT!BV80","v":"ABS"},{"$f":"INPUT!BW80","v":"ABS"},{"$f":"INPUT!BY80","v":""},"","ABS","",null,null,null,null,null,{"$f":"AP80&\"_\"&COUNTIF($AP$5:AP80,AP80)","v":"-_73"}]
[null,{"$f":"INPUT!F81","v":0},{"$f":"INPUT!C81","v":0},{"$f":"INPUT!D81","v":"00:00:00"},{"$f":"INPUT!E81","v":0},{"$f":"INPUT!G81","v":"0011"},{"$f":"INPUT!I81","v":"ABS"},{"$f":"INPUT!J81","v":"ABS"},{"$f":"INPUT!M81","v":"ABS"},{"$f":"INPUT!N81","v":"ABS"},{"$f":"INPUT!P81","v":"*"},{"$f":"INPUT!Q81","v":"0031"},{"$f":"INPUT!S81","v":"ABS"},{"$f":"INPUT!T81","v":"ABS"},{"$f":"INPUT!W81","v":"ABS"},{"$f":"INPUT!X81","v":"ABS"},{"$f":"INPUT!Z81","v":"*"},{"$f":"INPUT!AA81","v":"0051"},{"$f":"INPUT!AC81","v":"ABS"},{"$f":"INPUT!AD81","v":"ABS"},{"$f":"INPUT!AG81","v":"ABS"},{"$f":"INPUT!AH81","v":"ABS"},{"$f":"INPUT!AJ81","v":"*"},{"$f":"INPUT!AK81","v":0},{"$f":"INPUT!AM81","v":"ABS"},{"$f":"INPUT!AN81","v":"ABS"},{"$f":"INPUT!AQ81","v":"ABS"},{"$f":"INPUT!AR81","v":"ABS"},{"$f":"INPUT!AT81","v":"*"},{"$f":"INPUT!AU81","v":0},{"$f":"INPUT!AW81","v":"ABS"},{"$f":"INPUT!AX81","v":"ABS"},{"$f":"INPUT!BA81","v":"ABS"},{"$f":"INPUT!BB81","v":"ABS"},{"$f":"INPUT!BD81","v":"*"},{"$f":"INPUT!BE81","v":0},{"$f":"INPUT!BG81","v":"ABS"},{"$f":"INPUT!BH81","v":"ABS"},{"$f":"INPUT!BK81","v":"ABS"},{"$f":"INPUT!BL81","v":"ABS"},{"$f":"INPUT!BN81","v":"*"},{"$f":"INPUT!BO81","v":"-"},{"$f":"INPUT!BP81","v":0},{"$f":"INPUT!BR81","v":"ABS"},{"$f":"INPUT!BS81","v":"ABS"},{"$f":"INPUT!BV81","v":"ABS"},{"$f":"INPUT!BW81","v":"ABS"},{"$f":"INPUT!BY81","v":""},"","ABS","",null,null,null,null,null,{"$f":"AP81&\"_\"&COUNTIF($AP$5:AP81,AP81)","v":"-_74"}]
[null,{"$f":"INPUT!F82","v":0},{"$f":"INPUT!C82","v":0},{"$f":"INPUT!D82","v":"00:00:00"},{"$f":"INPUT!E82","v":0},{"$f":"INPUT!G82","v":"0011"},{"$f":"INPUT!I82","v":"ABS"},{"$f":"INPUT!J82","v":"ABS"},{"$f":"INPUT!M82","v":"ABS"},{"$f":"INPUT!N82","v":"ABS"},{"$f":"INPUT!P82","v":"*"},{"$f":"INPUT!Q82","v":"0031"},{"$f":"INPUT!S82","v":"ABS"},{"$f":"INPUT!T82","v":"ABS"},{"$f":"INPUT!W82","v":"ABS"},{"$f":"INPUT!X82","v":"ABS"},{"$f":"INPUT!Z82","v":"*"},{"$f":"INPUT!AA82","v":"0051"},{"$f":"INPUT!AC82","v":"ABS"},{"$f":"INPUT!AD82","v":"ABS"},{"$f":"INPUT!AG82","v":"ABS"},{"$f":"INPUT!AH82","v":"ABS"},{"$f":"INPUT!AJ82","v":"*"},{"$f":"INPUT!AK82","v":0},{"$f":"INPUT!AM82","v":"ABS"},{"$f":"INPUT!AN82","v":"ABS"},{"$f":"INPUT!AQ82","v":"ABS"},{"$f":"INPUT!AR82","v":"ABS"},{"$f":"INPUT!AT82","v":"*"},{"$f":"INPUT!AU82","v":0},{"$f":"INPUT!AW82","v":"ABS"},{"$f":"INPUT!AX82","v":"ABS"},{"$f":"INPUT!BA82","v":"ABS"},{"$f":"INPUT!BB82","v":"ABS"},{"$f":"INPUT!BD82","v":"*"},{"$f":"INPUT!BE82","v":0},{"$f":"INPUT!BG82","v":"ABS"},{"$f":"INPUT!BH82","v":"ABS"},{"$f":"INPUT!BK82","v":"ABS"},{"$f":"INPUT!BL82","v":"ABS"},{"$f":"INPUT!BN82","v":"*"},{"$f":"INPUT!BO82","v":"-"},{"$f":"INPUT!BP82","v":0},{"$f":"INPUT!BR82","v":"ABS"},{"$f":"INPUT!BS82","v":"ABS"},{"$f":"INPUT!BV82","v":"ABS"},{"$f":"INPUT!BW82","v":"ABS"},{"$f":"INPUT!BY82","v":""},"","ABS","",null,null,null,null,null,{"$f":"AP82&\"_\"&COUNTIF($AP$5:AP82,AP82)","v":"-_75"}]
[null,{"$f":"INPUT!F83","v":0},{"$f":"INPUT!C83","v":0},{"$f":"INPUT!D83","v":"00:00:00"},{"$f":"INPUT!E83","v":0},{"$f":"INPUT!G83","v":"0011"},{"$f":"INPUT!I83","v":"ABS"},{"$f":"INPUT!J83","v":"ABS"},{"$f":"INPUT!M83","v":"ABS"},{"$f":"INPUT!N83","v":"ABS"},{"$f":"INPUT!P83","v":"*"},{"$f":"INPUT!Q83","v":"0031"},{"$f":"INPUT!S83","v":"ABS"},{"$f":"INPUT!T83","v":"ABS"},{"$f":"INPUT!W83","v":"ABS"},{"$f":"INPUT!X83","v":"ABS"},{"$f":"INPUT!Z83","v":"*"},{"$f":"INPUT!AA83","v":"0051"},{"$f":"INPUT!AC83","v":"ABS"},{"$f":"INPUT!AD83","v":"ABS"},{"$f":"INPUT!AG83","v":"ABS"},{"$f":"INPUT!AH83","v":"ABS"},{"$f":"INPUT!AJ83","v":"*"},{"$f":"INPUT!AK83","v":0},{"$f":"INPUT!AM83","v":"ABS"},{"$f":"INPUT!AN83","v":"ABS"},{"$f":"INPUT!AQ83","v":"ABS"},{"$f":"INPUT!AR83","v":"ABS"},{"$f":"INPUT!AT83","v":"*"},{"$f":"INPUT!AU83","v":0},{"$f":"INPUT!AW83","v":"ABS"},{"$f":"INPUT!AX83","v":"ABS"},{"$f":"INPUT!BA83","v":"ABS"},{"$f":"INPUT!BB83","v":"ABS"},{"$f":"INPUT!BD83","v":"*"},{"$f":"INPUT!BE83","v":0},{"$f":"INPUT!BG83","v":"ABS"},{"$f":"INPUT!BH83","v":"ABS"},{"$f":"INPUT!BK83","v":"ABS"},{"$f":"INPUT!BL83","v":"ABS"},{"$f":"INPUT!BN83","v":"*"},{"$f":"INPUT!BO83","v":"-"},{"$f":"INPUT!BP83","v":0},{"$f":"INPUT!BR83","v":"ABS"},{"$f":"INPUT!BS83","v":"ABS"},{"$f":"INPUT!BV83","v":"ABS"},{"$f":"INPUT!BW83","v":"ABS"},{"$f":"INPUT!BY83","v":""},"","ABS","",null,null,null,null,null,{"$f":"AP83&\"_\"&COUNTIF($AP$5:AP83,AP83)","v":"-_76"}]
[null,{"$f":"INPUT!F84","v":0},{"$f":"INPUT!C84","v":0},{"$f":"INPUT!D84","v":"00:00:00"},{"$f":"INPUT!E84","v":0},{"$f":"INPUT!G84","v":"0011"},{"$f":"INPUT!I84","v":"ABS"},{"$f":"INPUT!J84","v":"ABS"},{"$f":"INPUT!M84","v":"ABS"},{"$f":"INPUT!N84","v":"ABS"},{"$f":"INPUT!P84","v":"*"},{"$f":"INPUT!Q84","v":"0031"},{"$f":"INPUT!S84","v":"ABS"},{"$f":"INPUT!T84","v":"ABS"},{"$f":"INPUT!W84","v":"ABS"},{"$f":"INPUT!X84","v":"ABS"},{"$f":"INPUT!Z84","v":"*"},{"$f":"INPUT!AA84","v":"0051"},{"$f":"INPUT!AC84","v":"ABS"},{"$f":"INPUT!AD84","v":"ABS"},{"$f":"INPUT!AG84","v":"ABS"},{"$f":"INPUT!AH84","v":"ABS"},{"$f":"INPUT!AJ84","v":"*"},{"$f":"INPUT!AK84","v":0},{"$f":"INPUT!AM84","v":"ABS"},{"$f":"INPUT!AN84","v":"ABS"},{"$f":"INPUT!AQ84","v":"ABS"},{"$f":"INPUT!AR84","v":"ABS"},{"$f":"INPUT!AT84","v":"*"},{"$f":"INPUT!AU84","v":0},{"$f":"INPUT!AW84","v":"ABS"},{"$f":"INPUT!AX84","v":"ABS"},{"$f":"INPUT!BA84","v":"ABS"},{"$f":"INPUT!BB84","v":"ABS"},{"$f":"INPUT!BD84","v":"*"},{"$f":"INPUT!BE84","v":0},{"$f":"INPUT!BG84","v":"ABS"},{"$f":"INPUT!BH84","v":"ABS"},{"$f":"INPUT!BK84","v":"ABS"},{"$f":"INPUT!BL84","v":"ABS"},{"$f":"INPUT!BN84","v":"*"},{"$f":"INPUT!BO84","v":"-"},{"$f":"INPUT!BP84","v":0},{"$f":"INPUT!BR84","v":"ABS"},{"$f":"INPUT!BS84","v":"ABS"},{"$f":"INPUT!BV84","v":"ABS"},{"$f":"INPUT!BW84","v":"ABS"},{"$f":"INPUT!BY84","v":""},"","ABS","",null,null,null,null,null,{"$f":"AP84&\"_\"&COUNTIF($AP$5:AP84,AP84)","v":"-_77"}]
[null,{"$f":"INPUT!F85","v":0},{"$f":"INPUT!C85","v":0},{"$f":"INPUT!D85","v":"00:00:00"},{"$f":"INPUT!E85","v":0},{"$f":"INPUT!G85","v":"0011"},{"$f":"INPUT!I85","v":"ABS"},{"$f":"INPUT!J85","v":"ABS"},{"$f":"INPUT!M85","v":"ABS"},{"$f":"INPUT!N85","v":"ABS"},{"$f":"INPUT!P85","v":"*"},{"$f":"INPUT!Q85","v":"0031"},{"$f":"INPUT!S85","v":"ABS"},{"$f":"INPUT!T85","v":"ABS"},{"$f":"INPUT!W85","v":"ABS"},{"$f":"INPUT!X85","v":"ABS"},{"$f":"INPUT!Z85","v":"*"},{"$f":"INPUT!AA85","v":"0051"},{"$f":"INPUT!AC85","v":"ABS"},{"$f":"INPUT!AD85","v":"ABS"},{"$f":"INPUT!AG85","v":"ABS"},{"$f":"INPUT!AH85","v":"ABS"},{"$f":"INPUT!AJ85","v":"*"},{"$f":"INPUT!AK85","v":0},{"$f":"INPUT!AM85","v":"ABS"},{"$f":"INPUT!AN85","v":"ABS"},{"$f":"INPUT!AQ85","v":"ABS"},{"$f":"INPUT!AR85","v":"ABS"},{"$f":"INPUT!AT85","v":"*"},{"$f":"INPUT!AU85","v":0},{"$f":"INPUT!AW85","v":"ABS"},{"$f":"INPUT!AX85","v":"ABS"},{"$f":"INPUT!BA85","v":"ABS"},{"$f":"INPUT!BB85","v":"ABS"},{"$f":"INPUT!BD85","v":"*"},{"$f":"INPUT!BE85","v":0},{"$f":"INPUT!BG85","v":"ABS"},{"$f":"INPUT!BH85","v":"ABS"},{"$f":"INPUT!BK85","v":"ABS"},{"$f":"INPUT!BL85","v":"ABS"},{"$f":"INPUT!BN85","v":"*"},{"$f":"INPUT!BO85","v":"-"},{"$f":"INPUT!BP85","v":0},{"$f":"INPUT!BR85","v":"ABS"},{"$f":"INPUT!BS85","v":"ABS"},{"$f":"INPUT!BV85","v":"ABS"},{"$f":"INPUT!BW85","v":"ABS"},{"$f":"INPUT!BY85","v":""},"","ABS","",null,null,null,null,null,{"$f":"AP85&\"_\"&COUNTIF($AP$5:AP85,AP85)","v":"-_78"}]
[null,{"$f":"INPUT!F86","v":0},{"$f":"INPUT!C86","v":0},{"$f":"INPUT!D86","v":"00:00:00"},{"$f":"INPUT!E86","v":0},{"$f":"INPUT!G86","v":"0011"},{"$f":"INPUT!I86","v":"ABS"},{"$f":"INPUT!J86","v":"ABS"},{"$f":"INPUT!M86","v":"ABS"},{"$f":"INPUT!N86","v":"ABS"},{"$f":"INPUT!P86","v":"*"},{"$f":"INPUT!Q86","v":"0031"},{"$f":"INPUT!S86","v":"ABS"},{"$f":"INPUT!T86","v":"ABS"},{"$f":"INPUT!W86","v":"ABS"},{"$f":"INPUT!X86","v":"ABS"},{"$f":"INPUT!Z86","v":"*"},{"$f":"INPUT!AA86","v":"0051"},{"$f":"INPUT!AC86","v":"ABS"},{"$f":"INPUT!AD86","v":"ABS"},{"$f":"INPUT!AG86","v":"ABS"},{"$f":"INPUT!AH86","v":"ABS"},{"$f":"INPUT!AJ86","v":"*"},{"$f":"INPUT!AK86","v":0},{"$f":"INPUT!AM86","v":"ABS"},{"$f":"INPUT!AN86","v":"ABS"},{"$f":"INPUT!AQ86","v":"ABS"},{"$f":"INPUT!AR86","v":"ABS"},{"$f":"INPUT!AT86","v":"*"},{"$f":"INPUT!AU86","v":0},{"$f":"INPUT!AW86","v":"ABS"},{"$f":"INPUT!AX86","v":"ABS"},{"$f":"INPUT!BA86","v":"ABS"},{"$f":"INPUT!BB86","v":"ABS"},{"$f":"INPUT!BD86","v":"*"},{"$f":"INPUT!BE86","v":0},{"$f":"INPUT!BG86","v":"ABS"},{"$f":"INPUT!BH86","v":"ABS"},{"$f":"INPUT!BK86","v":"ABS"},{"$f":"INPUT!BL86","v":"ABS"},{"$f":"INPUT!BN86","v":"*"},{"$f":"INPUT!BO86","v":"-"},{"$f":"INPUT!BP86","v":0},{"$f":"INPUT!BR86","v":"ABS"},{"$f":"INPUT!BS86","v":"ABS"},{"$f":"INPUT!BV86","v":"ABS"},{"$f":"INPUT!BW86","v":"ABS"},{"$f":"INPUT!BY86","v":""},"","ABS","",null,null,null,null,null,{"$f":"AP86&\"_\"&COUNTIF($AP$5:AP86,AP86)","v":"-_79"}]
[null,{"$f":"INPUT!F87","v":0},{"$f":"INPUT!C87","v":0},{"$f":"INPUT!D87","v":"00:00:00"},{"$f":"INPUT!E87","v":0},{"$f":"INPUT!G87","v":"0011"},{"$f":"INPUT!I87","v":"ABS"},{"$f":"INPUT!J87","v":"ABS"},{"$f":"INPUT!M87","v":"ABS"},{"$f":"INPUT!N87","v":"ABS"},{"$f":"INPUT!P87","v":"*"},{"$f":"INPUT!Q87","v":"0031"},{"$f":"INPUT!S87","v":"ABS"},{"$f":"INPUT!T87","v":"ABS"},{"$f":"INPUT!W87","v":"ABS"},{"$f":"INPUT!X87","v":"ABS"},{"$f":"INPUT!Z87","v":"*"},{"$f":"INPUT!AA87","v":"0051"},{"$f":"INPUT!AC87","v":"ABS"},{"$f":"INPUT!AD87","v":"ABS"},{"$f":"INPUT!AG87","v":"ABS"},{"$f":"INPUT!AH87","v":"ABS"},{"$f":"INPUT!AJ87","v":"*"},{"$f":"INPUT!AK87","v":0},{"$f":"INPUT!AM87","v":"ABS"},{"$f":"INPUT!AN87","v":"ABS"},{"$f":"INPUT!AQ87","v":"ABS"},{"$f":"INPUT!AR87","v":"ABS"},{"$f":"INPUT!AT87","v":"*"},{"$f":"INPUT!AU87","v":0},{"$f":"INPUT!AW87","v":"ABS"},{"$f":"INPUT!AX87","v":"ABS"},{"$f":"INPUT!BA87","v":"ABS"},{"$f":"INPUT!BB87","v":"ABS"},{"$f":"INPUT!BD87","v":"*"},{"$f":"INPUT!BE87","v":0},{"$f":"INPUT!BG87","v":"ABS"},{"$f":"INPUT!BH87","v":"ABS"},{"$f":"INPUT!BK87","v":"ABS"},{"$f":"INPUT!BL87","v":"ABS"},{"$f":"INPUT!BN87","v":"*"},{"$f":"INPUT!BO87","v":"-"},{"$f":"INPUT!BP87","v":0},{"$f":"INPUT!BR87","v":"ABS"},{"$f":"INPUT!BS87","v":"ABS"},{"$f":"INPUT!BV87","v":"ABS"},{"$f":"INPUT!BW87","v":"ABS"},{"$f":"INPUT!BY87","v":""},"","ABS","",null,null,null,null,null,{"$f":"AP87&\"_\"&COUNTIF($AP$5:AP87,AP87)","v":"-_80"}]
[null,{"$f":"INPUT!F88","v":0},{"$f":"INPUT!C88","v":0},{"$f":"INPUT!D88","v":"00:00:00"},{"$f":"INPUT!E88","v":0},{"$f":"INPUT!G88","v":"0011"},{"$f":"INPUT!I88","v":"ABS"},{"$f":"INPUT!J88","v":"ABS"},{"$f":"INPUT!M88","v":"ABS"},{"$f":"INPUT!N88","v":"ABS"},{"$f":"INPUT!P88","v":"*"},{"$f":"INPUT!Q88","v":"0031"},{"$f":"INPUT!S88","v":"ABS"},{"$f":"INPUT!T88","v":"ABS"},{"$f":"INPUT!W88","v":"ABS"},{"$f":"INPUT!X88","v":"ABS"},{"$f":"INPUT!Z88","v":"*"},{"$f":"INPUT!AA88","v":"0051"},{"$f":"INPUT!AC88","v":"ABS"},{"$f":"INPUT!AD88","v":"ABS"},{"$f":"INPUT!AG88","v":"ABS"},{"$f":"INPUT!AH88","v":"ABS"},{"$f":"INPUT!AJ88","v":"*"},{"$f":"INPUT!AK88","v":0},{"$f":"INPUT!AM88","v":"ABS"},{"$f":"INPUT!AN88","v":"ABS"},{"$f":"INPUT!AQ88","v":"ABS"},{"$f":"INPUT!AR88","v":"ABS"},{"$f":"INPUT!AT88","v":"*"},{"$f":"INPUT!AU88","v":0},{"$f":"INPUT!AW88","v":"ABS"},{"$f":"INPUT!AX88","v":"ABS"},{"$f":"INPUT!BA88","v":"ABS"},{"$f":"INPUT!BB88","v":"ABS"},{"$f":"INPUT!BD88","v":"*"},{"$f":"INPUT!BE88","v":0},{"$f":"INPUT!BG88","v":"ABS"},{"$f":"INPUT!BH88","v":"ABS"},{"$f":"INPUT!BK88","v":"ABS"},{"$f":"INPUT!BL88","v":"ABS"},{"$f":"INPUT!BN88","v":"*"},{"$f":"INPUT!BO88","v":"-"},{"$f":"INPUT!BP88","v":0},{"$f":"INPUT!BR88","v":"ABS"},{"$f":"INPUT!BS88","v":"ABS"},{"$f":"INPUT!BV88","v":"ABS"},{"$f":"INPUT!BW88","v":"ABS"},{"$f":"INPUT!BY88","v":""},"","ABS","",null,null,null,null,null,{"$f":"AP88&\"_\"&COUNTIF($AP$5:AP88,AP88)","v":"-_81"}]
[null,{"$f":"INPUT!F89","v":0},{"$f":"INPUT!C89","v":0},{"$f":"INPUT!D89","v":"00:00:00"},{"$f":"INPUT!E89","v":0},{"$f":"INPUT!G89","v":"0011"},{"$f":"INPUT!I89","v":"ABS"},{"$f":"INPUT!J89","v":"ABS"},{"$f":"INPUT!M89","v":"ABS"},{"$f":"INPUT!N89","v":"ABS"},{"$f":"INPUT!P89","v":"*"},{"$f":"INPUT!Q89","v":"0031"},{"$f":"INPUT!S89","v":"ABS"},{"$f":"INPUT!T89","v":"ABS"},{"$f":"INPUT!W89","v":"ABS"},{"$f":"INPUT!X89","v":"ABS"},{"$f":"INPUT!Z89","v":"*"},{"$f":"INPUT!AA89","v":"0051"},{"$f":"INPUT!AC89","v":"ABS"},{"$f":"INPUT!AD89","v":"ABS"},{"$f":"INPUT!AG89","v":"ABS"},{"$f":"INPUT!AH89","v":"ABS"},{"$f":"INPUT!AJ89","v":"*"},{"$f":"INPUT!AK89","v":0},{"$f":"INPUT!AM89","v":"ABS"},{"$f":"INPUT!AN89","v":"ABS"},{"$f":"INPUT!AQ89","v":"ABS"},{"$f":"INPUT!AR89","v":"ABS"},{"$f":"INPUT!AT89","v":"*"},{"$f":"INPUT!AU89","v":0},{"$f":"INPUT!AW89","v":"ABS"},{"$f":"INPUT!AX89","v":"ABS"},{"$f":"INPUT!BA89","v":"ABS"},{"$f":"INPUT!BB89","v":"ABS"},{"$f":"INPUT!BD89","v":"*"},{"$f":"INPUT!BE89","v":0},{"$f":"INPUT!BG89","v":"ABS"},{"$f":"INPUT!BH89","v":"ABS"},{"$f":"INPUT!BK89","v":"ABS"},{"$f":"INPUT!BL89","v":"ABS"},{"$f":"INPUT!BN89","v":"*"},{"$f":"INPUT!BO89","v":"-"},{"$f":"INPUT!BP89","v":0},{"$f":"INPUT!BR89","v":"ABS"},{"$f":"INPUT!BS89","v":"ABS"},{"$f":"INPUT!BV89","v":"ABS"},{"$f":"INPUT!BW89","v":"ABS"},{"$f":"INPUT!BY89","v":""},"","ABS","",null,null,null,null,null,{"$f":"AP89&\"_\"&COUNTIF($AP$5:AP89,AP89)","v":"-_82"}]
[null,{"$f":"INPUT!F90","v":0},{"$f":"INPUT!C90","v":0},{"$f":"INPUT!D90","v":"00:00:00"},{"$f":"INPUT!E90","v":0},{"$f":"INPUT!G90","v":"0011"},{"$f":"INPUT!I90","v":"ABS"},{"$f":"INPUT!J90","v":"ABS"},{"$f":"INPUT!M90","v":"ABS"},{"$f":"INPUT!N90","v":"ABS"},{"$f":"INPUT!P90","v":"*"},{"$f":"INPUT!Q90","v":"0031"},{"$f":"INPUT!S90","v":"ABS"},{"$f":"INPUT!T90","v":"ABS"},{"$f":"INPUT!W90","v":"ABS"},{"$f":"INPUT!X90","v":"ABS"},{"$f":"INPUT!Z90","v":"*"},{"$f":"INPUT!AA90","v":"0051"},{"$f":"INPUT!AC90","v":"ABS"},{"$f":"INPUT!AD90","v":"ABS"},{"$f":"INPUT!AG90","v":"ABS"},{"$f":"INPUT!AH90","v":"ABS"},{"$f":"INPUT!AJ90","v":"*"},{"$f":"INPUT!AK90","v":0},{"$f":"INPUT!AM90","v":"ABS"},{"$f":"INPUT!AN90","v":"ABS"},{"$f":"INPUT!AQ90","v":"ABS"},{"$f":"INPUT!AR90","v":"ABS"},{"$f":"INPUT!AT90","v":"*"},{"$f":"INPUT!AU90","v":0},{"$f":"INPUT!AW90","v":"ABS"},{"$f":"INPUT!AX90","v":"ABS"},{"$f":"INPUT!BA90","v":"ABS"},{"$f":"INPUT!BB90","v":"ABS"},{"$f":"INPUT!BD90","v":"*"},{"$f":"INPUT!BE90","v":0},{"$f":"INPUT!BG90","v":"ABS"},{"$f":"INPUT!BH90","v":"ABS"},{"$f":"INPUT!BK90","v":"ABS"},{"$f":"INPUT!BL90","v":"ABS"},{"$f":"INPUT!BN90","v":"*"},{"$f":"INPUT!BO90","v":"-"},{"$f":"INPUT!BP90","v":0},{"$f":"INPUT!BR90","v":"ABS"},{"$f":"INPUT!BS90","v":"ABS"},{"$f":"INPUT!BV90","v":"ABS"},{"$f":"INPUT!BW90","v":"ABS"},{"$f":"INPUT!BY90","v":""},"","ABS","",null,null,null,null,null,{"$f":"AP90&\"_\"&COUNTIF($AP$5:AP90,AP90)","v":"-_83"}]
[null,{"$f":"INPUT!F91","v":0},{"$f":"INPUT!C91","v":0},{"$f":"INPUT!D91","v":"00:00:00"},{"$f":"INPUT!E91","v":0},{"$f":"INPUT!G91","v":"0011"},{"$f":"INPUT!I91","v":"ABS"},{"$f":"INPUT!J91","v":"ABS"},{"$f":"INPUT!M91","v":"ABS"},{"$f":"INPUT!N91","v":"ABS"},{"$f":"INPUT!P91","v":"*"},{"$f":"INPUT!Q91","v":"0031"},{"$f":"INPUT!S91","v":"ABS"},{"$f":"INPUT!T91","v":"ABS"},{"$f":"INPUT!W91","v":"ABS"},{"$f":"INPUT!X91","v":"ABS"},{"$f":"INPUT!Z91","v":"*"},{"$f":"INPUT!AA91","v":"0051"},{"$f":"INPUT!AC91","v":"ABS"},{"$f":"INPUT!AD91","v":"ABS"},{"$f":"INPUT!AG91","v":"ABS"},{"$f":"INPUT!AH91","v":"ABS"},{"$f":"INPUT!AJ91","v":"*"},{"$f":"INPUT!AK91","v":0},{"$f":"INPUT!AM91","v":"ABS"},{"$f":"INPUT!AN91","v":"ABS"},{"$f":"INPUT!AQ91","v":"ABS"},{"$f":"INPUT!AR91","v":"ABS"},{"$f":"INPUT!AT91","v":"*"},{"$f":"INPUT!AU91","v":0},{"$f":"INPUT!AW91","v":"ABS"},{"$f":"INPUT!AX91","v":"ABS"},{"$f":"INPUT!BA91","v":"ABS"},{"$f":"INPUT!BB91","v":"ABS"},{"$f":"INPUT!BD91","v":"*"},{"$f":"INPUT!BE91","v":0},{"$f":"INPUT!BG91","v":"ABS"},{"$f":"INPUT!BH91","v":"ABS"},{"$f":"INPUT!BK91","v":"ABS"},{"$f":"INPUT!BL91","v":"ABS"},{"$f":"INPUT!BN91","v":"*"},{"$f":"INPUT!BO91","v":"-"},{"$f":"INPUT!BP91","v":0},{"$f":"INPUT!BR91","v":"ABS"},{"$f":"INPUT!BS91","v":"ABS"},{"$f":"INPUT!BV91","v":"ABS"},{"$f":"INPUT!BW91","v":"ABS"},{"$f":"INPUT!BY91","v":""},"","ABS","",null,null,null,null,null,{"$f":"AP91&\"_\"&COUNTIF($AP$5:AP91,AP91)","v":"-_84"}]
[null,{"$f":"INPUT!F92","v":0},{"$f":"INPUT!C92","v":0},{"$f":"INPUT!D92","v":"00:00:00"},{"$f":"INPUT!E92","v":0},{"$f":"INPUT!G92","v":"0011"},{"$f":"INPUT!I92","v":"ABS"},{"$f":"INPUT!J92","v":"ABS"},{"$f":"INPUT!M92","v":"ABS"},{"$f":"INPUT!N92","v":"ABS"},{"$f":"INPUT!P92","v":"*"},{"$f":"INPUT!Q92","v":"0031"},{"$f":"INPUT!S92","v":"ABS"},{"$f":"INPUT!T92","v":"ABS"},{"$f":"INPUT!W92","v":"ABS"},{"$f":"INPUT!X92","v":"ABS"},{"$f":"INPUT!Z92","v":"*"},{"$f":"INPUT!AA92","v":"0051"},{"$f":"INPUT!AC92","v":"ABS"},{"$f":"INPUT!AD92","v":"ABS"},{"$f":"INPUT!AG92","v":"ABS"},{"$f":"INPUT!AH92","v":"ABS"},{"$f":"INPUT!AJ92","v":"*"},{"$f":"INPUT!AK92","v":0},{"$f":"INPUT!AM92","v":"ABS"},{"$f":"INPUT!AN92","v":"ABS"},{"$f":"INPUT!AQ92","v":"ABS"},{"$f":"INPUT!AR92","v":"ABS"},{"$f":"INPUT!AT92","v":"*"},{"$f":"INPUT!AU92","v":0},{"$f":"INPUT!AW92","v":"ABS"},{"$f":"INPUT!AX92","v":"ABS"},{"$f":"INPUT!BA92","v":"ABS"},{"$f":"INPUT!BB92","v":"ABS"},{"$f":"INPUT!BD92","v":"*"},{"$f":"INPUT!BE92","v":0},{"$f":"INPUT!BG92","v":"ABS"},{"$f":"INPUT!BH92","v":"ABS"},{"$f":"INPUT!BK92","v":"ABS"},{"$f":"INPUT!BL92","v":"ABS"},{"$f":"INPUT!BN92","v":"*"},{"$f":"INPUT!BO92","v":"-"},{"$f":"INPUT!BP92","v":0},{"$f":"INPUT!BR92","v":"ABS"},{"$f":"INPUT!BS92","v":"ABS"},{"$f":"INPUT!BV92","v":"ABS"},{"$f":"INPUT!BW92","v":"ABS"},{"$f":"INPUT!BY92","v":""},"","ABS","",null,null,null,null,null,{"$f":"AP92&\"_\"&COUNTIF($AP$5:AP92,AP92)","v":"-_85"}]
[null,{"$f":"INPUT!F93","v":0},{"$f":"INPUT!C93","v":0},{"$f":"INPUT!D93","v":"00:00:00"},{"$f":"INPUT!E93","v":0},{"$f":"INPUT!G93","v":"0011"},{"$f":"INPUT!I93","v":"ABS"},{"$f":"INPUT!J93","v":"ABS"},{"$f":"INPUT!M93","v":"ABS"},{"$f":"INPUT!N93","v":"ABS"},{"$f":"INPUT!P93","v":"*"},{"$f":"INPUT!Q93","v":"0031"},{"$f":"INPUT!S93","v":"ABS"},{"$f":"INPUT!T93","v":"ABS"},{"$f":"INPUT!W93","v":"ABS"},{"$f":"INPUT!X93","v":"ABS"},{"$f":"INPUT!Z93","v":"*"},{"$f":"INPUT!AA93","v":"0051"},{"$f":"INPUT!AC93","v":"ABS"},{"$f":"INPUT!AD93","v":"ABS"},{"$f":"INPUT!AG93","v":"ABS"},{"$f":"INPUT!AH93","v":"ABS"},{"$f":"INPUT!AJ93","v":"*"},{"$f":"INPUT!AK93","v":0},{"$f":"INPUT!AM93","v":"ABS"},{"$f":"INPUT!AN93","v":"ABS"},{"$f":"INPUT!AQ93","v":"ABS"},{"$f":"INPUT!AR93","v":"ABS"},{"$f":"INPUT!AT93","v":"*"},{"$f":"INPUT!AU93","v":0},{"$f":"INPUT!AW93","v":"ABS"},{"$f":"INPUT!AX93","v":"ABS"},{"$f":"INPUT!BA93","v":"ABS"},{"$f":"INPUT!BB93","v":"ABS"},{"$f":"INPUT!BD93","v":"*"},{"$f":"INPUT!BE93","v":0},{"$f":"INPUT!BG93","v":"ABS"},{"$f":"INPUT!BH93","v":"ABS"},{"$f":"INPUT!BK93","v":"ABS"},{"$f":"INPUT!BL93","v":"ABS"},{"$f":"INPUT!BN93","v":"*"},{"$f":"INPUT!BO93","v":"-"},{"$f":"INPUT!BP93","v":0},{"$f":"INPUT!BR93","v":"ABS"},{"$f":"INPUT!BS93","v":"ABS"},{"$f":"INPUT!BV93","v":"ABS"},{"$f":"INPUT!BW93","v":"ABS"},{"$f":"INPUT!BY93","v":""},"","ABS","",null,null,null,null,null,{"$f":"AP93&\"_\"&COUNTIF($AP$5:AP93,AP93)","v":"-_86"}]
[null,{"$f":"INPUT!F94","v":0},{"$f":"INPUT!C94","v":0},{"$f":"INPUT!D94","v":"00:00:00"},{"$f":"INPUT!E94","v":0},{"$f":"INPUT!G94","v":"0011"},{"$f":"INPUT!I94","v":"ABS"},{"$f":"INPUT!J94","v":"ABS"},{"$f":"INPUT!M94","v":"ABS"},{"$f":"INPUT!N94","v":"ABS"},{"$f":"INPUT!P94","v":"*"},{"$f":"INPUT!Q94","v":"0031"},{"$f":"INPUT!S94","v":"ABS"},{"$f":"INPUT!T94","v":"ABS"},{"$f":"INPUT!W94","v":"ABS"},{"$f":"INPUT!X94","v":"ABS"},{"$f":"INPUT!Z94","v":"*"},{"$f":"INPUT!AA94","v":"0051"},{"$f":"INPUT!AC94","v":"ABS"},{"$f":"INPUT!AD94","v":"ABS"},{"$f":"INPUT!AG94","v":"ABS"},{"$f":"INPUT!AH94","v":"ABS"},{"$f":"INPUT!AJ94","v":"*"},{"$f":"INPUT!AK94","v":0},{"$f":"INPUT!AM94","v":"ABS"},{"$f":"INPUT!AN94","v":"ABS"},{"$f":"INPUT!AQ94","v":"ABS"},{"$f":"INPUT!AR94","v":"ABS"},{"$f":"INPUT!AT94","v":"*"},{"$f":"INPUT!AU94","v":0},{"$f":"INPUT!AW94","v":"ABS"},{"$f":"INPUT!AX94","v":"ABS"},{"$f":"INPUT!BA94","v":"ABS"},{"$f":"INPUT!BB94","v":"ABS"},{"$f":"INPUT!BD94","v":"*"},{"$f":"INPUT!BE94","v":0},{"$f":"INPUT!BG94","v":"ABS"},{"$f":"INPUT!BH94","v":"ABS"},{"$f":"INPUT!BK94","v":"ABS"},{"$f":"INPUT!BL94","v":"ABS"},{"$f":"INPUT!BN94","v":"*"},{"$f":"INPUT!BO94","v":"-"},{"$f":"INPUT!BP94","v":0},{"$f":"INPUT!BR94","v":"ABS"},{"$f":"INPUT!BS94","v":"ABS"},{"$f":"INPUT!BV94","v":"ABS"},{"$f":"INPUT!BW94","v":"ABS"},{"$f":"INPUT!BY94","v":""},"","ABS","",null,null,null,null,null,{"$f":"AP94&\"_\"&COUNTIF($AP$5:AP94,AP94)","v":"-_87"}]
[null,{"$f":"INPUT!F95","v":0},{"$f":"INPUT!C95","v":0},{"$f":"INPUT!D95","v":"00:00:00"},{"$f":"INPUT!E95","v":0},{"$f":"INPUT!G95","v":"0011"},{"$f":"INPUT!I95","v":"ABS"},{"$f":"INPUT!J95","v":"ABS"},{"$f":"INPUT!M95","v":"ABS"},{"$f":"INPUT!N95","v":"ABS"},{"$f":"INPUT!P95","v":"*"},{"$f":"INPUT!Q95","v":"0031"},{"$f":"INPUT!S95","v":"ABS"},{"$f":"INPUT!T95","v":"ABS"},{"$f":"INPUT!W95","v":"ABS"},{"$f":"INPUT!X95","v":"ABS"},{"$f":"INPUT!Z95","v":"*"},{"$f":"INPUT!AA95","v":"0051"},{"$f":"INPUT!AC95","v":"ABS"},{"$f":"INPUT!AD95","v":"ABS"},{"$f":"INPUT!AG95","v":"ABS"},{"$f":"INPUT!AH95","v":"ABS"},{"$f":"INPUT!AJ95","v":"*"},{"$f":"INPUT!AK95","v":0},{"$f":"INPUT!AM95","v":"ABS"},{"$f":"INPUT!AN95","v":"ABS"},{"$f":"INPUT!AQ95","v":"ABS"},{"$f":"INPUT!AR95","v":"ABS"},{"$f":"INPUT!AT95","v":"*"},{"$f":"INPUT!AU95","v":0},{"$f":"INPUT!AW95","v":"ABS"},{"$f":"INPUT!AX95","v":"ABS"},{"$f":"INPUT!BA95","v":"ABS"},{"$f":"INPUT!BB95","v":"ABS"},{"$f":"INPUT!BD95","v":"*"},{"$f":"INPUT!BE95","v":0},{"$f":"INPUT!BG95","v":"ABS"},{"$f":"INPUT!BH95","v":"ABS"},{"$f":"INPUT!BK95","v":"ABS"},{"$f":"INPUT!BL95","v":"ABS"},{"$f":"INPUT!BN95","v":"*"},{"$f":"INPUT!BO95","v":"-"},{"$f":"INPUT!BP95","v":0},{"$f":"INPUT!BR95","v":"ABS"},{"$f":"INPUT!BS95","v":"ABS"},{"$f":"INPUT!BV95","v":"ABS"},{"$f":"INPUT!BW95","v":"ABS"},{"$f":"INPUT!BY95","v":""},"","ABS","",null,null,null,null,null,{"$f":"AP95&\"_\"&COUNTIF($AP$5:AP95,AP95)","v":"-_88"}]
[null,{"$f":"INPUT!F96","v":0},{"$f":"INPUT!C96","v":0},{"$f":"INPUT!D96","v":"00:00:00"},{"$f":"INPUT!E96","v":0},{"$f":"INPUT!G96","v":"0011"},{"$f":"INPUT!I96","v":"ABS"},{"$f":"INPUT!J96","v":"ABS"},{"$f":"INPUT!M96","v":"ABS"},{"$f":"INPUT!N96","v":"ABS"},{"$f":"INPUT!P96","v":"*"},{"$f":"INPUT!Q96","v":"0031"},{"$f":"INPUT!S96","v":"ABS"},{"$f":"INPUT!T96","v":"ABS"},{"$f":"INPUT!W96","v":"ABS"},{"$f":"INPUT!X96","v":"ABS"},{"$f":"INPUT!Z96","v":"*"},{"$f":"INPUT!AA96","v":"0051"},{"$f":"INPUT!AC96","v":"ABS"},{"$f":"INPUT!AD96","v":"ABS"},{"$f":"INPUT!AG96","v":"ABS"},{"$f":"INPUT!AH96","v":"ABS"},{"$f":"INPUT!AJ96","v":"*"},{"$f":"INPUT!AK96","v":0},{"$f":"INPUT!AM96","v":"ABS"},{"$f":"INPUT!AN96","v":"ABS"},{"$f":"INPUT!AQ96","v":"ABS"},{"$f":"INPUT!AR96","v":"ABS"},{"$f":"INPUT!AT96","v":"*"},{"$f":"INPUT!AU96","v":0},{"$f":"INPUT!AW96","v":"ABS"},{"$f":"INPUT!AX96","v":"ABS"},{"$f":"INPUT!BA96","v":"ABS"},{"$f":"INPUT!BB96","v":"ABS"},{"$f":"INPUT!BD96","v":"*"},{"$f":"INPUT!BE96","v":0},{"$f":"INPUT!BG96","v":"ABS"},{"$f":"INPUT!BH96","v":"ABS"},{"$f":"INPUT!BK96","v":"ABS"},{"$f":"INPUT!BL96","v":"ABS"},{"$f":"INPUT!BN96","v":"*"},{"$f":"INPUT!BO96","v":"-"},{"$f":"INPUT!BP96","v":0},{"$f":"INPUT!BR96","v":"ABS"},{"$f":"INPUT!BS96","v":"ABS"},{"$f":"INPUT!BV96","v":"ABS"},{"$f":"INPUT!BW96","v":"ABS"},{"$f":"INPUT!BY96","v":""},"","ABS","",null,null,null,null,null,{"$f":"AP96&\"_\"&COUNTIF($AP$5:AP96,AP96)","v":"-_89"}]
[null,{"$f":"INPUT!F97","v":0},{"$f":"INPUT!C97","v":0},{"$f":"INPUT!D97","v":"00:00:00"},{"$f":"INPUT!E97","v":0},{"$f":"INPUT!G97","v":"0011"},{"$f":"INPUT!I97","v":"ABS"},{"$f":"INPUT!J97","v":"ABS"},{"$f":"INPUT!M97","v":"ABS"},{"$f":"INPUT!N97","v":"ABS"},{"$f":"INPUT!P97","v":"*"},{"$f":"INPUT!Q97","v":"0031"},{"$f":"INPUT!S97","v":"ABS"},{"$f":"INPUT!T97","v":"ABS"},{"$f":"INPUT!W97","v":"ABS"},{"$f":"INPUT!X97","v":"ABS"},{"$f":"INPUT!Z97","v":"*"},{"$f":"INPUT!AA97","v":"0051"},{"$f":"INPUT!AC97","v":"ABS"},{"$f":"INPUT!AD97","v":"ABS"},{"$f":"INPUT!AG97","v":"ABS"},{"$f":"INPUT!AH97","v":"ABS"},{"$f":"INPUT!AJ97","v":"*"},{"$f":"INPUT!AK97","v":0},{"$f":"INPUT!AM97","v":"ABS"},{"$f":"INPUT!AN97","v":"ABS"},{"$f":"INPUT!AQ97","v":"ABS"},{"$f":"INPUT!AR97","v":"ABS"},{"$f":"INPUT!AT97","v":"*"},{"$f":"INPUT!AU97","v":0},{"$f":"INPUT!AW97","v":"ABS"},{"$f":"INPUT!AX97","v":"ABS"},{"$f":"INPUT!BA97","v":"ABS"},{"$f":"INPUT!BB97","v":"ABS"},{"$f":"INPUT!BD97","v":"*"},{"$f":"INPUT!BE97","v":0},{"$f":"INPUT!BG97","v":"ABS"},{"$f":"INPUT!BH97","v":"ABS"},{"$f":"INPUT!BK97","v":"ABS"},{"$f":"INPUT!BL97","v":"ABS"},{"$f":"INPUT!BN97","v":"*"},{"$f":"INPUT!BO97","v":"-"},{"$f":"INPUT!BP97","v":0},{"$f":"INPUT!BR97","v":"ABS"},{"$f":"INPUT!BS97","v":"ABS"},{"$f":"INPUT!BV97","v":"ABS"},{"$f":"INPUT!BW97","v":"ABS"},{"$f":"INPUT!BY97","v":""},"","ABS","",null,null,null,null,null,{"$f":"AP97&\"_\"&COUNTIF($AP$5:AP97,AP97)","v":"-_90"}]
[null,{"$f":"INPUT!F98","v":0},{"$f":"INPUT!C98","v":0},{"$f":"INPUT!D98","v":"00:00:00"},{"$f":"INPUT!E98","v":0},{"$f":"INPUT!G98","v":"0011"},{"$f":"INPUT!I98","v":"ABS"},{"$f":"INPUT!J98","v":"ABS"},{"$f":"INPUT!M98","v":"ABS"},{"$f":"INPUT!N98","v":"ABS"},{"$f":"INPUT!P98","v":"*"},{"$f":"INPUT!Q98","v":"0031"},{"$f":"INPUT!S98","v":"ABS"},{"$f":"INPUT!T98","v":"ABS"},{"$f":"INPUT!W98","v":"ABS"},{"$f":"INPUT!X98","v":"ABS"},{"$f":"INPUT!Z98","v":"*"},{"$f":"INPUT!AA98","v":"0051"},{"$f":"INPUT!AC98","v":"ABS"},{"$f":"INPUT!AD98","v":"ABS"},{"$f":"INPUT!AG98","v":"ABS"},{"$f":"INPUT!AH98","v":"ABS"},{"$f":"INPUT!AJ98","v":"*"},{"$f":"INPUT!AK98","v":0},{"$f":"INPUT!AM98","v":"ABS"},{"$f":"INPUT!AN98","v":"ABS"},{"$f":"INPUT!AQ98","v":"ABS"},{"$f":"INPUT!AR98","v":"ABS"},{"$f":"INPUT!AT98","v":"*"},{"$f":"INPUT!AU98","v":0},{"$f":"INPUT!AW98","v":"ABS"},{"$f":"INPUT!AX98","v":"ABS"},{"$f":"INPUT!BA98","v":"ABS"},{"$f":"INPUT!BB98","v":"ABS"},{"$f":"INPUT!BD98","v":"*"},{"$f":"INPUT!BE98","v":0},{"$f":"INPUT!BG98","v":"ABS"},{"$f":"INPUT!BH98","v":"ABS"},{"$f":"INPUT!BK98","v":"ABS"},{"$f":"INPUT!BL98","v":"ABS"},{"$f":"INPUT!BN98","v":"*"},{"$f":"INPUT!BO98","v":"-"},{"$f":"INPUT!BP98","v":0},{"$f":"INPUT!BR98","v":"ABS"},{"$f":"INPUT!BS98","v":"ABS"},{"$f":"INPUT!BV98","v":"ABS"},{"$f":"INPUT!BW98","v":"ABS"},{"$f":"INPUT!BY98","v":""},"","ABS","",null,null,null,null,null,{"$f":"AP98&\"_\"&COUNTIF($AP$5:AP98,AP98)","v":"-_91"}]
[null,{"$f":"INPUT!F99","v":0},{"$f":"INPUT!C99","v":0},{"$f":"INPUT!D99","v":"00:00:00"},{"$f":"INPUT!E99","v":0},{"$f":"INPUT!G99","v":"0011"},{"$f":"INPUT!I99","v":"ABS"},{"$f":"INPUT!J99","v":"ABS"},{"$f":"INPUT!M99","v":"ABS"},{"$f":"INPUT!N99","v":"ABS"},{"$f":"INPUT!P99","v":"*"},{"$f":"INPUT!Q99","v":"0031"},{"$f":"INPUT!S99","v":"ABS"},{"$f":"INPUT!T99","v":"ABS"},{"$f":"INPUT!W99","v":"ABS"},{"$f":"INPUT!X99","v":"ABS"},{"$f":"INPUT!Z99","v":"*"},{"$f":"INPUT!AA99","v":"0051"},{"$f":"INPUT!AC99","v":"ABS"},{"$f":"INPUT!AD99","v":"ABS"},{"$f":"INPUT!AG99","v":"ABS"},{"$f":"INPUT!AH99","v":"ABS"},{"$f":"INPUT!AJ99","v":"*"},{"$f":"INPUT!AK99","v":0},{"$f":"INPUT!AM99","v":"ABS"},{"$f":"INPUT!AN99","v":"ABS"},{"$f":"INPUT!AQ99","v":"ABS"},{"$f":"INPUT!AR99","v":"ABS"},{"$f":"INPUT!AT99","v":"*"},{"$f":"INPUT!AU99","v":0},{"$f":"INPUT!AW99","v":"ABS"},{"$f":"INPUT!AX99","v":"ABS"},{"$f":"INPUT!BA99","v":"ABS"},{"$f":"INPUT!BB99","v":"ABS"},{"$f":"INPUT!BD99","v":"*"},{"$f":"INPUT!BE99","v":0},{"$f":"INPUT!BG99","v":"ABS"},{"$f":"INPUT!BH99","v":"ABS"},{"$f":"INPUT!BK99","v":"ABS"},{"$f":"INPUT!BL99","v":"ABS"},{"$f":"INPUT!BN99","v":"*"},{"$f":"INPUT!BO99","v":"-"},{"$f":"INPUT!BP99","v":0},{"$f":"INPUT!BR99","v":"ABS"},{"$f":"INPUT!BS99","v":"ABS"},{"$f":"INPUT!BV99","v":"ABS"},{"$f":"INPUT!BW99","v":"ABS"},{"$f":"INPUT!BY99","v":""},"","ABS","",null,null,null,null,null,{"$f":"AP99&\"_\"&COUNTIF($AP$5:AP99,AP99)","v":"-_92"}]
[null,{"$f":"INPUT!F100","v":0},{"$f":"INPUT!C100","v":0},{"$f":"INPUT!D100","v":"00:00:00"},{"$f":"INPUT!E100","v":0},{"$f":"INPUT!G100","v":"0011"},{"$f":"INPUT!I100","v":"ABS"},{"$f":"INPUT!J100","v":"ABS"},{"$f":"INPUT!M100","v":"ABS"},{"$f":"INPUT!N100","v":"ABS"},{"$f":"INPUT!P100","v":"*"},{"$f":"INPUT!Q100","v":"0031"},{"$f":"INPUT!S100","v":"ABS"},{"$f":"INPUT!T100","v":"ABS"},{"$f":"INPUT!W100","v":"ABS"},{"$f":"INPUT!X100","v":"ABS"},{"$f":"INPUT!Z100","v":"*"},{"$f":"INPUT!AA100","v":"0051"},{"$f":"INPUT!AC100","v":"ABS"},{"$f":"INPUT!AD100","v":"ABS"},{"$f":"INPUT!AG100","v":"ABS"},{"$f":"INPUT!AH100","v":"ABS"},{"$f":"INPUT!AJ100","v":"*"},{"$f":"INPUT!AK100","v":0},{"$f":"INPUT!AM100","v":"ABS"},{"$f":"INPUT!AN100","v":"ABS"},{"$f":"INPUT!AQ100","v":"ABS"},{"$f":"INPUT!AR100","v":"ABS"},{"$f":"INPUT!AT100","v":"*"},{"$f":"INPUT!AU100","v":0},{"$f":"INPUT!AW100","v":"ABS"},{"$f":"INPUT!AX100","v":"ABS"},{"$f":"INPUT!BA100","v":"ABS"},{"$f":"INPUT!BB100","v":"ABS"},{"$f":"INPUT!BD100","v":"*"},{"$f":"INPUT!BE100","v":0},{"$f":"INPUT!BG100","v":"ABS"},{"$f":"INPUT!BH100","v":"ABS"},{"$f":"INPUT!BK100","v":"ABS"},{"$f":"INPUT!BL100","v":"ABS"},{"$f":"INPUT!BN100","v":"*"},{"$f":"INPUT!BO100","v":"-"},{"$f":"INPUT!BP100","v":0},{"$f":"INPUT!BR100","v":"ABS"},{"$f":"INPUT!BS100","v":"ABS"},{"$f":"INPUT!BV100","v":"ABS"},{"$f":"INPUT!BW100","v":"ABS"},{"$f":"INPUT!BY100","v":""},"","ABS","",null,null,null,null,null,{"$f":"AP100&\"_\"&COUNTIF($AP$5:AP100,AP100)","v":"-_93"}]
[null,{"$f":"INPUT!F101","v":0},{"$f":"INPUT!C101","v":0},{"$f":"INPUT!D101","v":"00:00:00"},{"$f":"INPUT!E101","v":0},{"$f":"INPUT!G101","v":"0011"},{"$f":"INPUT!I101","v":"ABS"},{"$f":"INPUT!J101","v":"ABS"},{"$f":"INPUT!M101","v":"ABS"},{"$f":"INPUT!N101","v":"ABS"},{"$f":"INPUT!P101","v":"*"},{"$f":"INPUT!Q101","v":"0031"},{"$f":"INPUT!S101","v":"ABS"},{"$f":"INPUT!T101","v":"ABS"},{"$f":"INPUT!W101","v":"ABS"},{"$f":"INPUT!X101","v":"ABS"},{"$f":"INPUT!Z101","v":"*"},{"$f":"INPUT!AA101","v":"0051"},{"$f":"INPUT!AC101","v":"ABS"},{"$f":"INPUT!AD101","v":"ABS"},{"$f":"INPUT!AG101","v":"ABS"},{"$f":"INPUT!AH101","v":"ABS"},{"$f":"INPUT!AJ101","v":"*"},{"$f":"INPUT!AK101","v":0},{"$f":"INPUT!AM101","v":"ABS"},{"$f":"INPUT!AN101","v":"ABS"},{"$f":"INPUT!AQ101","v":"ABS"},{"$f":"INPUT!AR101","v":"ABS"},{"$f":"INPUT!AT101","v":"*"},{"$f":"INPUT!AU101","v":0},{"$f":"INPUT!AW101","v":"ABS"},{"$f":"INPUT!AX101","v":"ABS"},{"$f":"INPUT!BA101","v":"ABS"},{"$f":"INPUT!BB101","v":"ABS"},{"$f":"INPUT!BD101","v":"*"},{"$f":"INPUT!BE101","v":0},{"$f":"INPUT!BG101","v":"ABS"},{"$f":"INPUT!BH101","v":"ABS"},{"$f":"INPUT!BK101","v":"ABS"},{"$f":"INPUT!BL101","v":"ABS"},{"$f":"INPUT!BN101","v":"*"},{"$f":"INPUT!BO101","v":"-"},{"$f":"INPUT!BP101","v":0},{"$f":"INPUT!BR101","v":"ABS"},{"$f":"INPUT!BS101","v":"ABS"},{"$f":"INPUT!BV101","v":"ABS"},{"$f":"INPUT!BW101","v":"ABS"},{"$f":"INPUT!BY101","v":""},"","ABS","",null,null,null,null,null,{"$f":"AP101&\"_\"&COUNTIF($AP$5:AP101,AP101)","v":"-_94"}]
[null,{"$f":"INPUT!F102","v":0},{"$f":"INPUT!C102","v":0},{"$f":"INPUT!D102","v":"00:00:00"},{"$f":"INPUT!E102","v":0},{"$f":"INPUT!G102","v":"0011"},{"$f":"INPUT!I102","v":"ABS"},{"$f":"INPUT!J102","v":"ABS"},{"$f":"INPUT!M102","v":"ABS"},{"$f":"INPUT!N102","v":"ABS"},{"$f":"INPUT!P102","v":"*"},{"$f":"INPUT!Q102","v":"0031"},{"$f":"INPUT!S102","v":"ABS"},{"$f":"INPUT!T102","v":"ABS"},{"$f":"INPUT!W102","v":"ABS"},{"$f":"INPUT!X102","v":"ABS"},{"$f":"INPUT!Z102","v":"*"},{"$f":"INPUT!AA102","v":"0051"},{"$f":"INPUT!AC102","v":"ABS"},{"$f":"INPUT!AD102","v":"ABS"},{"$f":"INPUT!AG102","v":"ABS"},{"$f":"INPUT!AH102","v":"ABS"},{"$f":"INPUT!AJ102","v":"*"},{"$f":"INPUT!AK102","v":0},{"$f":"INPUT!AM102","v":"ABS"},{"$f":"INPUT!AN102","v":"ABS"},{"$f":"INPUT!AQ102","v":"ABS"},{"$f":"INPUT!AR102","v":"ABS"},{"$f":"INPUT!AT102","v":"*"},{"$f":"INPUT!AU102","v":0},{"$f":"INPUT!AW102","v":"ABS"},{"$f":"INPUT!AX102","v":"ABS"},{"$f":"INPUT!BA102","v":"ABS"},{"$f":"INPUT!BB102","v":"ABS"},{"$f":"INPUT!BD102","v":"*"},{"$f":"INPUT!BE102","v":0},{"$f":"INPUT!BG102","v":"ABS"},{"$f":"INPUT!BH102","v":"ABS"},{"$f":"INPUT!BK102","v":"ABS"},{"$f":"INPUT!BL102","v":"ABS"},{"$f":"INPUT!BN102","v":"*"},{"$f":"INPUT!BO102","v":"-"},{"$f":"INPUT!BP102","v":0},{"$f":"INPUT!BR102","v":"ABS"},{"$f":"INPUT!BS102","v":"ABS"},{"$f":"INPUT!BV102","v":"ABS"},{"$f":"INPUT!BW102","v":"ABS"},{"$f":"INPUT!BY102","v":""},"","ABS","",null,null,null,null,null,{"$f":"AP102&\"_\"&COUNTIF($AP$5:AP102,AP102)","v":"-_95"}]
[null,{"$f":"INPUT!F103","v":0},{"$f":"INPUT!C103","v":0},{"$f":"INPUT!D103","v":"00:00:00"},{"$f":"INPUT!E103","v":0},{"$f":"INPUT!G103","v":"0011"},{"$f":"INPUT!I103","v":"ABS"},{"$f":"INPUT!J103","v":"ABS"},{"$f":"INPUT!M103","v":"ABS"},{"$f":"INPUT!N103","v":"ABS"},{"$f":"INPUT!P103","v":"*"},{"$f":"INPUT!Q103","v":"0031"},{"$f":"INPUT!S103","v":"ABS"},{"$f":"INPUT!T103","v":"ABS"},{"$f":"INPUT!W103","v":"ABS"},{"$f":"INPUT!X103","v":"ABS"},{"$f":"INPUT!Z103","v":"*"},{"$f":"INPUT!AA103","v":"0051"},{"$f":"INPUT!AC103","v":"ABS"},{"$f":"INPUT!AD103","v":"ABS"},{"$f":"INPUT!AG103","v":"ABS"},{"$f":"INPUT!AH103","v":"ABS"},{"$f":"INPUT!AJ103","v":"*"},{"$f":"INPUT!AK103","v":0},{"$f":"INPUT!AM103","v":"ABS"},{"$f":"INPUT!AN103","v":"ABS"},{"$f":"INPUT!AQ103","v":"ABS"},{"$f":"INPUT!AR103","v":"ABS"},{"$f":"INPUT!AT103","v":"*"},{"$f":"INPUT!AU103","v":0},{"$f":"INPUT!AW103","v":"ABS"},{"$f":"INPUT!AX103","v":"ABS"},{"$f":"INPUT!BA103","v":"ABS"},{"$f":"INPUT!BB103","v":"ABS"},{"$f":"INPUT!BD103","v":"*"},{"$f":"INPUT!BE103","v":0},{"$f":"INPUT!BG103","v":"ABS"},{"$f":"INPUT!BH103","v":"ABS"},{"$f":"INPUT!BK103","v":"ABS"},{"$f":"INPUT!BL103","v":"ABS"},{"$f":"INPUT!BN103","v":"*"},{"$f":"INPUT!BO103","v":"-"},{"$f":"INPUT!BP103","v":0},{"$f":"INPUT!BR103","v":"ABS"},{"$f":"INPUT!BS103","v":"ABS"},{"$f":"INPUT!BV103","v":"ABS"},{"$f":"INPUT!BW103","v":"ABS"},{"$f":"INPUT!BY103","v":""},"","ABS","",null,null,null,null,null,{"$f":"AP103&\"_\"&COUNTIF($AP$5:AP103,AP103)","v":"-_96"}]
[null,{"$f":"INPUT!F104","v":0},{"$f":"INPUT!C104","v":0},{"$f":"INPUT!D104","v":"00:00:00"},{"$f":"INPUT!E104","v":0},{"$f":"INPUT!G104","v":"0011"},{"$f":"INPUT!I104","v":"ABS"},{"$f":"INPUT!J104","v":"ABS"},{"$f":"INPUT!M104","v":"ABS"},{"$f":"INPUT!N104","v":"ABS"},{"$f":"INPUT!P104","v":"*"},{"$f":"INPUT!Q104","v":"0031"},{"$f":"INPUT!S104","v":"ABS"},{"$f":"INPUT!T104","v":"ABS"},{"$f":"INPUT!W104","v":"ABS"},{"$f":"INPUT!X104","v":"ABS"},{"$f":"INPUT!Z104","v":"*"},{"$f":"INPUT!AA104","v":"0051"},{"$f":"INPUT!AC104","v":"ABS"},{"$f":"INPUT!AD104","v":"ABS"},{"$f":"INPUT!AG104","v":"ABS"},{"$f":"INPUT!AH104","v":"ABS"},{"$f":"INPUT!AJ104","v":"*"},{"$f":"INPUT!AK104","v":0},{"$f":"INPUT!AM104","v":"ABS"},{"$f":"INPUT!AN104","v":"ABS"},{"$f":"INPUT!AQ104","v":"ABS"},{"$f":"INPUT!AR104","v":"ABS"},{"$f":"INPUT!AT104","v":"*"},{"$f":"INPUT!AU104","v":0},{"$f":"INPUT!AW104","v":"ABS"},{"$f":"INPUT!AX104","v":"ABS"},{"$f":"INPUT!BA104","v":"ABS"},{"$f":"INPUT!BB104","v":"ABS"},{"$f":"INPUT!BD104","v":"*"},{"$f":"INPUT!BE104","v":0},{"$f":"INPUT!BG104","v":"ABS"},{"$f":"INPUT!BH104","v":"ABS"},{"$f":"INPUT!BK104","v":"ABS"},{"$f":"INPUT!BL104","v":"ABS"},{"$f":"INPUT!BN104","v":"*"},{"$f":"INPUT!BO104","v":"-"},{"$f":"INPUT!BP104","v":0},{"$f":"INPUT!BR104","v":"ABS"},{"$f":"INPUT!BS104","v":"ABS"},{"$f":"INPUT!BV104","v":"ABS"},{"$f":"INPUT!BW104","v":"ABS"},{"$f":"INPUT!BY104","v":""},"","ABS","",null,null,null,null,null,{"$f":"AP104&\"_\"&COUNTIF($AP$5:AP104,AP104)","v":"-_97"}]
[null,{"$f":"INPUT!F105","v":0},{"$f":"INPUT!C105","v":0},{"$f":"INPUT!D105","v":"00:00:00"},{"$f":"INPUT!E105","v":0},{"$f":"INPUT!G105","v":"0011"},{"$f":"INPUT!I105","v":"ABS"},{"$f":"INPUT!J105","v":"ABS"},{"$f":"INPUT!M105","v":"ABS"},{"$f":"INPUT!N105","v":"ABS"},{"$f":"INPUT!P105","v":"*"},{"$f":"INPUT!Q105","v":"0031"},{"$f":"INPUT!S105","v":"ABS"},{"$f":"INPUT!T105","v":"ABS"},{"$f":"INPUT!W105","v":"ABS"},{"$f":"INPUT!X105","v":"ABS"},{"$f":"INPUT!Z105","v":"*"},{"$f":"INPUT!AA105","v":"0051"},{"$f":"INPUT!AC105","v":"ABS"},{"$f":"INPUT!AD105","v":"ABS"},{"$f":"INPUT!AG105","v":"ABS"},{"$f":"INPUT!AH105","v":"ABS"},{"$f":"INPUT!AJ105","v":"*"},{"$f":"INPUT!AK105","v":0},{"$f":"INPUT!AM105","v":"ABS"},{"$f":"INPUT!AN105","v":"ABS"},{"$f":"INPUT!AQ105","v":"ABS"},{"$f":"INPUT!AR105","v":"ABS"},{"$f":"INPUT!AT105","v":"*"},{"$f":"INPUT!AU105","v":0},{"$f":"INPUT!AW105","v":"ABS"},{"$f":"INPUT!AX105","v":"ABS"},{"$f":"INPUT!BA105","v":"ABS"},{"$f":"INPUT!BB105","v":"ABS"},{"$f":"INPUT!BD105","v":"*"},{"$f":"INPUT!BE105","v":0},{"$f":"INPUT!BG105","v":"ABS"},{"$f":"INPUT!BH105","v":"ABS"},{"$f":"INPUT!BK105","v":"ABS"},{"$f":"INPUT!BL105","v":"ABS"},{"$f":"INPUT!BN105","v":"*"},{"$f":"INPUT!BO105","v":"-"},{"$f":"INPUT!BP105","v":0},{"$f":"INPUT!BR105","v":"ABS"},{"$f":"INPUT!BS105","v":"ABS"},{"$f":"INPUT!BV105","v":"ABS"},{"$f":"INPUT!BW105","v":"ABS"},{"$f":"INPUT!BY105","v":""},"","ABS","",null,null,null,null,null,{"$f":"AP105&\"_\"&COUNTIF($AP$5:AP105,AP105)","v":"-_98"}]
[null,{"$f":"INPUT!F106","v":0},{"$f":"INPUT!C106","v":0},{"$f":"INPUT!D106","v":"00:00:00"},{"$f":"INPUT!E106","v":0},{"$f":"INPUT!G106","v":"0011"},{"$f":"INPUT!I106","v":"ABS"},{"$f":"INPUT!J106","v":"ABS"},{"$f":"INPUT!M106","v":"ABS"},{"$f":"INPUT!N106","v":"ABS"},{"$f":"INPUT!P106","v":"*"},{"$f":"INPUT!Q106","v":"0031"},{"$f":"INPUT!S106","v":"ABS"},{"$f":"INPUT!T106","v":"ABS"},{"$f":"INPUT!W106","v":"ABS"},{"$f":"INPUT!X106","v":"ABS"},{"$f":"INPUT!Z106","v":"*"},{"$f":"INPUT!AA106","v":"0051"},{"$f":"INPUT!AC106","v":"ABS"},{"$f":"INPUT!AD106","v":"ABS"},{"$f":"INPUT!AG106","v":"ABS"},{"$f":"INPUT!AH106","v":"ABS"},{"$f":"INPUT!AJ106","v":"*"},{"$f":"INPUT!AK106","v":0},{"$f":"INPUT!AM106","v":"ABS"},{"$f":"INPUT!AN106","v":"ABS"},{"$f":"INPUT!AQ106","v":"ABS"},{"$f":"INPUT!AR106","v":"ABS"},{"$f":"INPUT!AT106","v":"*"},{"$f":"INPUT!AU106","v":0},{"$f":"INPUT!AW106","v":"ABS"},{"$f":"INPUT!AX106","v":"ABS"},{"$f":"INPUT!BA106","v":"ABS"},{"$f":"INPUT!BB106","v":"ABS"},{"$f":"INPUT!BD106","v":"*"},{"$f":"INPUT!BE106","v":0},{"$f":"INPUT!BG106","v":"ABS"},{"$f":"INPUT!BH106","v":"ABS"},{"$f":"INPUT!BK106","v":"ABS"},{"$f":"INPUT!BL106","v":"ABS"},{"$f":"INPUT!BN106","v":"*"},{"$f":"INPUT!BO106","v":"-"},{"$f":"INPUT!BP106","v":0},{"$f":"INPUT!BR106","v":"ABS"},{"$f":"INPUT!BS106","v":"ABS"},{"$f":"INPUT!BV106","v":"ABS"},{"$f":"INPUT!BW106","v":"ABS"},{"$f":"INPUT!BY106","v":""},"","ABS","",null,null,null,null,null,{"$f":"AP106&\"_\"&COUNTIF($AP$5:AP106,AP106)","v":"-_99"}]
[null,{"$f":"INPUT!F107","v":0},{"$f":"INPUT!C107","v":0},{"$f":"INPUT!D107","v":"00:00:00"},{"$f":"INPUT!E107","v":0},{"$f":"INPUT!G107","v":"0011"},{"$f":"INPUT!I107","v":"ABS"},{"$f":"INPUT!J107","v":"ABS"},{"$f":"INPUT!M107","v":"ABS"},{"$f":"INPUT!N107","v":"ABS"},{"$f":"INPUT!P107","v":"*"},{"$f":"INPUT!Q107","v":"0031"},{"$f":"INPUT!S107","v":"ABS"},{"$f":"INPUT!T107","v":"ABS"},{"$f":"INPUT!W107","v":"ABS"},{"$f":"INPUT!X107","v":"ABS"},{"$f":"INPUT!Z107","v":"*"},{"$f":"INPUT!AA107","v":"0051"},{"$f":"INPUT!AC107","v":"ABS"},{"$f":"INPUT!AD107","v":"ABS"},{"$f":"INPUT!AG107","v":"ABS"},{"$f":"INPUT!AH107","v":"ABS"},{"$f":"INPUT!AJ107","v":"*"},{"$f":"INPUT!AK107","v":0},{"$f":"INPUT!AM107","v":"ABS"},{"$f":"INPUT!AN107","v":"ABS"},{"$f":"INPUT!AQ107","v":"ABS"},{"$f":"INPUT!AR107","v":"ABS"},{"$f":"INPUT!AT107","v":"*"},{"$f":"INPUT!AU107","v":0},{"$f":"INPUT!AW107","v":"ABS"},{"$f":"INPUT!AX107","v":"ABS"},{"$f":"INPUT!BA107","v":"ABS"},{"$f":"INPUT!BB107","v":"ABS"},{"$f":"INPUT!BD107","v":"*"},{"$f":"INPUT!BE107","v":0},{"$f":"INPUT!BG107","v":"ABS"},{"$f":"INPUT!BH107","v":"ABS"},{"$f":"INPUT!BK107","v":"ABS"},{"$f":"INPUT!BL107","v":"ABS"},{"$f":"INPUT!BN107","v":"*"},{"$f":"INPUT!BO107","v":"-"},{"$f":"INPUT!BP107","v":0},{"$f":"INPUT!BR107","v":"ABS"},{"$f":"INPUT!BS107","v":"ABS"},{"$f":"INPUT!BV107","v":"ABS"},{"$f":"INPUT!BW107","v":"ABS"},{"$f":"INPUT!BY107","v":""},"","ABS","",null,null,null,null,null,{"$f":"AP107&\"_\"&COUNTIF($AP$5:AP107,AP107)","v":"-_100"}]
[null,{"$f":"INPUT!F108","v":0},{"$f":"INPUT!C108","v":0},{"$f":"INPUT!D108","v":"00:00:00"},{"$f":"INPUT!E108","v":0},{"$f":"INPUT!G108","v":"0011"},{"$f":"INPUT!I108","v":"ABS"},{"$f":"INPUT!J108","v":"ABS"},{"$f":"INPUT!M108","v":"ABS"},{"$f":"INPUT!N108","v":"ABS"},{"$f":"INPUT!P108","v":"*"},{"$f":"INPUT!Q108","v":"0031"},{"$f":"INPUT!S108","v":"ABS"},{"$f":"INPUT!T108","v":"ABS"},{"$f":"INPUT!W108","v":"ABS"},{"$f":"INPUT!X108","v":"ABS"},{"$f":"INPUT!Z108","v":"*"},{"$f":"INPUT!AA108","v":"0051"},{"$f":"INPUT!AC108","v":"ABS"},{"$f":"INPUT!AD108","v":"ABS"},{"$f":"INPUT!AG108","v":"ABS"},{"$f":"INPUT!AH108","v":"ABS"},{"$f":"INPUT!AJ108","v":"*"},{"$f":"INPUT!AK108","v":0},{"$f":"INPUT!AM108","v":"ABS"},{"$f":"INPUT!AN108","v":"ABS"},{"$f":"INPUT!AQ108","v":"ABS"},{"$f":"INPUT!AR108","v":"ABS"},{"$f":"INPUT!AT108","v":"*"},{"$f":"INPUT!AU108","v":0},{"$f":"INPUT!AW108","v":"ABS"},{"$f":"INPUT!AX108","v":"ABS"},{"$f":"INPUT!BA108","v":"ABS"},{"$f":"INPUT!BB108","v":"ABS"},{"$f":"INPUT!BD108","v":"*"},{"$f":"INPUT!BE108","v":0},{"$f":"INPUT!BG108","v":"ABS"},{"$f":"INPUT!BH108","v":"ABS"},{"$f":"INPUT!BK108","v":"ABS"},{"$f":"INPUT!BL108","v":"ABS"},{"$f":"INPUT!BN108","v":"*"},{"$f":"INPUT!BO108","v":"-"},{"$f":"INPUT!BP108","v":0},{"$f":"INPUT!BR108","v":"ABS"},{"$f":"INPUT!BS108","v":"ABS"},{"$f":"INPUT!BV108","v":"ABS"},{"$f":"INPUT!BW108","v":"ABS"},{"$f":"INPUT!BY108","v":""},"","ABS","",null,null,null,null,null,{"$f":"AP108&\"_\"&COUNTIF($AP$5:AP108,AP108)","v":"-_101"}]
[null,{"$f":"INPUT!F109","v":0},{"$f":"INPUT!C109","v":0},{"$f":"INPUT!D109","v":"00:00:00"},{"$f":"INPUT!E109","v":0},{"$f":"INPUT!G109","v":"0011"},{"$f":"INPUT!I109","v":"ABS"},{"$f":"INPUT!J109","v":"ABS"},{"$f":"INPUT!M109","v":"ABS"},{"$f":"INPUT!N109","v":"ABS"},{"$f":"INPUT!P109","v":"*"},{"$f":"INPUT!Q109","v":"0031"},{"$f":"INPUT!S109","v":"ABS"},{"$f":"INPUT!T109","v":"ABS"},{"$f":"INPUT!W109","v":"ABS"},{"$f":"INPUT!X109","v":"ABS"},{"$f":"INPUT!Z109","v":"*"},{"$f":"INPUT!AA109","v":"0051"},{"$f":"INPUT!AC109","v":"ABS"},{"$f":"INPUT!AD109","v":"ABS"},{"$f":"INPUT!AG109","v":"ABS"},{"$f":"INPUT!AH109","v":"ABS"},{"$f":"INPUT!AJ109","v":"*"},{"$f":"INPUT!AK109","v":0},{"$f":"INPUT!AM109","v":"ABS"},{"$f":"INPUT!AN109","v":"ABS"},{"$f":"INPUT!AQ109","v":"ABS"},{"$f":"INPUT!AR109","v":"ABS"},{"$f":"INPUT!AT109","v":"*"},{"$f":"INPUT!AU109","v":0},{"$f":"INPUT!AW109","v":"ABS"},{"$f":"INPUT!AX109","v":"ABS"},{"$f":"INPUT!BA109","v":"ABS"},{"$f":"INPUT!BB109","v":"ABS"},{"$f":"INPUT!BD109","v":"*"},{"$f":"INPUT!BE109","v":0},{"$f":"INPUT!BG109","v":"ABS"},{"$f":"INPUT!BH109","v":"ABS"},{"$f":"INPUT!BK109","v":"ABS"},{"$f":"INPUT!BL109","v":"ABS"},{"$f":"INPUT!BN109","v":"*"},{"$f":"INPUT!BO109","v":"-"},{"$f":"INPUT!BP109","v":0},{"$f":"INPUT!BR109","v":"ABS"},{"$f":"INPUT!BS109","v":"ABS"},{"$f":"INPUT!BV109","v":"ABS"},{"$f":"INPUT!BW109","v":"ABS"},{"$f":"INPUT!BY109","v":""},"","ABS","",null,null,null,null,null,{"$f":"AP109&\"_\"&COUNTIF($AP$5:AP109,AP109)","v":"-_102"}]
[null,{"$f":"INPUT!F110","v":0},{"$f":"INPUT!C110","v":0},{"$f":"INPUT!D110","v":"00:00:00"},{"$f":"INPUT!E110","v":0},{"$f":"INPUT!G110","v":"0011"},{"$f":"INPUT!I110","v":"ABS"},{"$f":"INPUT!J110","v":"ABS"},{"$f":"INPUT!M110","v":"ABS"},{"$f":"INPUT!N110","v":"ABS"},{"$f":"INPUT!P110","v":"*"},{"$f":"INPUT!Q110","v":"0031"},{"$f":"INPUT!S110","v":"ABS"},{"$f":"INPUT!T110","v":"ABS"},{"$f":"INPUT!W110","v":"ABS"},{"$f":"INPUT!X110","v":"ABS"},{"$f":"INPUT!Z110","v":"*"},{"$f":"INPUT!AA110","v":"0051"},{"$f":"INPUT!AC110","v":"ABS"},{"$f":"INPUT!AD110","v":"ABS"},{"$f":"INPUT!AG110","v":"ABS"},{"$f":"INPUT!AH110","v":"ABS"},{"$f":"INPUT!AJ110","v":"*"},{"$f":"INPUT!AK110","v":0},{"$f":"INPUT!AM110","v":"ABS"},{"$f":"INPUT!AN110","v":"ABS"},{"$f":"INPUT!AQ110","v":"ABS"},{"$f":"INPUT!AR110","v":"ABS"},{"$f":"INPUT!AT110","v":"*"},{"$f":"INPUT!AU110","v":0},{"$f":"INPUT!AW110","v":"ABS"},{"$f":"INPUT!AX110","v":"ABS"},{"$f":"INPUT!BA110","v":"ABS"},{"$f":"INPUT!BB110","v":"ABS"},{"$f":"INPUT!BD110","v":"*"},{"$f":"INPUT!BE110","v":0},{"$f":"INPUT!BG110","v":"ABS"},{"$f":"INPUT!BH110","v":"ABS"},{"$f":"INPUT!BK110","v":"ABS"},{"$f":"INPUT!BL110","v":"ABS"},{"$f":"INPUT!BN110","v":"*"},{"$f":"INPUT!BO110","v":"-"},{"$f":"INPUT!BP110","v":0},{"$f":"INPUT!BR110","v":"ABS"},{"$f":"INPUT!BS110","v":"ABS"},{"$f":"INPUT!BV110","v":"ABS"},{"$f":"INPUT!BW110","v":"ABS"},{"$f":"INPUT!BY110","v":""},"","ABS","",null,null,null,null,null,{"$f":"AP110&\"_\"&COUNTIF($AP$5:AP110,AP110)","v":"-_103"}]
[null,{"$f":"INPUT!F111","v":0},{"$f":"INPUT!C111","v":0},{"$f":"INPUT!D111","v":"00:00:00"},{"$f":"INPUT!E111","v":0},{"$f":"INPUT!G111","v":"0011"},{"$f":"INPUT!I111","v":"ABS"},{"$f":"INPUT!J111","v":"ABS"},{"$f":"INPUT!M111","v":"ABS"},{"$f":"INPUT!N111","v":"ABS"},{"$f":"INPUT!P111","v":"*"},{"$f":"INPUT!Q111","v":"0031"},{"$f":"INPUT!S111","v":"ABS"},{"$f":"INPUT!T111","v":"ABS"},{"$f":"INPUT!W111","v":"ABS"},{"$f":"INPUT!X111","v":"ABS"},{"$f":"INPUT!Z111","v":"*"},{"$f":"INPUT!AA111","v":"0051"},{"$f":"INPUT!AC111","v":"ABS"},{"$f":"INPUT!AD111","v":"ABS"},{"$f":"INPUT!AG111","v":"ABS"},{"$f":"INPUT!AH111","v":"ABS"},{"$f":"INPUT!AJ111","v":"*"},{"$f":"INPUT!AK111","v":0},{"$f":"INPUT!AM111","v":"ABS"},{"$f":"INPUT!AN111","v":"ABS"},{"$f":"INPUT!AQ111","v":"ABS"},{"$f":"INPUT!AR111","v":"ABS"},{"$f":"INPUT!AT111","v":"*"},{"$f":"INPUT!AU111","v":0},{"$f":"INPUT!AW111","v":"ABS"},{"$f":"INPUT!AX111","v":"ABS"},{"$f":"INPUT!BA111","v":"ABS"},{"$f":"INPUT!BB111","v":"ABS"},{"$f":"INPUT!BD111","v":"*"},{"$f":"INPUT!BE111","v":0},{"$f":"INPUT!BG111","v":"ABS"},{"$f":"INPUT!BH111","v":"ABS"},{"$f":"INPUT!BK111","v":"ABS"},{"$f":"INPUT!BL111","v":"ABS"},{"$f":"INPUT!BN111","v":"*"},{"$f":"INPUT!BO111","v":"-"},{"$f":"INPUT!BP111","v":0},{"$f":"INPUT!BR111","v":"ABS"},{"$f":"INPUT!BS111","v":"ABS"},{"$f":"INPUT!BV111","v":"ABS"},{"$f":"INPUT!BW111","v":"ABS"},{"$f":"INPUT!BY111","v":""},"","ABS","",null,null,null,null,null,{"$f":"AP111&\"_\"&COUNTIF($AP$5:AP111,AP111)","v":"-_104"}]
[null,{"$f":"INPUT!F112","v":0},{"$f":"INPUT!C112","v":0},{"$f":"INPUT!D112","v":"00:00:00"},{"$f":"INPUT!E112","v":0},{"$f":"INPUT!G112","v":"0011"},{"$f":"INPUT!I112","v":"ABS"},{"$f":"INPUT!J112","v":"ABS"},{"$f":"INPUT!M112","v":"ABS"},{"$f":"INPUT!N112","v":"ABS"},{"$f":"INPUT!P112","v":"*"},{"$f":"INPUT!Q112","v":"0031"},{"$f":"INPUT!S112","v":"ABS"},{"$f":"INPUT!T112","v":"ABS"},{"$f":"INPUT!W112","v":"ABS"},{"$f":"INPUT!X112","v":"ABS"},{"$f":"INPUT!Z112","v":"*"},{"$f":"INPUT!AA112","v":"0051"},{"$f":"INPUT!AC112","v":"ABS"},{"$f":"INPUT!AD112","v":"ABS"},{"$f":"INPUT!AG112","v":"ABS"},{"$f":"INPUT!AH112","v":"ABS"},{"$f":"INPUT!AJ112","v":"*"},{"$f":"INPUT!AK112","v":0},{"$f":"INPUT!AM112","v":"ABS"},{"$f":"INPUT!AN112","v":"ABS"},{"$f":"INPUT!AQ112","v":"ABS"},{"$f":"INPUT!AR112","v":"ABS"},{"$f":"INPUT!AT112","v":"*"},{"$f":"INPUT!AU112","v":0},{"$f":"INPUT!AW112","v":"ABS"},{"$f":"INPUT!AX112","v":"ABS"},{"$f":"INPUT!BA112","v":"ABS"},{"$f":"INPUT!BB112","v":"ABS"},{"$f":"INPUT!BD112","v":"*"},{"$f":"INPUT!BE112","v":0},{"$f":"INPUT!BG112","v":"ABS"},{"$f":"INPUT!BH112","v":"ABS"},{"$f":"INPUT!BK112","v":"ABS"},{"$f":"INPUT!BL112","v":"ABS"},{"$f":"INPUT!BN112","v":"*"},{"$f":"INPUT!BO112","v":"-"},{"$f":"INPUT!BP112","v":0},{"$f":"INPUT!BR112","v":"ABS"},{"$f":"INPUT!BS112","v":"ABS"},{"$f":"INPUT!BV112","v":"ABS"},{"$f":"INPUT!BW112","v":"ABS"},{"$f":"INPUT!BY112","v":""},"","ABS","",null,null,null,null,null,{"$f":"AP112&\"_\"&COUNTIF($AP$5:AP112,AP112)","v":"-_105"}]
[null,{"$f":"INPUT!F113","v":0},{"$f":"INPUT!C113","v":0},{"$f":"INPUT!D113","v":"00:00:00"},{"$f":"INPUT!E113","v":0},{"$f":"INPUT!G113","v":"0011"},{"$f":"INPUT!I113","v":"ABS"},{"$f":"INPUT!J113","v":"ABS"},{"$f":"INPUT!M113","v":"ABS"},{"$f":"INPUT!N113","v":"ABS"},{"$f":"INPUT!P113","v":"*"},{"$f":"INPUT!Q113","v":"0031"},{"$f":"INPUT!S113","v":"ABS"},{"$f":"INPUT!T113","v":"ABS"},{"$f":"INPUT!W113","v":"ABS"},{"$f":"INPUT!X113","v":"ABS"},{"$f":"INPUT!Z113","v":"*"},{"$f":"INPUT!AA113","v":"0051"},{"$f":"INPUT!AC113","v":"ABS"},{"$f":"INPUT!AD113","v":"ABS"},{"$f":"INPUT!AG113","v":"ABS"},{"$f":"INPUT!AH113","v":"ABS"},{"$f":"INPUT!AJ113","v":"*"},{"$f":"INPUT!AK113","v":0},{"$f":"INPUT!AM113","v":"ABS"},{"$f":"INPUT!AN113","v":"ABS"},{"$f":"INPUT!AQ113","v":"ABS"},{"$f":"INPUT!AR113","v":"ABS"},{"$f":"INPUT!AT113","v":"*"},{"$f":"INPUT!AU113","v":0},{"$f":"INPUT!AW113","v":"ABS"},{"$f":"INPUT!AX113","v":"ABS"},{"$f":"INPUT!BA113","v":"ABS"},{"$f":"INPUT!BB113","v":"ABS"},{"$f":"INPUT!BD113","v":"*"},{"$f":"INPUT!BE113","v":0},{"$f":"INPUT!BG113","v":"ABS"},{"$f":"INPUT!BH113","v":"ABS"},{"$f":"INPUT!BK113","v":"ABS"},{"$f":"INPUT!BL113","v":"ABS"},{"$f":"INPUT!BN113","v":"*"},{"$f":"INPUT!BO113","v":"-"},{"$f":"INPUT!BP113","v":0},{"$f":"INPUT!BR113","v":"ABS"},{"$f":"INPUT!BS113","v":"ABS"},{"$f":"INPUT!BV113","v":"ABS"},{"$f":"INPUT!BW113","v":"ABS"},{"$f":"INPUT!BY113","v":""},"","ABS","",null,null,null,null,null,{"$f":"AP113&\"_\"&COUNTIF($AP$5:AP113,AP113)","v":"-_106"}]
[null,{"$f":"INPUT!F114","v":0},{"$f":"INPUT!C114","v":0},{"$f":"INPUT!D114","v":"00:00:00"},{"$f":"INPUT!E114","v":0},{"$f":"INPUT!G114","v":"0011"},{"$f":"INPUT!I114","v":"ABS"},{"$f":"INPUT!J114","v":"ABS"},{"$f":"INPUT!M114","v":"ABS"},{"$f":"INPUT!N114","v":"ABS"},{"$f":"INPUT!P114","v":"*"},{"$f":"INPUT!Q114","v":"0031"},{"$f":"INPUT!S114","v":"ABS"},{"$f":"INPUT!T114","v":"ABS"},{"$f":"INPUT!W114","v":"ABS"},{"$f":"INPUT!X114","v":"ABS"},{"$f":"INPUT!Z114","v":"*"},{"$f":"INPUT!AA114","v":"0051"},{"$f":"INPUT!AC114","v":"ABS"},{"$f":"INPUT!AD114","v":"ABS"},{"$f":"INPUT!AG114","v":"ABS"},{"$f":"INPUT!AH114","v":"ABS"},{"$f":"INPUT!AJ114","v":"*"},{"$f":"INPUT!AK114","v":0},{"$f":"INPUT!AM114","v":"ABS"},{"$f":"INPUT!AN114","v":"ABS"},{"$f":"INPUT!AQ114","v":"ABS"},{"$f":"INPUT!AR114","v":"ABS"},{"$f":"INPUT!AT114","v":"*"},{"$f":"INPUT!AU114","v":0},{"$f":"INPUT!AW114","v":"ABS"},{"$f":"INPUT!AX114","v":"ABS"},{"$f":"INPUT!BA114","v":"ABS"},{"$f":"INPUT!BB114","v":"ABS"},{"$f":"INPUT!BD114","v":"*"},{"$f":"INPUT!BE114","v":0},{"$f":"INPUT!BG114","v":"ABS"},{"$f":"INPUT!BH114","v":"ABS"},{"$f":"INPUT!BK114","v":"ABS"},{"$f":"INPUT!BL114","v":"ABS"},{"$f":"INPUT!BN114","v":"*"},{"$f":"INPUT!BO114","v":"-"},{"$f":"INPUT!BP114","v":0},{"$f":"INPUT!BR114","v":"ABS"},{"$f":"INPUT!BS114","v":"ABS"},{"$f":"INPUT!BV114","v":"ABS"},{"$f":"INPUT!BW114","v":"ABS"},{"$f":"INPUT!BY114","v":""},"","ABS","",null,null,null,null,null,{"$f":"AP114&\"_\"&COUNTIF($AP$5:AP114,AP114)","v":"-_107"}]
[null,{"$f":"INPUT!F115","v":0},{"$f":"INPUT!C115","v":0},{"$f":"INPUT!D115","v":"00:00:00"},{"$f":"INPUT!E115","v":0},{"$f":"INPUT!G115","v":"0011"},{"$f":"INPUT!I115","v":"ABS"},{"$f":"INPUT!J115","v":"ABS"},{"$f":"INPUT!M115","v":"ABS"},{"$f":"INPUT!N115","v":"ABS"},{"$f":"INPUT!P115","v":"*"},{"$f":"INPUT!Q115","v":"0031"},{"$f":"INPUT!S115","v":"ABS"},{"$f":"INPUT!T115","v":"ABS"},{"$f":"INPUT!W115","v":"ABS"},{"$f":"INPUT!X115","v":"ABS"},{"$f":"INPUT!Z115","v":"*"},{"$f":"INPUT!AA115","v":"0051"},{"$f":"INPUT!AC115","v":"ABS"},{"$f":"INPUT!AD115","v":"ABS"},{"$f":"INPUT!AG115","v":"ABS"},{"$f":"INPUT!AH115","v":"ABS"},{"$f":"INPUT!AJ115","v":"*"},{"$f":"INPUT!AK115","v":0},{"$f":"INPUT!AM115","v":"ABS"},{"$f":"INPUT!AN115","v":"ABS"},{"$f":"INPUT!AQ115","v":"ABS"},{"$f":"INPUT!AR115","v":"ABS"},{"$f":"INPUT!AT115","v":"*"},{"$f":"INPUT!AU115","v":0},{"$f":"INPUT!AW115","v":"ABS"},{"$f":"INPUT!AX115","v":"ABS"},{"$f":"INPUT!BA115","v":"ABS"},{"$f":"INPUT!BB115","v":"ABS"},{"$f":"INPUT!BD115","v":"*"},{"$f":"INPUT!BE115","v":0},{"$f":"INPUT!BG115","v":"ABS"},{"$f":"INPUT!BH115","v":"ABS"},{"$f":"INPUT!BK115","v":"ABS"},{"$f":"INPUT!BL115","v":"ABS"},{"$f":"INPUT!BN115","v":"*"},{"$f":"INPUT!BO115","v":"-"},{"$f":"INPUT!BP115","v":0},{"$f":"INPUT!BR115","v":"ABS"},{"$f":"INPUT!BS115","v":"ABS"},{"$f":"INPUT!BV115","v":"ABS"},{"$f":"INPUT!BW115","v":"ABS"},{"$f":"INPUT!BY115","v":""},"","ABS","",null,null,null,null,null,{"$f":"AP115&\"_\"&COUNTIF($AP$5:AP115,AP115)","v":"-_108"}]
[null,{"$f":"INPUT!F116","v":0},{"$f":"INPUT!C116","v":0},{"$f":"INPUT!D116","v":"00:00:00"},{"$f":"INPUT!E116","v":0},{"$f":"INPUT!G116","v":"0011"},{"$f":"INPUT!I116","v":"ABS"},{"$f":"INPUT!J116","v":"ABS"},{"$f":"INPUT!M116","v":"ABS"},{"$f":"INPUT!N116","v":"ABS"},{"$f":"INPUT!P116","v":"*"},{"$f":"INPUT!Q116","v":"0031"},{"$f":"INPUT!S116","v":"ABS"},{"$f":"INPUT!T116","v":"ABS"},{"$f":"INPUT!W116","v":"ABS"},{"$f":"INPUT!X116","v":"ABS"},{"$f":"INPUT!Z116","v":"*"},{"$f":"INPUT!AA116","v":"0051"},{"$f":"INPUT!AC116","v":"ABS"},{"$f":"INPUT!AD116","v":"ABS"},{"$f":"INPUT!AG116","v":"ABS"},{"$f":"INPUT!AH116","v":"ABS"},{"$f":"INPUT!AJ116","v":"*"},{"$f":"INPUT!AK116","v":0},{"$f":"INPUT!AM116","v":"ABS"},{"$f":"INPUT!AN116","v":"ABS"},{"$f":"INPUT!AQ116","v":"ABS"},{"$f":"INPUT!AR116","v":"ABS"},{"$f":"INPUT!AT116","v":"*"},{"$f":"INPUT!AU116","v":0},{"$f":"INPUT!AW116","v":"ABS"},{"$f":"INPUT!AX116","v":"ABS"},{"$f":"INPUT!BA116","v":"ABS"},{"$f":"INPUT!BB116","v":"ABS"},{"$f":"INPUT!BD116","v":"*"},{"$f":"INPUT!BE116","v":0},{"$f":"INPUT!BG116","v":"ABS"},{"$f":"INPUT!BH116","v":"ABS"},{"$f":"INPUT!BK116","v":"ABS"},{"$f":"INPUT!BL116","v":"ABS"},{"$f":"INPUT!BN116","v":"*"},{"$f":"INPUT!BO116","v":"-"},{"$f":"INPUT!BP116","v":0},{"$f":"INPUT!BR116","v":"ABS"},{"$f":"INPUT!BS116","v":"ABS"},{"$f":"INPUT!BV116","v":"ABS"},{"$f":"INPUT!BW116","v":"ABS"},{"$f":"INPUT!BY116","v":""},"","ABS","",null,null,null,null,null,{"$f":"AP116&\"_\"&COUNTIF($AP$5:AP116,AP116)","v":"-_109"}]
[null,{"$f":"INPUT!F117","v":0},{"$f":"INPUT!C117","v":0},{"$f":"INPUT!D117","v":"00:00:00"},{"$f":"INPUT!E117","v":0},{"$f":"INPUT!G117","v":"0011"},{"$f":"INPUT!I117","v":"ABS"},{"$f":"INPUT!J117","v":"ABS"},{"$f":"INPUT!M117","v":"ABS"},{"$f":"INPUT!N117","v":"ABS"},{"$f":"INPUT!P117","v":"*"},{"$f":"INPUT!Q117","v":"0031"},{"$f":"INPUT!S117","v":"ABS"},{"$f":"INPUT!T117","v":"ABS"},{"$f":"INPUT!W117","v":"ABS"},{"$f":"INPUT!X117","v":"ABS"},{"$f":"INPUT!Z117","v":"*"},{"$f":"INPUT!AA117","v":"0051"},{"$f":"INPUT!AC117","v":"ABS"},{"$f":"INPUT!AD117","v":"ABS"},{"$f":"INPUT!AG117","v":"ABS"},{"$f":"INPUT!AH117","v":"ABS"},{"$f":"INPUT!AJ117","v":"*"},{"$f":"INPUT!AK117","v":0},{"$f":"INPUT!AM117","v":"ABS"},{"$f":"INPUT!AN117","v":"ABS"},{"$f":"INPUT!AQ117","v":"ABS"},{"$f":"INPUT!AR117","v":"ABS"},{"$f":"INPUT!AT117","v":"*"},{"$f":"INPUT!AU117","v":0},{"$f":"INPUT!AW117","v":"ABS"},{"$f":"INPUT!AX117","v":"ABS"},{"$f":"INPUT!BA117","v":"ABS"},{"$f":"INPUT!BB117","v":"ABS"},{"$f":"INPUT!BD117","v":"*"},{"$f":"INPUT!BE117","v":0},{"$f":"INPUT!BG117","v":"ABS"},{"$f":"INPUT!BH117","v":"ABS"},{"$f":"INPUT!BK117","v":"ABS"},{"$f":"INPUT!BL117","v":"ABS"},{"$f":"INPUT!BN117","v":"*"},{"$f":"INPUT!BO117","v":"-"},{"$f":"INPUT!BP117","v":0},{"$f":"INPUT!BR117","v":"ABS"},{"$f":"INPUT!BS117","v":"ABS"},{"$f":"INPUT!BV117","v":"ABS"},{"$f":"INPUT!BW117","v":"ABS"},{"$f":"INPUT!BY117","v":""},"","ABS","",null,null,null,null,null,{"$f":"AP117&\"_\"&COUNTIF($AP$5:AP117,AP117)","v":"-_110"}]
[null,{"$f":"INPUT!F118","v":0},{"$f":"INPUT!C118","v":0},{"$f":"INPUT!D118","v":"00:00:00"},{"$f":"INPUT!E118","v":0},{"$f":"INPUT!G118","v":"0011"},{"$f":"INPUT!I118","v":"ABS"},{"$f":"INPUT!J118","v":"ABS"},{"$f":"INPUT!M118","v":"ABS"},{"$f":"INPUT!N118","v":"ABS"},{"$f":"INPUT!P118","v":"*"},{"$f":"INPUT!Q118","v":"0031"},{"$f":"INPUT!S118","v":"ABS"},{"$f":"INPUT!T118","v":"ABS"},{"$f":"INPUT!W118","v":"ABS"},{"$f":"INPUT!X118","v":"ABS"},{"$f":"INPUT!Z118","v":"*"},{"$f":"INPUT!AA118","v":"0051"},{"$f":"INPUT!AC118","v":"ABS"},{"$f":"INPUT!AD118","v":"ABS"},{"$f":"INPUT!AG118","v":"ABS"},{"$f":"INPUT!AH118","v":"ABS"},{"$f":"INPUT!AJ118","v":"*"},{"$f":"INPUT!AK118","v":0},{"$f":"INPUT!AM118","v":"ABS"},{"$f":"INPUT!AN118","v":"ABS"},{"$f":"INPUT!AQ118","v":"ABS"},{"$f":"INPUT!AR118","v":"ABS"},{"$f":"INPUT!AT118","v":"*"},{"$f":"INPUT!AU118","v":0},{"$f":"INPUT!AW118","v":"ABS"},{"$f":"INPUT!AX118","v":"ABS"},{"$f":"INPUT!BA118","v":"ABS"},{"$f":"INPUT!BB118","v":"ABS"},{"$f":"INPUT!BD118","v":"*"},{"$f":"INPUT!BE118","v":0},{"$f":"INPUT!BG118","v":"ABS"},{"$f":"INPUT!BH118","v":"ABS"},{"$f":"INPUT!BK118","v":"ABS"},{"$f":"INPUT!BL118","v":"ABS"},{"$f":"INPUT!BN118","v":"*"},{"$f":"INPUT!BO118","v":"-"},{"$f":"INPUT!BP118","v":0},{"$f":"INPUT!BR118","v":"ABS"},{"$f":"INPUT!BS118","v":"ABS"},{"$f":"INPUT!BV118","v":"ABS"},{"$f":"INPUT!BW118","v":"ABS"},{"$f":"INPUT!BY118","v":""},"","ABS","",null,null,null,null,null,{"$f":"AP118&\"_\"&COUNTIF($AP$5:AP118,AP118)","v":"-_111"}]
[null,{"$f":"INPUT!F119","v":0},{"$f":"INPUT!C119","v":0},{"$f":"INPUT!D119","v":"00:00:00"},{"$f":"INPUT!E119","v":0},{"$f":"INPUT!G119","v":"0011"},{"$f":"INPUT!I119","v":"ABS"},{"$f":"INPUT!J119","v":"ABS"},{"$f":"INPUT!M119","v":"ABS"},{"$f":"INPUT!N119","v":"ABS"},{"$f":"INPUT!P119","v":"*"},{"$f":"INPUT!Q119","v":"0031"},{"$f":"INPUT!S119","v":"ABS"},{"$f":"INPUT!T119","v":"ABS"},{"$f":"INPUT!W119","v":"ABS"},{"$f":"INPUT!X119","v":"ABS"},{"$f":"INPUT!Z119","v":"*"},{"$f":"INPUT!AA119","v":"0051"},{"$f":"INPUT!AC119","v":"ABS"},{"$f":"INPUT!AD119","v":"ABS"},{"$f":"INPUT!AG119","v":"ABS"},{"$f":"INPUT!AH119","v":"ABS"},{"$f":"INPUT!AJ119","v":"*"},{"$f":"INPUT!AK119","v":0},{"$f":"INPUT!AM119","v":"ABS"},{"$f":"INPUT!AN119","v":"ABS"},{"$f":"INPUT!AQ119","v":"ABS"},{"$f":"INPUT!AR119","v":"ABS"},{"$f":"INPUT!AT119","v":"*"},{"$f":"INPUT!AU119","v":0},{"$f":"INPUT!AW119","v":"ABS"},{"$f":"INPUT!AX119","v":"ABS"},{"$f":"INPUT!BA119","v":"ABS"},{"$f":"INPUT!BB119","v":"ABS"},{"$f":"INPUT!BD119","v":"*"},{"$f":"INPUT!BE119","v":0},{"$f":"INPUT!BG119","v":"ABS"},{"$f":"INPUT!BH119","v":"ABS"},{"$f":"INPUT!BK119","v":"ABS"},{"$f":"INPUT!BL119","v":"ABS"},{"$f":"INPUT!BN119","v":"*"},{"$f":"INPUT!BO119","v":"-"},{"$f":"INPUT!BP119","v":0},{"$f":"INPUT!BR119","v":"ABS"},{"$f":"INPUT!BS119","v":"ABS"},{"$f":"INPUT!BV119","v":"ABS"},{"$f":"INPUT!BW119","v":"ABS"},{"$f":"INPUT!BY119","v":""},"","ABS","",null,null,null,null,null,{"$f":"AP119&\"_\"&COUNTIF($AP$5:AP119,AP119)","v":"-_112"}]
[null,{"$f":"INPUT!F120","v":0},{"$f":"INPUT!C120","v":0},{"$f":"INPUT!D120","v":"00:00:00"},{"$f":"INPUT!E120","v":0},{"$f":"INPUT!G120","v":"0011"},{"$f":"INPUT!I120","v":"ABS"},{"$f":"INPUT!J120","v":"ABS"},{"$f":"INPUT!M120","v":"ABS"},{"$f":"INPUT!N120","v":"ABS"},{"$f":"INPUT!P120","v":"*"},{"$f":"INPUT!Q120","v":"0031"},{"$f":"INPUT!S120","v":"ABS"},{"$f":"INPUT!T120","v":"ABS"},{"$f":"INPUT!W120","v":"ABS"},{"$f":"INPUT!X120","v":"ABS"},{"$f":"INPUT!Z120","v":"*"},{"$f":"INPUT!AA120","v":"0051"},{"$f":"INPUT!AC120","v":"ABS"},{"$f":"INPUT!AD120","v":"ABS"},{"$f":"INPUT!AG120","v":"ABS"},{"$f":"INPUT!AH120","v":"ABS"},{"$f":"INPUT!AJ120","v":"*"},{"$f":"INPUT!AK120","v":0},{"$f":"INPUT!AM120","v":"ABS"},{"$f":"INPUT!AN120","v":"ABS"},{"$f":"INPUT!AQ120","v":"ABS"},{"$f":"INPUT!AR120","v":"ABS"},{"$f":"INPUT!AT120","v":"*"},{"$f":"INPUT!AU120","v":0},{"$f":"INPUT!AW120","v":"ABS"},{"$f":"INPUT!AX120","v":"ABS"},{"$f":"INPUT!BA120","v":"ABS"},{"$f":"INPUT!BB120","v":"ABS"},{"$f":"INPUT!BD120","v":"*"},{"$f":"INPUT!BE120","v":0},{"$f":"INPUT!BG120","v":"ABS"},{"$f":"INPUT!BH120","v":"ABS"},{"$f":"INPUT!BK120","v":"ABS"},{"$f":"INPUT!BL120","v":"ABS"},{"$f":"INPUT!BN120","v":"*"},{"$f":"INPUT!BO120","v":"-"},{"$f":"INPUT!BP120","v":0},{"$f":"INPUT!BR120","v":"ABS"},{"$f":"INPUT!BS120","v":"ABS"},{"$f":"INPUT!BV120","v":"ABS"},{"$f":"INPUT!BW120","v":"ABS"},{"$f":"INPUT!BY120","v":""},"","ABS","",null,null,null,null,null,{"$f":"AP120&\"_\"&COUNTIF($AP$5:AP120,AP120)","v":"-_113"}]
[null,{"$f":"INPUT!F121","v":0},{"$f":"INPUT!C121","v":0},{"$f":"INPUT!D121","v":"00:00:00"},{"$f":"INPUT!E121","v":0},{"$f":"INPUT!G121","v":"0011"},{"$f":"INPUT!I121","v":"ABS"},{"$f":"INPUT!J121","v":"ABS"},{"$f":"INPUT!M121","v":"ABS"},{"$f":"INPUT!N121","v":"ABS"},{"$f":"INPUT!P121","v":"*"},{"$f":"INPUT!Q121","v":"0031"},{"$f":"INPUT!S121","v":"ABS"},{"$f":"INPUT!T121","v":"ABS"},{"$f":"INPUT!W121","v":"ABS"},{"$f":"INPUT!X121","v":"ABS"},{"$f":"INPUT!Z121","v":"*"},{"$f":"INPUT!AA121","v":"0051"},{"$f":"INPUT!AC121","v":"ABS"},{"$f":"INPUT!AD121","v":"ABS"},{"$f":"INPUT!AG121","v":"ABS"},{"$f":"INPUT!AH121","v":"ABS"},{"$f":"INPUT!AJ121","v":"*"},{"$f":"INPUT!AK121","v":0},{"$f":"INPUT!AM121","v":"ABS"},{"$f":"INPUT!AN121","v":"ABS"},{"$f":"INPUT!AQ121","v":"ABS"},{"$f":"INPUT!AR121","v":"ABS"},{"$f":"INPUT!AT121","v":"*"},{"$f":"INPUT!AU121","v":0},{"$f":"INPUT!AW121","v":"ABS"},{"$f":"INPUT!AX121","v":"ABS"},{"$f":"INPUT!BA121","v":"ABS"},{"$f":"INPUT!BB121","v":"ABS"},{"$f":"INPUT!BD121","v":"*"},{"$f":"INPUT!BE121","v":0},{"$f":"INPUT!BG121","v":"ABS"},{"$f":"INPUT!BH121","v":"ABS"},{"$f":"INPUT!BK121","v":"ABS"},{"$f":"INPUT!BL121","v":"ABS"},{"$f":"INPUT!BN121","v":"*"},{"$f":"INPUT!BO121","v":"-"},{"$f":"INPUT!BP121","v":0},{"$f":"INPUT!BR121","v":"ABS"},{"$f":"INPUT!BS121","v":"ABS"},{"$f":"INPUT!BV121","v":"ABS"},{"$f":"INPUT!BW121","v":"ABS"},{"$f":"INPUT!BY121","v":""},"","ABS","",null,null,null,null,null,{"$f":"AP121&\"_\"&COUNTIF($AP$5:AP121,AP121)","v":"-_114"}]
[null,{"$f":"INPUT!F122","v":0},{"$f":"INPUT!C122","v":0},{"$f":"INPUT!D122","v":"00:00:00"},{"$f":"INPUT!E122","v":0},{"$f":"INPUT!G122","v":"0011"},{"$f":"INPUT!I122","v":"ABS"},{"$f":"INPUT!J122","v":"ABS"},{"$f":"INPUT!M122","v":"ABS"},{"$f":"INPUT!N122","v":"ABS"},{"$f":"INPUT!P122","v":"*"},{"$f":"INPUT!Q122","v":"0031"},{"$f":"INPUT!S122","v":"ABS"},{"$f":"INPUT!T122","v":"ABS"},{"$f":"INPUT!W122","v":"ABS"},{"$f":"INPUT!X122","v":"ABS"},{"$f":"INPUT!Z122","v":"*"},{"$f":"INPUT!AA122","v":"0051"},{"$f":"INPUT!AC122","v":"ABS"},{"$f":"INPUT!AD122","v":"ABS"},{"$f":"INPUT!AG122","v":"ABS"},{"$f":"INPUT!AH122","v":"ABS"},{"$f":"INPUT!AJ122","v":"*"},{"$f":"INPUT!AK122","v":0},{"$f":"INPUT!AM122","v":"ABS"},{"$f":"INPUT!AN122","v":"ABS"},{"$f":"INPUT!AQ122","v":"ABS"},{"$f":"INPUT!AR122","v":"ABS"},{"$f":"INPUT!AT122","v":"*"},{"$f":"INPUT!AU122","v":0},{"$f":"INPUT!AW122","v":"ABS"},{"$f":"INPUT!AX122","v":"ABS"},{"$f":"INPUT!BA122","v":"ABS"},{"$f":"INPUT!BB122","v":"ABS"},{"$f":"INPUT!BD122","v":"*"},{"$f":"INPUT!BE122","v":0},{"$f":"INPUT!BG122","v":"ABS"},{"$f":"INPUT!BH122","v":"ABS"},{"$f":"INPUT!BK122","v":"ABS"},{"$f":"INPUT!BL122","v":"ABS"},{"$f":"INPUT!BN122","v":"*"},{"$f":"INPUT!BO122","v":"-"},{"$f":"INPUT!BP122","v":0},{"$f":"INPUT!BR122","v":"ABS"},{"$f":"INPUT!BS122","v":"ABS"},{"$f":"INPUT!BV122","v":"ABS"},{"$f":"INPUT!BW122","v":"ABS"},{"$f":"INPUT!BY122","v":""},"","ABS","",null,null,null,null,null,{"$f":"AP122&\"_\"&COUNTIF($AP$5:AP122,AP122)","v":"-_115"}]
[null,{"$f":"INPUT!F123","v":0},{"$f":"INPUT!C123","v":0},{"$f":"INPUT!D123","v":"00:00:00"},{"$f":"INPUT!E123","v":0},{"$f":"INPUT!G123","v":"0011"},{"$f":"INPUT!I123","v":"ABS"},{"$f":"INPUT!J123","v":"ABS"},{"$f":"INPUT!M123","v":"ABS"},{"$f":"INPUT!N123","v":"ABS"},{"$f":"INPUT!P123","v":"*"},{"$f":"INPUT!Q123","v":"0031"},{"$f":"INPUT!S123","v":"ABS"},{"$f":"INPUT!T123","v":"ABS"},{"$f":"INPUT!W123","v":"ABS"},{"$f":"INPUT!X123","v":"ABS"},{"$f":"INPUT!Z123","v":"*"},{"$f":"INPUT!AA123","v":"0051"},{"$f":"INPUT!AC123","v":"ABS"},{"$f":"INPUT!AD123","v":"ABS"},{"$f":"INPUT!AG123","v":"ABS"},{"$f":"INPUT!AH123","v":"ABS"},{"$f":"INPUT!AJ123","v":"*"},{"$f":"INPUT!AK123","v":0},{"$f":"INPUT!AM123","v":"ABS"},{"$f":"INPUT!AN123","v":"ABS"},{"$f":"INPUT!AQ123","v":"ABS"},{"$f":"INPUT!AR123","v":"ABS"},{"$f":"INPUT!AT123","v":"*"},{"$f":"INPUT!AU123","v":0},{"$f":"INPUT!AW123","v":"ABS"},{"$f":"INPUT!AX123","v":"ABS"},{"$f":"INPUT!BA123","v":"ABS"},{"$f":"INPUT!BB123","v":"ABS"},{"$f":"INPUT!BD123","v":"*"},{"$f":"INPUT!BE123","v":0},{"$f":"INPUT!BG123","v":"ABS"},{"$f":"INPUT!BH123","v":"ABS"},{"$f":"INPUT!BK123","v":"ABS"},{"$f":"INPUT!BL123","v":"ABS"},{"$f":"INPUT!BN123","v":"*"},{"$f":"INPUT!BO123","v":"-"},{"$f":"INPUT!BP123","v":0},{"$f":"INPUT!BR123","v":"ABS"},{"$f":"INPUT!BS123","v":"ABS"},{"$f":"INPUT!BV123","v":"ABS"},{"$f":"INPUT!BW123","v":"ABS"},{"$f":"INPUT!BY123","v":""},"","ABS","",null,null,null,null,null,{"$f":"AP123&\"_\"&COUNTIF($AP$5:AP123,AP123)","v":"-_116"}]
[null,{"$f":"INPUT!F124","v":0},{"$f":"INPUT!C124","v":0},{"$f":"INPUT!D124","v":"00:00:00"},{"$f":"INPUT!E124","v":0},{"$f":"INPUT!G124","v":"0011"},{"$f":"INPUT!I124","v":"ABS"},{"$f":"INPUT!J124","v":"ABS"},{"$f":"INPUT!M124","v":"ABS"},{"$f":"INPUT!N124","v":"ABS"},{"$f":"INPUT!P124","v":"*"},{"$f":"INPUT!Q124","v":"0031"},{"$f":"INPUT!S124","v":"ABS"},{"$f":"INPUT!T124","v":"ABS"},{"$f":"INPUT!W124","v":"ABS"},{"$f":"INPUT!X124","v":"ABS"},{"$f":"INPUT!Z124","v":"*"},{"$f":"INPUT!AA124","v":"0051"},{"$f":"INPUT!AC124","v":"ABS"},{"$f":"INPUT!AD124","v":"ABS"},{"$f":"INPUT!AG124","v":"ABS"},{"$f":"INPUT!AH124","v":"ABS"},{"$f":"INPUT!AJ124","v":"*"},{"$f":"INPUT!AK124","v":0},{"$f":"INPUT!AM124","v":"ABS"},{"$f":"INPUT!AN124","v":"ABS"},{"$f":"INPUT!AQ124","v":"ABS"},{"$f":"INPUT!AR124","v":"ABS"},{"$f":"INPUT!AT124","v":"*"},{"$f":"INPUT!AU124","v":0},{"$f":"INPUT!AW124","v":"ABS"},{"$f":"INPUT!AX124","v":"ABS"},{"$f":"INPUT!BA124","v":"ABS"},{"$f":"INPUT!BB124","v":"ABS"},{"$f":"INPUT!BD124","v":"*"},{"$f":"INPUT!BE124","v":0},{"$f":"INPUT!BG124","v":"ABS"},{"$f":"INPUT!BH124","v":"ABS"},{"$f":"INPUT!BK124","v":"ABS"},{"$f":"INPUT!BL124","v":"ABS"},{"$f":"INPUT!BN124","v":"*"},{"$f":"INPUT!BO124","v":"-"},{"$f":"INPUT!BP124","v":0},{"$f":"INPUT!BR124","v":"ABS"},{"$f":"INPUT!BS124","v":"ABS"},{"$f":"INPUT!BV124","v":"ABS"},{"$f":"INPUT!BW124","v":"ABS"},{"$f":"INPUT!BY124","v":""},"","ABS","",null,null,null,null,null,{"$f":"AP124&\"_\"&COUNTIF($AP$5:AP124,AP124)","v":"-_117"}]
[null,{"$f":"INPUT!F125","v":0},{"$f":"INPUT!C125","v":0},{"$f":"INPUT!D125","v":"00:00:00"},{"$f":"INPUT!E125","v":0},{"$f":"INPUT!G125","v":"0011"},{"$f":"INPUT!I125","v":"ABS"},{"$f":"INPUT!J125","v":"ABS"},{"$f":"INPUT!M125","v":"ABS"},{"$f":"INPUT!N125","v":"ABS"},{"$f":"INPUT!P125","v":"*"},{"$f":"INPUT!Q125","v":"0031"},{"$f":"INPUT!S125","v":"ABS"},{"$f":"INPUT!T125","v":"ABS"},{"$f":"INPUT!W125","v":"ABS"},{"$f":"INPUT!X125","v":"ABS"},{"$f":"INPUT!Z125","v":"*"},{"$f":"INPUT!AA125","v":"0051"},{"$f":"INPUT!AC125","v":"ABS"},{"$f":"INPUT!AD125","v":"ABS"},{"$f":"INPUT!AG125","v":"ABS"},{"$f":"INPUT!AH125","v":"ABS"},{"$f":"INPUT!AJ125","v":"*"},{"$f":"INPUT!AK125","v":0},{"$f":"INPUT!AM125","v":"ABS"},{"$f":"INPUT!AN125","v":"ABS"},{"$f":"INPUT!AQ125","v":"ABS"},{"$f":"INPUT!AR125","v":"ABS"},{"$f":"INPUT!AT125","v":"*"},{"$f":"INPUT!AU125","v":0},{"$f":"INPUT!AW125","v":"ABS"},{"$f":"INPUT!AX125","v":"ABS"},{"$f":"INPUT!BA125","v":"ABS"},{"$f":"INPUT!BB125","v":"ABS"},{"$f":"INPUT!BD125","v":"*"},{"$f":"INPUT!BE125","v":0},{"$f":"INPUT!BG125","v":"ABS"},{"$f":"INPUT!BH125","v":"ABS"},{"$f":"INPUT!BK125","v":"ABS"},{"$f":"INPUT!BL125","v":"ABS"},{"$f":"INPUT!BN125","v":"*"},{"$f":"INPUT!BO125","v":"-"},{"$f":"INPUT!BP125","v":0},{"$f":"INPUT!BR125","v":"ABS"},{"$f":"INPUT!BS125","v":"ABS"},{"$f":"INPUT!BV125","v":"ABS"},{"$f":"INPUT!BW125","v":"ABS"},{"$f":"INPUT!BY125","v":""},"","ABS","",null,null,null,null,null,{"$f":"AP125&\"_\"&COUNTIF($AP$5:AP125,AP125)","v":"-_118"}]
[null,{"$f":"INPUT!F126","v":0},{"$f":"INPUT!C126","v":0},{"$f":"INPUT!D126","v":"00:00:00"},{"$f":"INPUT!E126","v":0},{"$f":"INPUT!G126","v":"0011"},{"$f":"INPUT!I126","v":"ABS"},{"$f":"INPUT!J126","v":"ABS"},{"$f":"INPUT!M126","v":"ABS"},{"$f":"INPUT!N126","v":"ABS"},{"$f":"INPUT!P126","v":"*"},{"$f":"INPUT!Q126","v":"0031"},{"$f":"INPUT!S126","v":"ABS"},{"$f":"INPUT!T126","v":"ABS"},{"$f":"INPUT!W126","v":"ABS"},{"$f":"INPUT!X126","v":"ABS"},{"$f":"INPUT!Z126","v":"*"},{"$f":"INPUT!AA126","v":"0051"},{"$f":"INPUT!AC126","v":"ABS"},{"$f":"INPUT!AD126","v":"ABS"},{"$f":"INPUT!AG126","v":"ABS"},{"$f":"INPUT!AH126","v":"ABS"},{"$f":"INPUT!AJ126","v":"*"},{"$f":"INPUT!AK126","v":0},{"$f":"INPUT!AM126","v":"ABS"},{"$f":"INPUT!AN126","v":"ABS"},{"$f":"INPUT!AQ126","v":"ABS"},{"$f":"INPUT!AR126","v":"ABS"},{"$f":"INPUT!AT126","v":"*"},{"$f":"INPUT!AU126","v":0},{"$f":"INPUT!AW126","v":"ABS"},{"$f":"INPUT!AX126","v":"ABS"},{"$f":"INPUT!BA126","v":"ABS"},{"$f":"INPUT!BB126","v":"ABS"},{"$f":"INPUT!BD126","v":"*"},{"$f":"INPUT!BE126","v":0},{"$f":"INPUT!BG126","v":"ABS"},{"$f":"INPUT!BH126","v":"ABS"},{"$f":"INPUT!BK126","v":"ABS"},{"$f":"INPUT!BL126","v":"ABS"},{"$f":"INPUT!BN126","v":"*"},{"$f":"INPUT!BO126","v":"-"},{"$f":"INPUT!BP126","v":0},{"$f":"INPUT!BR126","v":"ABS"},{"$f":"INPUT!BS126","v":"ABS"},{"$f":"INPUT!BV126","v":"ABS"},{"$f":"INPUT!BW126","v":"ABS"},{"$f":"INPUT!BY126","v":""},"","ABS","",null,null,null,null,null,{"$f":"AP126&\"_\"&COUNTIF($AP$5:AP126,AP126)","v":"-_119"}]
[null,{"$f":"INPUT!F127","v":0},{"$f":"INPUT!C127","v":0},{"$f":"INPUT!D127","v":"00:00:00"},{"$f":"INPUT!E127","v":0},{"$f":"INPUT!G127","v":"0011"},{"$f":"INPUT!I127","v":"ABS"},{"$f":"INPUT!J127","v":"ABS"},{"$f":"INPUT!M127","v":"ABS"},{"$f":"INPUT!N127","v":"ABS"},{"$f":"INPUT!P127","v":"*"},{"$f":"INPUT!Q127","v":"0031"},{"$f":"INPUT!S127","v":"ABS"},{"$f":"INPUT!T127","v":"ABS"},{"$f":"INPUT!W127","v":"ABS"},{"$f":"INPUT!X127","v":"ABS"},{"$f":"INPUT!Z127","v":"*"},{"$f":"INPUT!AA127","v":"0051"},{"$f":"INPUT!AC127","v":"ABS"},{"$f":"INPUT!AD127","v":"ABS"},{"$f":"INPUT!AG127","v":"ABS"},{"$f":"INPUT!AH127","v":"ABS"},{"$f":"INPUT!AJ127","v":"*"},{"$f":"INPUT!AK127","v":0},{"$f":"INPUT!AM127","v":"ABS"},{"$f":"INPUT!AN127","v":"ABS"},{"$f":"INPUT!AQ127","v":"ABS"},{"$f":"INPUT!AR127","v":"ABS"},{"$f":"INPUT!AT127","v":"*"},{"$f":"INPUT!AU127","v":0},{"$f":"INPUT!AW127","v":"ABS"},{"$f":"INPUT!AX127","v":"ABS"},{"$f":"INPUT!BA127","v":"ABS"},{"$f":"INPUT!BB127","v":"ABS"},{"$f":"INPUT!BD127","v":"*"},{"$f":"INPUT!BE127","v":0},{"$f":"INPUT!BG127","v":"ABS"},{"$f":"INPUT!BH127","v":"ABS"},{"$f":"INPUT!BK127","v":"ABS"},{"$f":"INPUT!BL127","v":"ABS"},{"$f":"INPUT!BN127","v":"*"},{"$f":"INPUT!BO127","v":"-"},{"$f":"INPUT!BP127","v":0},{"$f":"INPUT!BR127","v":"ABS"},{"$f":"INPUT!BS127","v":"ABS"},{"$f":"INPUT!BV127","v":"ABS"},{"$f":"INPUT!BW127","v":"ABS"},{"$f":"INPUT!BY127","v":""},"","ABS","",null,null,null,null,null,{"$f":"AP127&\"_\"&COUNTIF($AP$5:AP127,AP127)","v":"-_120"}]
[null,{"$f":"INPUT!F128","v":0},{"$f":"INPUT!C128","v":0},{"$f":"INPUT!D128","v":"00:00:00"},{"$f":"INPUT!E128","v":0},{"$f":"INPUT!G128","v":"0011"},{"$f":"INPUT!I128","v":"ABS"},{"$f":"INPUT!J128","v":"ABS"},{"$f":"INPUT!M128","v":"ABS"},{"$f":"INPUT!N128","v":"ABS"},{"$f":"INPUT!P128","v":"*"},{"$f":"INPUT!Q128","v":"0031"},{"$f":"INPUT!S128","v":"ABS"},{"$f":"INPUT!T128","v":"ABS"},{"$f":"INPUT!W128","v":"ABS"},{"$f":"INPUT!X128","v":"ABS"},{"$f":"INPUT!Z128","v":"*"},{"$f":"INPUT!AA128","v":"0051"},{"$f":"INPUT!AC128","v":"ABS"},{"$f":"INPUT!AD128","v":"ABS"},{"$f":"INPUT!AG128","v":"ABS"},{"$f":"INPUT!AH128","v":"ABS"},{"$f":"INPUT!AJ128","v":"*"},{"$f":"INPUT!AK128","v":0},{"$f":"INPUT!AM128","v":"ABS"},{"$f":"INPUT!AN128","v":"ABS"},{"$f":"INPUT!AQ128","v":"ABS"},{"$f":"INPUT!AR128","v":"ABS"},{"$f":"INPUT!AT128","v":"*"},{"$f":"INPUT!AU128","v":0},{"$f":"INPUT!AW128","v":"ABS"},{"$f":"INPUT!AX128","v":"ABS"},{"$f":"INPUT!BA128","v":"ABS"},{"$f":"INPUT!BB128","v":"ABS"},{"$f":"INPUT!BD128","v":"*"},{"$f":"INPUT!BE128","v":0},{"$f":"INPUT!BG128","v":"ABS"},{"$f":"INPUT!BH128","v":"ABS"},{"$f":"INPUT!BK128","v":"ABS"},{"$f":"INPUT!BL128","v":"ABS"},{"$f":"INPUT!BN128","v":"*"},{"$f":"INPUT!BO128","v":"-"},{"$f":"INPUT!BP128","v":0},{"$f":"INPUT!BR128","v":"ABS"},{"$f":"INPUT!BS128","v":"ABS"},{"$f":"INPUT!BV128","v":"ABS"},{"$f":"INPUT!BW128","v":"ABS"},{"$f":"INPUT!BY128","v":""},"","ABS","",null,null,null,null,null,{"$f":"AP128&\"_\"&COUNTIF($AP$5:AP128,AP128)","v":"-_121"}]
[null,{"$f":"INPUT!F129","v":0},{"$f":"INPUT!C129","v":0},{"$f":"INPUT!D129","v":"00:00:00"},{"$f":"INPUT!E129","v":0},{"$f":"INPUT!G129","v":"0011"},{"$f":"INPUT!I129","v":"ABS"},{"$f":"INPUT!J129","v":"ABS"},{"$f":"INPUT!M129","v":"ABS"},{"$f":"INPUT!N129","v":"ABS"},{"$f":"INPUT!P129","v":"*"},{"$f":"INPUT!Q129","v":"0031"},{"$f":"INPUT!S129","v":"ABS"},{"$f":"INPUT!T129","v":"ABS"},{"$f":"INPUT!W129","v":"ABS"},{"$f":"INPUT!X129","v":"ABS"},{"$f":"INPUT!Z129","v":"*"},{"$f":"INPUT!AA129","v":"0051"},{"$f":"INPUT!AC129","v":"ABS"},{"$f":"INPUT!AD129","v":"ABS"},{"$f":"INPUT!AG129","v":"ABS"},{"$f":"INPUT!AH129","v":"ABS"},{"$f":"INPUT!AJ129","v":"*"},{"$f":"INPUT!AK129","v":0},{"$f":"INPUT!AM129","v":"ABS"},{"$f":"INPUT!AN129","v":"ABS"},{"$f":"INPUT!AQ129","v":"ABS"},{"$f":"INPUT!AR129","v":"ABS"},{"$f":"INPUT!AT129","v":"*"},{"$f":"INPUT!AU129","v":0},{"$f":"INPUT!AW129","v":"ABS"},{"$f":"INPUT!AX129","v":"ABS"},{"$f":"INPUT!BA129","v":"ABS"},{"$f":"INPUT!BB129","v":"ABS"},{"$f":"INPUT!BD129","v":"*"},{"$f":"INPUT!BE129","v":0},{"$f":"INPUT!BG129","v":"ABS"},{"$f":"INPUT!BH129","v":"ABS"},{"$f":"INPUT!BK129","v":"ABS"},{"$f":"INPUT!BL129","v":"ABS"},{"$f":"INPUT!BN129","v":"*"},{"$f":"INPUT!BO129","v":"-"},{"$f":"INPUT!BP129","v":0},{"$f":"INPUT!BR129","v":"ABS"},{"$f":"INPUT!BS129","v":"ABS"},{"$f":"INPUT!BV129","v":"ABS"},{"$f":"INPUT!BW129","v":"ABS"},{"$f":"INPUT!BY129","v":""},"","ABS","",null,null,null,null,null,{"$f":"AP129&\"_\"&COUNTIF($AP$5:AP129,AP129)","v":"-_122"}]
[null,{"$f":"INPUT!F130","v":0},{"$f":"INPUT!C130","v":0},{"$f":"INPUT!D130","v":"00:00:00"},{"$f":"INPUT!E130","v":0},{"$f":"INPUT!G130","v":"0011"},{"$f":"INPUT!I130","v":"ABS"},{"$f":"INPUT!J130","v":"ABS"},{"$f":"INPUT!M130","v":"ABS"},{"$f":"INPUT!N130","v":"ABS"},{"$f":"INPUT!P130","v":"*"},{"$f":"INPUT!Q130","v":"0031"},{"$f":"INPUT!S130","v":"ABS"},{"$f":"INPUT!T130","v":"ABS"},{"$f":"INPUT!W130","v":"ABS"},{"$f":"INPUT!X130","v":"ABS"},{"$f":"INPUT!Z130","v":"*"},{"$f":"INPUT!AA130","v":"0051"},{"$f":"INPUT!AC130","v":"ABS"},{"$f":"INPUT!AD130","v":"ABS"},{"$f":"INPUT!AG130","v":"ABS"},{"$f":"INPUT!AH130","v":"ABS"},{"$f":"INPUT!AJ130","v":"*"},{"$f":"INPUT!AK130","v":0},{"$f":"INPUT!AM130","v":"ABS"},{"$f":"INPUT!AN130","v":"ABS"},{"$f":"INPUT!AQ130","v":"ABS"},{"$f":"INPUT!AR130","v":"ABS"},{"$f":"INPUT!AT130","v":"*"},{"$f":"INPUT!AU130","v":0},{"$f":"INPUT!AW130","v":"ABS"},{"$f":"INPUT!AX130","v":"ABS"},{"$f":"INPUT!BA130","v":"ABS"},{"$f":"INPUT!BB130","v":"ABS"},{"$f":"INPUT!BD130","v":"*"},{"$f":"INPUT!BE130","v":0},{"$f":"INPUT!BG130","v":"ABS"},{"$f":"INPUT!BH130","v":"ABS"},{"$f":"INPUT!BK130","v":"ABS"},{"$f":"INPUT!BL130","v":"ABS"},{"$f":"INPUT!BN130","v":"*"},{"$f":"INPUT!BO130","v":"-"},{"$f":"INPUT!BP130","v":0},{"$f":"INPUT!BR130","v":"ABS"},{"$f":"INPUT!BS130","v":"ABS"},{"$f":"INPUT!BV130","v":"ABS"},{"$f":"INPUT!BW130","v":"ABS"},{"$f":"INPUT!BY130","v":""},"","ABS","",null,null,null,null,null,{"$f":"AP130&\"_\"&COUNTIF($AP$5:AP130,AP130)","v":"-_123"}]
[null,{"$f":"INPUT!F131","v":0},{"$f":"INPUT!C131","v":0},{"$f":"INPUT!D131","v":"00:00:00"},{"$f":"INPUT!E131","v":0},{"$f":"INPUT!G131","v":"0011"},{"$f":"INPUT!I131","v":"ABS"},{"$f":"INPUT!J131","v":"ABS"},{"$f":"INPUT!M131","v":"ABS"},{"$f":"INPUT!N131","v":"ABS"},{"$f":"INPUT!P131","v":"*"},{"$f":"INPUT!Q131","v":"0031"},{"$f":"INPUT!S131","v":"ABS"},{"$f":"INPUT!T131","v":"ABS"},{"$f":"INPUT!W131","v":"ABS"},{"$f":"INPUT!X131","v":"ABS"},{"$f":"INPUT!Z131","v":"*"},{"$f":"INPUT!AA131","v":"0051"},{"$f":"INPUT!AC131","v":"ABS"},{"$f":"INPUT!AD131","v":"ABS"},{"$f":"INPUT!AG131","v":"ABS"},{"$f":"INPUT!AH131","v":"ABS"},{"$f":"INPUT!AJ131","v":"*"},{"$f":"INPUT!AK131","v":0},{"$f":"INPUT!AM131","v":"ABS"},{"$f":"INPUT!AN131","v":"ABS"},{"$f":"INPUT!AQ131","v":"ABS"},{"$f":"INPUT!AR131","v":"ABS"},{"$f":"INPUT!AT131","v":"*"},{"$f":"INPUT!AU131","v":0},{"$f":"INPUT!AW131","v":"ABS"},{"$f":"INPUT!AX131","v":"ABS"},{"$f":"INPUT!BA131","v":"ABS"},{"$f":"INPUT!BB131","v":"ABS"},{"$f":"INPUT!BD131","v":"*"},{"$f":"INPUT!BE131","v":0},{"$f":"INPUT!BG131","v":"ABS"},{"$f":"INPUT!BH131","v":"ABS"},{"$f":"INPUT!BK131","v":"ABS"},{"$f":"INPUT!BL131","v":"ABS"},{"$f":"INPUT!BN131","v":"*"},{"$f":"INPUT!BO131","v":"-"},{"$f":"INPUT!BP131","v":0},{"$f":"INPUT!BR131","v":"ABS"},{"$f":"INPUT!BS131","v":"ABS"},{"$f":"INPUT!BV131","v":"ABS"},{"$f":"INPUT!BW131","v":"ABS"},{"$f":"INPUT!BY131","v":""},"","ABS","",null,null,null,null,null,{"$f":"AP131&\"_\"&COUNTIF($AP$5:AP131,AP131)","v":"-_124"}]
[null,{"$f":"INPUT!F132","v":0},{"$f":"INPUT!C132","v":0},{"$f":"INPUT!D132","v":"00:00:00"},{"$f":"INPUT!E132","v":0},{"$f":"INPUT!G132","v":"0011"},{"$f":"INPUT!I132","v":"ABS"},{"$f":"INPUT!J132","v":"ABS"},{"$f":"INPUT!M132","v":"ABS"},{"$f":"INPUT!N132","v":"ABS"},{"$f":"INPUT!P132","v":"*"},{"$f":"INPUT!Q132","v":"0031"},{"$f":"INPUT!S132","v":"ABS"},{"$f":"INPUT!T132","v":"ABS"},{"$f":"INPUT!W132","v":"ABS"},{"$f":"INPUT!X132","v":"ABS"},{"$f":"INPUT!Z132","v":"*"},{"$f":"INPUT!AA132","v":"0051"},{"$f":"INPUT!AC132","v":"ABS"},{"$f":"INPUT!AD132","v":"ABS"},{"$f":"INPUT!AG132","v":"ABS"},{"$f":"INPUT!AH132","v":"ABS"},{"$f":"INPUT!AJ132","v":"*"},{"$f":"INPUT!AK132","v":0},{"$f":"INPUT!AM132","v":"ABS"},{"$f":"INPUT!AN132","v":"ABS"},{"$f":"INPUT!AQ132","v":"ABS"},{"$f":"INPUT!AR132","v":"ABS"},{"$f":"INPUT!AT132","v":"*"},{"$f":"INPUT!AU132","v":0},{"$f":"INPUT!AW132","v":"ABS"},{"$f":"INPUT!AX132","v":"ABS"},{"$f":"INPUT!BA132","v":"ABS"},{"$f":"INPUT!BB132","v":"ABS"},{"$f":"INPUT!BD132","v":"*"},{"$f":"INPUT!BE132","v":0},{"$f":"INPUT!BG132","v":"ABS"},{"$f":"INPUT!BH132","v":"ABS"},{"$f":"INPUT!BK132","v":"ABS"},{"$f":"INPUT!BL132","v":"ABS"},{"$f":"INPUT!BN132","v":"*"},{"$f":"INPUT!BO132","v":"-"},{"$f":"INPUT!BP132","v":0},{"$f":"INPUT!BR132","v":"ABS"},{"$f":"INPUT!BS132","v":"ABS"},{"$f":"INPUT!BV132","v":"ABS"},{"$f":"INPUT!BW132","v":"ABS"},{"$f":"INPUT!BY132","v":""},"","ABS","",null,null,null,null,null,{"$f":"AP132&\"_\"&COUNTIF($AP$5:AP132,AP132)","v":"-_125"}]
[null,{"$f":"INPUT!F133","v":0},{"$f":"INPUT!C133","v":0},{"$f":"INPUT!D133","v":"00:00:00"},{"$f":"INPUT!E133","v":0},{"$f":"INPUT!G133","v":"0011"},{"$f":"INPUT!I133","v":"ABS"},{"$f":"INPUT!J133","v":"ABS"},{"$f":"INPUT!M133","v":"ABS"},{"$f":"INPUT!N133","v":"ABS"},{"$f":"INPUT!P133","v":"*"},{"$f":"INPUT!Q133","v":"0031"},{"$f":"INPUT!S133","v":"ABS"},{"$f":"INPUT!T133","v":"ABS"},{"$f":"INPUT!W133","v":"ABS"},{"$f":"INPUT!X133","v":"ABS"},{"$f":"INPUT!Z133","v":"*"},{"$f":"INPUT!AA133","v":"0051"},{"$f":"INPUT!AC133","v":"ABS"},{"$f":"INPUT!AD133","v":"ABS"},{"$f":"INPUT!AG133","v":"ABS"},{"$f":"INPUT!AH133","v":"ABS"},{"$f":"INPUT!AJ133","v":"*"},{"$f":"INPUT!AK133","v":0},{"$f":"INPUT!AM133","v":"ABS"},{"$f":"INPUT!AN133","v":"ABS"},{"$f":"INPUT!AQ133","v":"ABS"},{"$f":"INPUT!AR133","v":"ABS"},{"$f":"INPUT!AT133","v":"*"},{"$f":"INPUT!AU133","v":0},{"$f":"INPUT!AW133","v":"ABS"},{"$f":"INPUT!AX133","v":"ABS"},{"$f":"INPUT!BA133","v":"ABS"},{"$f":"INPUT!BB133","v":"ABS"},{"$f":"INPUT!BD133","v":"*"},{"$f":"INPUT!BE133","v":0},{"$f":"INPUT!BG133","v":"ABS"},{"$f":"INPUT!BH133","v":"ABS"},{"$f":"INPUT!BK133","v":"ABS"},{"$f":"INPUT!BL133","v":"ABS"},{"$f":"INPUT!BN133","v":"*"},{"$f":"INPUT!BO133","v":"-"},{"$f":"INPUT!BP133","v":0},{"$f":"INPUT!BR133","v":"ABS"},{"$f":"INPUT!BS133","v":"ABS"},{"$f":"INPUT!BV133","v":"ABS"},{"$f":"INPUT!BW133","v":"ABS"},{"$f":"INPUT!BY133","v":""},"","ABS","",null,null,null,null,null,{"$f":"AP133&\"_\"&COUNTIF($AP$5:AP133,AP133)","v":"-_126"}]
[null,{"$f":"INPUT!F134","v":0},{"$f":"INPUT!C134","v":0},{"$f":"INPUT!D134","v":"00:00:00"},{"$f":"INPUT!E134","v":0},{"$f":"INPUT!G134","v":"0011"},{"$f":"INPUT!I134","v":"ABS"},{"$f":"INPUT!J134","v":"ABS"},{"$f":"INPUT!M134","v":"ABS"},{"$f":"INPUT!N134","v":"ABS"},{"$f":"INPUT!P134","v":"*"},{"$f":"INPUT!Q134","v":"0031"},{"$f":"INPUT!S134","v":"ABS"},{"$f":"INPUT!T134","v":"ABS"},{"$f":"INPUT!W134","v":"ABS"},{"$f":"INPUT!X134","v":"ABS"},{"$f":"INPUT!Z134","v":"*"},{"$f":"INPUT!AA134","v":"0051"},{"$f":"INPUT!AC134","v":"ABS"},{"$f":"INPUT!AD134","v":"ABS"},{"$f":"INPUT!AG134","v":"ABS"},{"$f":"INPUT!AH134","v":"ABS"},{"$f":"INPUT!AJ134","v":"*"},{"$f":"INPUT!AK134","v":0},{"$f":"INPUT!AM134","v":"ABS"},{"$f":"INPUT!AN134","v":"ABS"},{"$f":"INPUT!AQ134","v":"ABS"},{"$f":"INPUT!AR134","v":"ABS"},{"$f":"INPUT!AT134","v":"*"},{"$f":"INPUT!AU134","v":0},{"$f":"INPUT!AW134","v":"ABS"},{"$f":"INPUT!AX134","v":"ABS"},{"$f":"INPUT!BA134","v":"ABS"},{"$f":"INPUT!BB134","v":"ABS"},{"$f":"INPUT!BD134","v":"*"},{"$f":"INPUT!BE134","v":0},{"$f":"INPUT!BG134","v":"ABS"},{"$f":"INPUT!BH134","v":"ABS"},{"$f":"INPUT!BK134","v":"ABS"},{"$f":"INPUT!BL134","v":"ABS"},{"$f":"INPUT!BN134","v":"*"},{"$f":"INPUT!BO134","v":"-"},{"$f":"INPUT!BP134","v":0},{"$f":"INPUT!BR134","v":"ABS"},{"$f":"INPUT!BS134","v":"ABS"},{"$f":"INPUT!BV134","v":"ABS"},{"$f":"INPUT!BW134","v":"ABS"},{"$f":"INPUT!BY134","v":""},{"$f":"IF(OR(G134=\"NG\",M134=\"NG\",S134=\"NG\",Y134=\"NG\",AE134=\"NG\",AK134=\"NG\"),\"NG\",\"\")","v":""},{"$f":"IF(OR(H134=\"ABS\",N134=\"ABS\",T134=\"ABS\",Z134=\"ABS\",AF134=\"ABS\",AL134=\"ABS\"),\"ABS\",\"\")","v":"ABS"},{"$f":"IF(OR(J134=\"-\",P134=\"-\",V134=\"-\",AB134=\"-\",AH134=\"-\",AN134=\"NG\",AW134=\"NG\"),\"W\",\"\")","v":""},null,null,null,null,null,{"$f":"AP134&\"_\"&COUNTIF($AP$5:AP134,AP134)","v":"-_127"}]
[null,{"$f":"INPUT!F135","v":0},{"$f":"INPUT!C135","v":0},{"$f":"INPUT!D135","v":"00:00:00"},{"$f":"INPUT!E135","v":0},{"$f":"INPUT!G135","v":"0011"},{"$f":"INPUT!I135","v":"ABS"},{"$f":"INPUT!J135","v":"ABS"},{"$f":"INPUT!M135","v":"ABS"},{"$f":"INPUT!N135","v":"ABS"},{"$f":"INPUT!P135","v":"*"},{"$f":"INPUT!Q135","v":"0031"},{"$f":"INPUT!S135","v":"ABS"},{"$f":"INPUT!T135","v":"ABS"},{"$f":"INPUT!W135","v":"ABS"},{"$f":"INPUT!X135","v":"ABS"},{"$f":"INPUT!Z135","v":"*"},{"$f":"INPUT!AA135","v":"0051"},{"$f":"INPUT!AC135","v":"ABS"},{"$f":"INPUT!AD135","v":"ABS"},{"$f":"INPUT!AG135","v":"ABS"},{"$f":"INPUT!AH135","v":"ABS"},{"$f":"INPUT!AJ135","v":"*"},{"$f":"INPUT!AK135","v":0},{"$f":"INPUT!AM135","v":"ABS"},{"$f":"INPUT!AN135","v":"ABS"},{"$f":"INPUT!AQ135","v":"ABS"},{"$f":"INPUT!AR135","v":"ABS"},{"$f":"INPUT!AT135","v":"*"},{"$f":"INPUT!AU135","v":0},{"$f":"INPUT!AW135","v":"ABS"},{"$f":"INPUT!AX135","v":"ABS"},{"$f":"INPUT!BA135","v":"ABS"},{"$f":"INPUT!BB135","v":"ABS"},{"$f":"INPUT!BD135","v":"*"},{"$f":"INPUT!BE135","v":0},{"$f":"INPUT!BG135","v":"ABS"},{"$f":"INPUT!BH135","v":"ABS"},{"$f":"INPUT!BK135","v":"ABS"},{"$f":"INPUT!BL135","v":"ABS"},{"$f":"INPUT!BN135","v":"*"},{"$f":"INPUT!BO135","v":"-"},{"$f":"INPUT!BP135","v":0},{"$f":"INPUT!BR135","v":"ABS"},{"$f":"INPUT!BS135","v":"ABS"},{"$f":"INPUT!BV135","v":"ABS"},{"$f":"INPUT!BW135","v":"ABS"},{"$f":"INPUT!BY135","v":""},"","ABS","",null,null,null,null,null,{"$f":"AP135&\"_\"&COUNTIF($AP$5:AP135,AP135)","v":"-_128"}]
[null,{"$f":"INPUT!F136","v":0},{"$f":"INPUT!C136","v":0},{"$f":"INPUT!D136","v":"00:00:00"},{"$f":"INPUT!E136","v":0},{"$f":"INPUT!G136","v":"0011"},{"$f":"INPUT!I136","v":"ABS"},{"$f":"INPUT!J136","v":"ABS"},{"$f":"INPUT!M136","v":"ABS"},{"$f":"INPUT!N136","v":"ABS"},{"$f":"INPUT!P136","v":"*"},{"$f":"INPUT!Q136","v":"0031"},{"$f":"INPUT!S136","v":"ABS"},{"$f":"INPUT!T136","v":"ABS"},{"$f":"INPUT!W136","v":"ABS"},{"$f":"INPUT!X136","v":"ABS"},{"$f":"INPUT!Z136","v":"*"},{"$f":"INPUT!AA136","v":"0051"},{"$f":"INPUT!AC136","v":"ABS"},{"$f":"INPUT!AD136","v":"ABS"},{"$f":"INPUT!AG136","v":"ABS"},{"$f":"INPUT!AH136","v":"ABS"},{"$f":"INPUT!AJ136","v":"*"},{"$f":"INPUT!AK136","v":0},{"$f":"INPUT!AM136","v":"ABS"},{"$f":"INPUT!AN136","v":"ABS"},{"$f":"INPUT!AQ136","v":"ABS"},{"$f":"INPUT!AR136","v":"ABS"},{"$f":"INPUT!AT136","v":"*"},{"$f":"INPUT!AU136","v":0},{"$f":"INPUT!AW136","v":"ABS"},{"$f":"INPUT!AX136","v":"ABS"},{"$f":"INPUT!BA136","v":"ABS"},{"$f":"INPUT!BB136","v":"ABS"},{"$f":"INPUT!BD136","v":"*"},{"$f":"INPUT!BE136","v":0},{"$f":"INPUT!BG136","v":"ABS"},{"$f":"INPUT!BH136","v":"ABS"},{"$f":"INPUT!BK136","v":"ABS"},{"$f":"INPUT!BL136","v":"ABS"},{"$f":"INPUT!BN136","v":"*"},{"$f":"INPUT!BO136","v":"-"},{"$f":"INPUT!BP136","v":0},{"$f":"INPUT!BR136","v":"ABS"},{"$f":"INPUT!BS136","v":"ABS"},{"$f":"INPUT!BV136","v":"ABS"},{"$f":"INPUT!BW136","v":"ABS"},{"$f":"INPUT!BY136","v":""},"","ABS","",null,null,null,null,null,{"$f":"AP136&\"_\"&COUNTIF($AP$5:AP136,AP136)","v":"-_129"}]
[null,{"$f":"INPUT!F137","v":0},{"$f":"INPUT!C137","v":0},{"$f":"INPUT!D137","v":"00:00:00"},{"$f":"INPUT!E137","v":0},{"$f":"INPUT!G137","v":"0011"},{"$f":"INPUT!I137","v":"ABS"},{"$f":"INPUT!J137","v":"ABS"},{"$f":"INPUT!M137","v":"ABS"},{"$f":"INPUT!N137","v":"ABS"},{"$f":"INPUT!P137","v":"*"},{"$f":"INPUT!Q137","v":"0031"},{"$f":"INPUT!S137","v":"ABS"},{"$f":"INPUT!T137","v":"ABS"},{"$f":"INPUT!W137","v":"ABS"},{"$f":"INPUT!X137","v":"ABS"},{"$f":"INPUT!Z137","v":"*"},{"$f":"INPUT!AA137","v":"0051"},{"$f":"INPUT!AC137","v":"ABS"},{"$f":"INPUT!AD137","v":"ABS"},{"$f":"INPUT!AG137","v":"ABS"},{"$f":"INPUT!AH137","v":"ABS"},{"$f":"INPUT!AJ137","v":"*"},{"$f":"INPUT!AK137","v":0},{"$f":"INPUT!AM137","v":"ABS"},{"$f":"INPUT!AN137","v":"ABS"},{"$f":"INPUT!AQ137","v":"ABS"},{"$f":"INPUT!AR137","v":"ABS"},{"$f":"INPUT!AT137","v":"*"},{"$f":"INPUT!AU137","v":0},{"$f":"INPUT!AW137","v":"ABS"},{"$f":"INPUT!AX137","v":"ABS"},{"$f":"INPUT!BA137","v":"ABS"},{"$f":"INPUT!BB137","v":"ABS"},{"$f":"INPUT!BD137","v":"*"},{"$f":"INPUT!BE137","v":0},{"$f":"INPUT!BG137","v":"ABS"},{"$f":"INPUT!BH137","v":"ABS"},{"$f":"INPUT!BK137","v":"ABS"},{"$f":"INPUT!BL137","v":"ABS"},{"$f":"INPUT!BN137","v":"*"},{"$f":"INPUT!BO137","v":"-"},{"$f":"INPUT!BP137","v":0},{"$f":"INPUT!BR137","v":"ABS"},{"$f":"INPUT!BS137","v":"ABS"},{"$f":"INPUT!BV137","v":"ABS"},{"$f":"INPUT!BW137","v":"ABS"},{"$f":"INPUT!BY137","v":""},"","ABS","",null,null,null,null,null,{"$f":"AP137&\"_\"&COUNTIF($AP$5:AP137,AP137)","v":"-_130"}]
[null,{"$f":"INPUT!F138","v":0},{"$f":"INPUT!C138","v":0},{"$f":"INPUT!D138","v":"00:00:00"},{"$f":"INPUT!E138","v":0},{"$f":"INPUT!G138","v":"0011"},{"$f":"INPUT!I138","v":"ABS"},{"$f":"INPUT!J138","v":"ABS"},{"$f":"INPUT!M138","v":"ABS"},{"$f":"INPUT!N138","v":"ABS"},{"$f":"INPUT!P138","v":"*"},{"$f":"INPUT!Q138","v":"0031"},{"$f":"INPUT!S138","v":"ABS"},{"$f":"INPUT!T138","v":"ABS"},{"$f":"INPUT!W138","v":"ABS"},{"$f":"INPUT!X138","v":"ABS"},{"$f":"INPUT!Z138","v":"*"},{"$f":"INPUT!AA138","v":"0051"},{"$f":"INPUT!AC138","v":"ABS"},{"$f":"INPUT!AD138","v":"ABS"},{"$f":"INPUT!AG138","v":"ABS"},{"$f":"INPUT!AH138","v":"ABS"},{"$f":"INPUT!AJ138","v":"*"},{"$f":"INPUT!AK138","v":0},{"$f":"INPUT!AM138","v":"ABS"},{"$f":"INPUT!AN138","v":"ABS"},{"$f":"INPUT!AQ138","v":"ABS"},{"$f":"INPUT!AR138","v":"ABS"},{"$f":"INPUT!AT138","v":"*"},{"$f":"INPUT!AU138","v":0},{"$f":"INPUT!AW138","v":"ABS"},{"$f":"INPUT!AX138","v":"ABS"},{"$f":"INPUT!BA138","v":"ABS"},{"$f":"INPUT!BB138","v":"ABS"},{"$f":"INPUT!BD138","v":"*"},{"$f":"INPUT!BE138","v":0},{"$f":"INPUT!BG138","v":"ABS"},{"$f":"INPUT!BH138","v":"ABS"},{"$f":"INPUT!BK138","v":"ABS"},{"$f":"INPUT!BL138","v":"ABS"},{"$f":"INPUT!BN138","v":"*"},{"$f":"INPUT!BO138","v":"-"},{"$f":"INPUT!BP138","v":0},{"$f":"INPUT!BR138","v":"ABS"},{"$f":"INPUT!BS138","v":"ABS"},{"$f":"INPUT!BV138","v":"ABS"},{"$f":"INPUT!BW138","v":"ABS"},{"$f":"INPUT!BY138","v":""},"","ABS","",null,null,null,null,null,{"$f":"AP138&\"_\"&COUNTIF($AP$5:AP138,AP138)","v":"-_131"}]
[null,{"$f":"INPUT!F139","v":0},{"$f":"INPUT!C139","v":0},{"$f":"INPUT!D139","v":"00:00:00"},{"$f":"INPUT!E139","v":0},{"$f":"INPUT!G139","v":"0011"},{"$f":"INPUT!I139","v":"ABS"},{"$f":"INPUT!J139","v":"ABS"},{"$f":"INPUT!M139","v":"ABS"},{"$f":"INPUT!N139","v":"ABS"},{"$f":"INPUT!P139","v":"*"},{"$f":"INPUT!Q139","v":"0031"},{"$f":"INPUT!S139","v":"ABS"},{"$f":"INPUT!T139","v":"ABS"},{"$f":"INPUT!W139","v":"ABS"},{"$f":"INPUT!X139","v":"ABS"},{"$f":"INPUT!Z139","v":"*"},{"$f":"INPUT!AA139","v":"0051"},{"$f":"INPUT!AC139","v":"ABS"},{"$f":"INPUT!AD139","v":"ABS"},{"$f":"INPUT!AG139","v":"ABS"},{"$f":"INPUT!AH139","v":"ABS"},{"$f":"INPUT!AJ139","v":"*"},{"$f":"INPUT!AK139","v":0},{"$f":"INPUT!AM139","v":"ABS"},{"$f":"INPUT!AN139","v":"ABS"},{"$f":"INPUT!AQ139","v":"ABS"},{"$f":"INPUT!AR139","v":"ABS"},{"$f":"INPUT!AT139","v":"*"},{"$f":"INPUT!AU139","v":0},{"$f":"INPUT!AW139","v":"ABS"},{"$f":"INPUT!AX139","v":"ABS"},{"$f":"INPUT!BA139","v":"ABS"},{"$f":"INPUT!BB139","v":"ABS"},{"$f":"INPUT!BD139","v":"*"},{"$f":"INPUT!BE139","v":0},{"$f":"INPUT!BG139","v":"ABS"},{"$f":"INPUT!BH139","v":"ABS"},{"$f":"INPUT!BK139","v":"ABS"},{"$f":"INPUT!BL139","v":"ABS"},{"$f":"INPUT!BN139","v":"*"},{"$f":"INPUT!BO139","v":"-"},{"$f":"INPUT!BP139","v":0},{"$f":"INPUT!BR139","v":"ABS"},{"$f":"INPUT!BS139","v":"ABS"},{"$f":"INPUT!BV139","v":"ABS"},{"$f":"INPUT!BW139","v":"ABS"},{"$f":"INPUT!BY139","v":""},"","ABS","",null,null,null,null,null,{"$f":"AP139&\"_\"&COUNTIF($AP$5:AP139,AP139)","v":"-_132"}]
[null,{"$f":"INPUT!F140","v":0},{"$f":"INPUT!C140","v":0},{"$f":"INPUT!D140","v":"00:00:00"},{"$f":"INPUT!E140","v":0},{"$f":"INPUT!G140","v":"0011"},{"$f":"INPUT!I140","v":"ABS"},{"$f":"INPUT!J140","v":"ABS"},{"$f":"INPUT!M140","v":"ABS"},{"$f":"INPUT!N140","v":"ABS"},{"$f":"INPUT!P140","v":"*"},{"$f":"INPUT!Q140","v":"0031"},{"$f":"INPUT!S140","v":"ABS"},{"$f":"INPUT!T140","v":"ABS"},{"$f":"INPUT!W140","v":"ABS"},{"$f":"INPUT!X140","v":"ABS"},{"$f":"INPUT!Z140","v":"*"},{"$f":"INPUT!AA140","v":"0051"},{"$f":"INPUT!AC140","v":"ABS"},{"$f":"INPUT!AD140","v":"ABS"},{"$f":"INPUT!AG140","v":"ABS"},{"$f":"INPUT!AH140","v":"ABS"},{"$f":"INPUT!AJ140","v":"*"},{"$f":"INPUT!AK140","v":0},{"$f":"INPUT!AM140","v":"ABS"},{"$f":"INPUT!AN140","v":"ABS"},{"$f":"INPUT!AQ140","v":"ABS"},{"$f":"INPUT!AR140","v":"ABS"},{"$f":"INPUT!AT140","v":"*"},{"$f":"INPUT!AU140","v":0},{"$f":"INPUT!AW140","v":"ABS"},{"$f":"INPUT!AX140","v":"ABS"},{"$f":"INPUT!BA140","v":"ABS"},{"$f":"INPUT!BB140","v":"ABS"},{"$f":"INPUT!BD140","v":"*"},{"$f":"INPUT!BE140","v":0},{"$f":"INPUT!BG140","v":"ABS"},{"$f":"INPUT!BH140","v":"ABS"},{"$f":"INPUT!BK140","v":"ABS"},{"$f":"INPUT!BL140","v":"ABS"},{"$f":"INPUT!BN140","v":"*"},{"$f":"INPUT!BO140","v":"-"},{"$f":"INPUT!BP140","v":0},{"$f":"INPUT!BR140","v":"ABS"},{"$f":"INPUT!BS140","v":"ABS"},{"$f":"INPUT!BV140","v":"ABS"},{"$f":"INPUT!BW140","v":"ABS"},{"$f":"INPUT!BY140","v":""},"","ABS","",null,null,null,null,null,{"$f":"AP140&\"_\"&COUNTIF($AP$5:AP140,AP140)","v":"-_133"}]
[null,{"$f":"INPUT!F141","v":0},{"$f":"INPUT!C141","v":0},{"$f":"INPUT!D141","v":"00:00:00"},{"$f":"INPUT!E141","v":0},{"$f":"INPUT!G141","v":"0011"},{"$f":"INPUT!I141","v":"ABS"},{"$f":"INPUT!J141","v":"ABS"},{"$f":"INPUT!M141","v":"ABS"},{"$f":"INPUT!N141","v":"ABS"},{"$f":"INPUT!P141","v":"*"},{"$f":"INPUT!Q141","v":"0031"},{"$f":"INPUT!S141","v":"ABS"},{"$f":"INPUT!T141","v":"ABS"},{"$f":"INPUT!W141","v":"ABS"},{"$f":"INPUT!X141","v":"ABS"},{"$f":"INPUT!Z141","v":"*"},{"$f":"INPUT!AA141","v":"0051"},{"$f":"INPUT!AC141","v":"ABS"},{"$f":"INPUT!AD141","v":"ABS"},{"$f":"INPUT!AG141","v":"ABS"},{"$f":"INPUT!AH141","v":"ABS"},{"$f":"INPUT!AJ141","v":"*"},{"$f":"INPUT!AK141","v":0},{"$f":"INPUT!AM141","v":"ABS"},{"$f":"INPUT!AN141","v":"ABS"},{"$f":"INPUT!AQ141","v":"ABS"},{"$f":"INPUT!AR141","v":"ABS"},{"$f":"INPUT!AT141","v":"*"},{"$f":"INPUT!AU141","v":0},{"$f":"INPUT!AW141","v":"ABS"},{"$f":"INPUT!AX141","v":"ABS"},{"$f":"INPUT!BA141","v":"ABS"},{"$f":"INPUT!BB141","v":"ABS"},{"$f":"INPUT!BD141","v":"*"},{"$f":"INPUT!BE141","v":0},{"$f":"INPUT!BG141","v":"ABS"},{"$f":"INPUT!BH141","v":"ABS"},{"$f":"INPUT!BK141","v":"ABS"},{"$f":"INPUT!BL141","v":"ABS"},{"$f":"INPUT!BN141","v":"*"},{"$f":"INPUT!BO141","v":"-"},{"$f":"INPUT!BP141","v":0},{"$f":"INPUT!BR141","v":"ABS"},{"$f":"INPUT!BS141","v":"ABS"},{"$f":"INPUT!BV141","v":"ABS"},{"$f":"INPUT!BW141","v":"ABS"},{"$f":"INPUT!BY141","v":""},"","ABS","",null,null,null,null,null,{"$f":"AP141&\"_\"&COUNTIF($AP$5:AP141,AP141)","v":"-_134"}]
[null,{"$f":"INPUT!F142","v":0},{"$f":"INPUT!C142","v":0},{"$f":"INPUT!D142","v":"00:00:00"},{"$f":"INPUT!E142","v":0},{"$f":"INPUT!G142","v":"0011"},{"$f":"INPUT!I142","v":"ABS"},{"$f":"INPUT!J142","v":"ABS"},{"$f":"INPUT!M142","v":"ABS"},{"$f":"INPUT!N142","v":"ABS"},{"$f":"INPUT!P142","v":"*"},{"$f":"INPUT!Q142","v":"0031"},{"$f":"INPUT!S142","v":"ABS"},{"$f":"INPUT!T142","v":"ABS"},{"$f":"INPUT!W142","v":"ABS"},{"$f":"INPUT!X142","v":"ABS"},{"$f":"INPUT!Z142","v":"*"},{"$f":"INPUT!AA142","v":"0051"},{"$f":"INPUT!AC142","v":"ABS"},{"$f":"INPUT!AD142","v":"ABS"},{"$f":"INPUT!AG142","v":"ABS"},{"$f":"INPUT!AH142","v":"ABS"},{"$f":"INPUT!AJ142","v":"*"},{"$f":"INPUT!AK142","v":0},{"$f":"INPUT!AM142","v":"ABS"},{"$f":"INPUT!AN142","v":"ABS"},{"$f":"INPUT!AQ142","v":"ABS"},{"$f":"INPUT!AR142","v":"ABS"},{"$f":"INPUT!AT142","v":"*"},{"$f":"INPUT!AU142","v":0},{"$f":"INPUT!AW142","v":"ABS"},{"$f":"INPUT!AX142","v":"ABS"},{"$f":"INPUT!BA142","v":"ABS"},{"$f":"INPUT!BB142","v":"ABS"},{"$f":"INPUT!BD142","v":"*"},{"$f":"INPUT!BE142","v":0},{"$f":"INPUT!BG142","v":"ABS"},{"$f":"INPUT!BH142","v":"ABS"},{"$f":"INPUT!BK142","v":"ABS"},{"$f":"INPUT!BL142","v":"ABS"},{"$f":"INPUT!BN142","v":"*"},{"$f":"INPUT!BO142","v":"-"},{"$f":"INPUT!BP142","v":0},{"$f":"INPUT!BR142","v":"ABS"},{"$f":"INPUT!BS142","v":"ABS"},{"$f":"INPUT!BV142","v":"ABS"},{"$f":"INPUT!BW142","v":"ABS"},{"$f":"INPUT!BY142","v":""},"","ABS","",null,null,null,null,null,{"$f":"AP142&\"_\"&COUNTIF($AP$5:AP142,AP142)","v":"-_135"}]
[null,{"$f":"INPUT!F143","v":0},{"$f":"INPUT!C143","v":0},{"$f":"INPUT!D143","v":"00:00:00"},{"$f":"INPUT!E143","v":0},{"$f":"INPUT!G143","v":"0011"},{"$f":"INPUT!I143","v":"ABS"},{"$f":"INPUT!J143","v":"ABS"},{"$f":"INPUT!M143","v":"ABS"},{"$f":"INPUT!N143","v":"ABS"},{"$f":"INPUT!P143","v":"*"},{"$f":"INPUT!Q143","v":"0031"},{"$f":"INPUT!S143","v":"ABS"},{"$f":"INPUT!T143","v":"ABS"},{"$f":"INPUT!W143","v":"ABS"},{"$f":"INPUT!X143","v":"ABS"},{"$f":"INPUT!Z143","v":"*"},{"$f":"INPUT!AA143","v":"0051"},{"$f":"INPUT!AC143","v":"ABS"},{"$f":"INPUT!AD143","v":"ABS"},{"$f":"INPUT!AG143","v":"ABS"},{"$f":"INPUT!AH143","v":"ABS"},{"$f":"INPUT!AJ143","v":"*"},{"$f":"INPUT!AK143","v":0},{"$f":"INPUT!AM143","v":"ABS"},{"$f":"INPUT!AN143","v":"ABS"},{"$f":"INPUT!AQ143","v":"ABS"},{"$f":"INPUT!AR143","v":"ABS"},{"$f":"INPUT!AT143","v":"*"},{"$f":"INPUT!AU143","v":0},{"$f":"INPUT!AW143","v":"ABS"},{"$f":"INPUT!AX143","v":"ABS"},{"$f":"INPUT!BA143","v":"ABS"},{"$f":"INPUT!BB143","v":"ABS"},{"$f":"INPUT!BD143","v":"*"},{"$f":"INPUT!BE143","v":0},{"$f":"INPUT!BG143","v":"ABS"},{"$f":"INPUT!BH143","v":"ABS"},{"$f":"INPUT!BK143","v":"ABS"},{"$f":"INPUT!BL143","v":"ABS"},{"$f":"INPUT!BN143","v":"*"},{"$f":"INPUT!BO143","v":"-"},{"$f":"INPUT!BP143","v":0},{"$f":"INPUT!BR143","v":"ABS"},{"$f":"INPUT!BS143","v":"ABS"},{"$f":"INPUT!BV143","v":"ABS"},{"$f":"INPUT!BW143","v":"ABS"},{"$f":"INPUT!BY143","v":""},"","ABS","",null,null,null,null,null,{"$f":"AP143&\"_\"&COUNTIF($AP$5:AP143,AP143)","v":"-_136"}]
[null,{"$f":"INPUT!F144","v":0},{"$f":"INPUT!C144","v":0},{"$f":"INPUT!D144","v":"00:00:00"},{"$f":"INPUT!E144","v":0},{"$f":"INPUT!G144","v":"0011"},{"$f":"INPUT!I144","v":"ABS"},{"$f":"INPUT!J144","v":"ABS"},{"$f":"INPUT!M144","v":"ABS"},{"$f":"INPUT!N144","v":"ABS"},{"$f":"INPUT!P144","v":"*"},{"$f":"INPUT!Q144","v":"0031"},{"$f":"INPUT!S144","v":"ABS"},{"$f":"INPUT!T144","v":"ABS"},{"$f":"INPUT!W144","v":"ABS"},{"$f":"INPUT!X144","v":"ABS"},{"$f":"INPUT!Z144","v":"*"},{"$f":"INPUT!AA144","v":"0051"},{"$f":"INPUT!AC144","v":"ABS"},{"$f":"INPUT!AD144","v":"ABS"},{"$f":"INPUT!AG144","v":"ABS"},{"$f":"INPUT!AH144","v":"ABS"},{"$f":"INPUT!AJ144","v":"*"},{"$f":"INPUT!AK144","v":0},{"$f":"INPUT!AM144","v":"ABS"},{"$f":"INPUT!AN144","v":"ABS"},{"$f":"INPUT!AQ144","v":"ABS"},{"$f":"INPUT!AR144","v":"ABS"},{"$f":"INPUT!AT144","v":"*"},{"$f":"INPUT!AU144","v":0},{"$f":"INPUT!AW144","v":"ABS"},{"$f":"INPUT!AX144","v":"ABS"},{"$f":"INPUT!BA144","v":"ABS"},{"$f":"INPUT!BB144","v":"ABS"},{"$f":"INPUT!BD144","v":"*"},{"$f":"INPUT!BE144","v":0},{"$f":"INPUT!BG144","v":"ABS"},{"$f":"INPUT!BH144","v":"ABS"},{"$f":"INPUT!BK144","v":"ABS"},{"$f":"INPUT!BL144","v":"ABS"},{"$f":"INPUT!BN144","v":"*"},{"$f":"INPUT!BO144","v":"-"},{"$f":"INPUT!BP144","v":0},{"$f":"INPUT!BR144","v":"ABS"},{"$f":"INPUT!BS144","v":"ABS"},{"$f":"INPUT!BV144","v":"ABS"},{"$f":"INPUT!BW144","v":"ABS"},{"$f":"INPUT!BY144","v":""},"","ABS","",null,null,null,null,null,{"$f":"AP144&\"_\"&COUNTIF($AP$5:AP144,AP144)","v":"-_137"}]
[null,{"$f":"INPUT!F145","v":0},{"$f":"INPUT!C145","v":0},{"$f":"INPUT!D145","v":"00:00:00"},{"$f":"INPUT!E145","v":0},{"$f":"INPUT!G145","v":"0011"},{"$f":"INPUT!I145","v":"ABS"},{"$f":"INPUT!J145","v":"ABS"},{"$f":"INPUT!M145","v":"ABS"},{"$f":"INPUT!N145","v":"ABS"},{"$f":"INPUT!P145","v":"*"},{"$f":"INPUT!Q145","v":"0031"},{"$f":"INPUT!S145","v":"ABS"},{"$f":"INPUT!T145","v":"ABS"},{"$f":"INPUT!W145","v":"ABS"},{"$f":"INPUT!X145","v":"ABS"},{"$f":"INPUT!Z145","v":"*"},{"$f":"INPUT!AA145","v":"0051"},{"$f":"INPUT!AC145","v":"ABS"},{"$f":"INPUT!AD145","v":"ABS"},{"$f":"INPUT!AG145","v":"ABS"},{"$f":"INPUT!AH145","v":"ABS"},{"$f":"INPUT!AJ145","v":"*"},{"$f":"INPUT!AK145","v":0},{"$f":"INPUT!AM145","v":"ABS"},{"$f":"INPUT!AN145","v":"ABS"},{"$f":"INPUT!AQ145","v":"ABS"},{"$f":"INPUT!AR145","v":"ABS"},{"$f":"INPUT!AT145","v":"*"},{"$f":"INPUT!AU145","v":0},{"$f":"INPUT!AW145","v":"ABS"},{"$f":"INPUT!AX145","v":"ABS"},{"$f":"INPUT!BA145","v":"ABS"},{"$f":"INPUT!BB145","v":"ABS"},{"$f":"INPUT!BD145","v":"*"},{"$f":"INPUT!BE145","v":0},{"$f":"INPUT!BG145","v":"ABS"},{"$f":"INPUT!BH145","v":"ABS"},{"$f":"INPUT!BK145","v":"ABS"},{"$f":"INPUT!BL145","v":"ABS"},{"$f":"INPUT!BN145","v":"*"},{"$f":"INPUT!BO145","v":"-"},{"$f":"INPUT!BP145","v":0},{"$f":"INPUT!BR145","v":"ABS"},{"$f":"INPUT!BS145","v":"ABS"},{"$f":"INPUT!BV145","v":"ABS"},{"$f":"INPUT!BW145","v":"ABS"},{"$f":"INPUT!BY145","v":""},"","ABS","",null,null,null,null,null,{"$f":"AP145&\"_\"&COUNTIF($AP$5:AP145,AP145)","v":"-_138"}]
[null,{"$f":"INPUT!F146","v":0},{"$f":"INPUT!C146","v":0},{"$f":"INPUT!D146","v":"00:00:00"},{"$f":"INPUT!E146","v":0},{"$f":"INPUT!G146","v":"0011"},{"$f":"INPUT!I146","v":"ABS"},{"$f":"INPUT!J146","v":"ABS"},{"$f":"INPUT!M146","v":"ABS"},{"$f":"INPUT!N146","v":"ABS"},{"$f":"INPUT!P146","v":"*"},{"$f":"INPUT!Q146","v":"0031"},{"$f":"INPUT!S146","v":"ABS"},{"$f":"INPUT!T146","v":"ABS"},{"$f":"INPUT!W146","v":"ABS"},{"$f":"INPUT!X146","v":"ABS"},{"$f":"INPUT!Z146","v":"*"},{"$f":"INPUT!AA146","v":"0051"},{"$f":"INPUT!AC146","v":"ABS"},{"$f":"INPUT!AD146","v":"ABS"},{"$f":"INPUT!AG146","v":"ABS"},{"$f":"INPUT!AH146","v":"ABS"},{"$f":"INPUT!AJ146","v":"*"},{"$f":"INPUT!AK146","v":0},{"$f":"INPUT!AM146","v":"ABS"},{"$f":"INPUT!AN146","v":"ABS"},{"$f":"INPUT!AQ146","v":"ABS"},{"$f":"INPUT!AR146","v":"ABS"},{"$f":"INPUT!AT146","v":"*"},{"$f":"INPUT!AU146","v":0},{"$f":"INPUT!AW146","v":"ABS"},{"$f":"INPUT!AX146","v":"ABS"},{"$f":"INPUT!BA146","v":"ABS"},{"$f":"INPUT!BB146","v":"ABS"},{"$f":"INPUT!BD146","v":"*"},{"$f":"INPUT!BE146","v":0},{"$f":"INPUT!BG146","v":"ABS"},{"$f":"INPUT!BH146","v":"ABS"},{"$f":"INPUT!BK146","v":"ABS"},{"$f":"INPUT!BL146","v":"ABS"},{"$f":"INPUT!BN146","v":"*"},{"$f":"INPUT!BO146","v":"-"},{"$f":"INPUT!BP146","v":0},{"$f":"INPUT!BR146","v":"ABS"},{"$f":"INPUT!BS146","v":"ABS"},{"$f":"INPUT!BV146","v":"ABS"},{"$f":"INPUT!BW146","v":"ABS"},{"$f":"INPUT!BY146","v":""},"","ABS","",null,null,null,null,null,{"$f":"AP146&\"_\"&COUNTIF($AP$5:AP146,AP146)","v":"-_139"}]
[null,{"$f":"INPUT!F147","v":0},{"$f":"INPUT!C147","v":0},{"$f":"INPUT!D147","v":"00:00:00"},{"$f":"INPUT!E147","v":0},{"$f":"INPUT!G147","v":"0011"},{"$f":"INPUT!I147","v":"ABS"},{"$f":"INPUT!J147","v":"ABS"},{"$f":"INPUT!M147","v":"ABS"},{"$f":"INPUT!N147","v":"ABS"},{"$f":"INPUT!P147","v":"*"},{"$f":"INPUT!Q147","v":"0031"},{"$f":"INPUT!S147","v":"ABS"},{"$f":"INPUT!T147","v":"ABS"},{"$f":"INPUT!W147","v":"ABS"},{"$f":"INPUT!X147","v":"ABS"},{"$f":"INPUT!Z147","v":"*"},{"$f":"INPUT!AA147","v":"0051"},{"$f":"INPUT!AC147","v":"ABS"},{"$f":"INPUT!AD147","v":"ABS"},{"$f":"INPUT!AG147","v":"ABS"},{"$f":"INPUT!AH147","v":"ABS"},{"$f":"INPUT!AJ147","v":"*"},{"$f":"INPUT!AK147","v":0},{"$f":"INPUT!AM147","v":"ABS"},{"$f":"INPUT!AN147","v":"ABS"},{"$f":"INPUT!AQ147","v":"ABS"},{"$f":"INPUT!AR147","v":"ABS"},{"$f":"INPUT!AT147","v":"*"},{"$f":"INPUT!AU147","v":0},{"$f":"INPUT!AW147","v":"ABS"},{"$f":"INPUT!AX147","v":"ABS"},{"$f":"INPUT!BA147","v":"ABS"},{"$f":"INPUT!BB147","v":"ABS"},{"$f":"INPUT!BD147","v":"*"},{"$f":"INPUT!BE147","v":0},{"$f":"INPUT!BG147","v":"ABS"},{"$f":"INPUT!BH147","v":"ABS"},{"$f":"INPUT!BK147","v":"ABS"},{"$f":"INPUT!BL147","v":"ABS"},{"$f":"INPUT!BN147","v":"*"},{"$f":"INPUT!BO147","v":"-"},{"$f":"INPUT!BP147","v":0},{"$f":"INPUT!BR147","v":"ABS"},{"$f":"INPUT!BS147","v":"ABS"},{"$f":"INPUT!BV147","v":"ABS"},{"$f":"INPUT!BW147","v":"ABS"},{"$f":"INPUT!BY147","v":""},"","ABS","",null,null,null,null,null,{"$f":"AP147&\"_\"&COUNTIF($AP$5:AP147,AP147)","v":"-_140"}]
[null,{"$f":"INPUT!F148","v":0},{"$f":"INPUT!C148","v":0},{"$f":"INPUT!D148","v":"00:00:00"},{"$f":"INPUT!E148","v":0},{"$f":"INPUT!G148","v":"0011"},{"$f":"INPUT!I148","v":"ABS"},{"$f":"INPUT!J148","v":"ABS"},{"$f":"INPUT!M148","v":"ABS"},{"$f":"INPUT!N148","v":"ABS"},{"$f":"INPUT!P148","v":"*"},{"$f":"INPUT!Q148","v":"0031"},{"$f":"INPUT!S148","v":"ABS"},{"$f":"INPUT!T148","v":"ABS"},{"$f":"INPUT!W148","v":"ABS"},{"$f":"INPUT!X148","v":"ABS"},{"$f":"INPUT!Z148","v":"*"},{"$f":"INPUT!AA148","v":"0051"},{"$f":"INPUT!AC148","v":"ABS"},{"$f":"INPUT!AD148","v":"ABS"},{"$f":"INPUT!AG148","v":"ABS"},{"$f":"INPUT!AH148","v":"ABS"},{"$f":"INPUT!AJ148","v":"*"},{"$f":"INPUT!AK148","v":0},{"$f":"INPUT!AM148","v":"ABS"},{"$f":"INPUT!AN148","v":"ABS"},{"$f":"INPUT!AQ148","v":"ABS"},{"$f":"INPUT!AR148","v":"ABS"},{"$f":"INPUT!AT148","v":"*"},{"$f":"INPUT!AU148","v":0},{"$f":"INPUT!AW148","v":"ABS"},{"$f":"INPUT!AX148","v":"ABS"},{"$f":"INPUT!BA148","v":"ABS"},{"$f":"INPUT!BB148","v":"ABS"},{"$f":"INPUT!BD148","v":"*"},{"$f":"INPUT!BE148","v":0},{"$f":"INPUT!BG148","v":"ABS"},{"$f":"INPUT!BH148","v":"ABS"},{"$f":"INPUT!BK148","v":"ABS"},{"$f":"INPUT!BL148","v":"ABS"},{"$f":"INPUT!BN148","v":"*"},{"$f":"INPUT!BO148","v":"-"},{"$f":"INPUT!BP148","v":0},{"$f":"INPUT!BR148","v":"ABS"},{"$f":"INPUT!BS148","v":"ABS"},{"$f":"INPUT!BV148","v":"ABS"},{"$f":"INPUT!BW148","v":"ABS"},{"$f":"INPUT!BY148","v":""},"","ABS","",null,null,null,null,null,{"$f":"AP148&\"_\"&COUNTIF($AP$5:AP148,AP148)","v":"-_141"}]
[null,{"$f":"INPUT!F149","v":0},{"$f":"INPUT!C149","v":0},{"$f":"INPUT!D149","v":"00:00:00"},{"$f":"INPUT!E149","v":0},{"$f":"INPUT!G149","v":"0011"},{"$f":"INPUT!I149","v":"ABS"},{"$f":"INPUT!J149","v":"ABS"},{"$f":"INPUT!M149","v":"ABS"},{"$f":"INPUT!N149","v":"ABS"},{"$f":"INPUT!P149","v":"*"},{"$f":"INPUT!Q149","v":"0031"},{"$f":"INPUT!S149","v":"ABS"},{"$f":"INPUT!T149","v":"ABS"},{"$f":"INPUT!W149","v":"ABS"},{"$f":"INPUT!X149","v":"ABS"},{"$f":"INPUT!Z149","v":"*"},{"$f":"INPUT!AA149","v":"0051"},{"$f":"INPUT!AC149","v":"ABS"},{"$f":"INPUT!AD149","v":"ABS"},{"$f":"INPUT!AG149","v":"ABS"},{"$f":"INPUT!AH149","v":"ABS"},{"$f":"INPUT!AJ149","v":"*"},{"$f":"INPUT!AK149","v":0},{"$f":"INPUT!AM149","v":"ABS"},{"$f":"INPUT!AN149","v":"ABS"},{"$f":"INPUT!AQ149","v":"ABS"},{"$f":"INPUT!AR149","v":"ABS"},{"$f":"INPUT!AT149","v":"*"},{"$f":"INPUT!AU149","v":0},{"$f":"INPUT!AW149","v":"ABS"},{"$f":"INPUT!AX149","v":"ABS"},{"$f":"INPUT!BA149","v":"ABS"},{"$f":"INPUT!BB149","v":"ABS"},{"$f":"INPUT!BD149","v":"*"},{"$f":"INPUT!BE149","v":0},{"$f":"INPUT!BG149","v":"ABS"},{"$f":"INPUT!BH149","v":"ABS"},{"$f":"INPUT!BK149","v":"ABS"},{"$f":"INPUT!BL149","v":"ABS"},{"$f":"INPUT!BN149","v":"*"},{"$f":"INPUT!BO149","v":"-"},{"$f":"INPUT!BP149","v":0},{"$f":"INPUT!BR149","v":"ABS"},{"$f":"INPUT!BS149","v":"ABS"},{"$f":"INPUT!BV149","v":"ABS"},{"$f":"INPUT!BW149","v":"ABS"},{"$f":"INPUT!BY149","v":""},"","ABS","",null,null,null,null,null,{"$f":"AP149&\"_\"&COUNTIF($AP$5:AP149,AP149)","v":"-_142"}]
[null,{"$f":"INPUT!F150","v":0},{"$f":"INPUT!C150","v":0},{"$f":"INPUT!D150","v":"00:00:00"},{"$f":"INPUT!E150","v":0},{"$f":"INPUT!G150","v":"0011"},{"$f":"INPUT!I150","v":"ABS"},{"$f":"INPUT!J150","v":"ABS"},{"$f":"INPUT!M150","v":"ABS"},{"$f":"INPUT!N150","v":"ABS"},{"$f":"INPUT!P150","v":"*"},{"$f":"INPUT!Q150","v":"0031"},{"$f":"INPUT!S150","v":"ABS"},{"$f":"INPUT!T150","v":"ABS"},{"$f":"INPUT!W150","v":"ABS"},{"$f":"INPUT!X150","v":"ABS"},{"$f":"INPUT!Z150","v":"*"},{"$f":"INPUT!AA150","v":"0051"},{"$f":"INPUT!AC150","v":"ABS"},{"$f":"INPUT!AD150","v":"ABS"},{"$f":"INPUT!AG150","v":"ABS"},{"$f":"INPUT!AH150","v":"ABS"},{"$f":"INPUT!AJ150","v":"*"},{"$f":"INPUT!AK150","v":0},{"$f":"INPUT!AM150","v":"ABS"},{"$f":"INPUT!AN150","v":"ABS"},{"$f":"INPUT!AQ150","v":"ABS"},{"$f":"INPUT!AR150","v":"ABS"},{"$f":"INPUT!AT150","v":"*"},{"$f":"INPUT!AU150","v":0},{"$f":"INPUT!AW150","v":"ABS"},{"$f":"INPUT!AX150","v":"ABS"},{"$f":"INPUT!BA150","v":"ABS"},{"$f":"INPUT!BB150","v":"ABS"},{"$f":"INPUT!BD150","v":"*"},{"$f":"INPUT!BE150","v":0},{"$f":"INPUT!BG150","v":"ABS"},{"$f":"INPUT!BH150","v":"ABS"},{"$f":"INPUT!BK150","v":"ABS"},{"$f":"INPUT!BL150","v":"ABS"},{"$f":"INPUT!BN150","v":"*"},{"$f":"INPUT!BO150","v":"-"},{"$f":"INPUT!BP150","v":0},{"$f":"INPUT!BR150","v":"ABS"},{"$f":"INPUT!BS150","v":"ABS"},{"$f":"INPUT!BV150","v":"ABS"},{"$f":"INPUT!BW150","v":"ABS"},{"$f":"INPUT!BY150","v":""},"","ABS","",null,null,null,null,null,{"$f":"AP150&\"_\"&COUNTIF($AP$5:AP150,AP150)","v":"-_143"}]
[null,{"$f":"INPUT!F151","v":0},{"$f":"INPUT!C151","v":0},{"$f":"INPUT!D151","v":"00:00:00"},{"$f":"INPUT!E151","v":0},{"$f":"INPUT!G151","v":"0011"},{"$f":"INPUT!I151","v":"ABS"},{"$f":"INPUT!J151","v":"ABS"},{"$f":"INPUT!M151","v":"ABS"},{"$f":"INPUT!N151","v":"ABS"},{"$f":"INPUT!P151","v":"*"},{"$f":"INPUT!Q151","v":"0031"},{"$f":"INPUT!S151","v":"ABS"},{"$f":"INPUT!T151","v":"ABS"},{"$f":"INPUT!W151","v":"ABS"},{"$f":"INPUT!X151","v":"ABS"},{"$f":"INPUT!Z151","v":"*"},{"$f":"INPUT!AA151","v":"0051"},{"$f":"INPUT!AC151","v":"ABS"},{"$f":"INPUT!AD151","v":"ABS"},{"$f":"INPUT!AG151","v":"ABS"},{"$f":"INPUT!AH151","v":"ABS"},{"$f":"INPUT!AJ151","v":"*"},{"$f":"INPUT!AK151","v":0},{"$f":"INPUT!AM151","v":"ABS"},{"$f":"INPUT!AN151","v":"ABS"},{"$f":"INPUT!AQ151","v":"ABS"},{"$f":"INPUT!AR151","v":"ABS"},{"$f":"INPUT!AT151","v":"*"},{"$f":"INPUT!AU151","v":0},{"$f":"INPUT!AW151","v":"ABS"},{"$f":"INPUT!AX151","v":"ABS"},{"$f":"INPUT!BA151","v":"ABS"},{"$f":"INPUT!BB151","v":"ABS"},{"$f":"INPUT!BD151","v":"*"},{"$f":"INPUT!BE151","v":0},{"$f":"INPUT!BG151","v":"ABS"},{"$f":"INPUT!BH151","v":"ABS"},{"$f":"INPUT!BK151","v":"ABS"},{"$f":"INPUT!BL151","v":"ABS"},{"$f":"INPUT!BN151","v":"*"},{"$f":"INPUT!BO151","v":"-"},{"$f":"INPUT!BP151","v":0},{"$f":"INPUT!BR151","v":"ABS"},{"$f":"INPUT!BS151","v":"ABS"},{"$f":"INPUT!BV151","v":"ABS"},{"$f":"INPUT!BW151","v":"ABS"},{"$f":"INPUT!BY151","v":""},"","ABS","",null,null,null,null,null,{"$f":"AP151&\"_\"&COUNTIF($AP$5:AP151,AP151)","v":"-_144"}]
[null,{"$f":"INPUT!F152","v":0},{"$f":"INPUT!C152","v":0},{"$f":"INPUT!D152","v":"00:00:00"},{"$f":"INPUT!E152","v":0},{"$f":"INPUT!G152","v":"0011"},{"$f":"INPUT!I152","v":"ABS"},{"$f":"INPUT!J152","v":"ABS"},{"$f":"INPUT!M152","v":"ABS"},{"$f":"INPUT!N152","v":"ABS"},{"$f":"INPUT!P152","v":"*"},{"$f":"INPUT!Q152","v":"0031"},{"$f":"INPUT!S152","v":"ABS"},{"$f":"INPUT!T152","v":"ABS"},{"$f":"INPUT!W152","v":"ABS"},{"$f":"INPUT!X152","v":"ABS"},{"$f":"INPUT!Z152","v":"*"},{"$f":"INPUT!AA152","v":"0051"},{"$f":"INPUT!AC152","v":"ABS"},{"$f":"INPUT!AD152","v":"ABS"},{"$f":"INPUT!AG152","v":"ABS"},{"$f":"INPUT!AH152","v":"ABS"},{"$f":"INPUT!AJ152","v":"*"},{"$f":"INPUT!AK152","v":0},{"$f":"INPUT!AM152","v":"ABS"},{"$f":"INPUT!AN152","v":"ABS"},{"$f":"INPUT!AQ152","v":"ABS"},{"$f":"INPUT!AR152","v":"ABS"},{"$f":"INPUT!AT152","v":"*"},{"$f":"INPUT!AU152","v":0},{"$f":"INPUT!AW152","v":"ABS"},{"$f":"INPUT!AX152","v":"ABS"},{"$f":"INPUT!BA152","v":"ABS"},{"$f":"INPUT!BB152","v":"ABS"},{"$f":"INPUT!BD152","v":"*"},{"$f":"INPUT!BE152","v":0},{"$f":"INPUT!BG152","v":"ABS"},{"$f":"INPUT!BH152","v":"ABS"},{"$f":"INPUT!BK152","v":"ABS"},{"$f":"INPUT!BL152","v":"ABS"},{"$f":"INPUT!BN152","v":"*"},{"$f":"INPUT!BO152","v":"-"},{"$f":"INPUT!BP152","v":0},{"$f":"INPUT!BR152","v":"ABS"},{"$f":"INPUT!BS152","v":"ABS"},{"$f":"INPUT!BV152","v":"ABS"},{"$f":"INPUT!BW152","v":"ABS"},{"$f":"INPUT!BY152","v":""},"","ABS","",null,null,null,null,null,{"$f":"AP152&\"_\"&COUNTIF($AP$5:AP152,AP152)","v":"-_145"}]
[null,{"$f":"INPUT!F153","v":0},{"$f":"INPUT!C153","v":0},{"$f":"INPUT!D153","v":"00:00:00"},{"$f":"INPUT!E153","v":0},{"$f":"INPUT!G153","v":"0011"},{"$f":"INPUT!I153","v":"ABS"},{"$f":"INPUT!J153","v":"ABS"},{"$f":"INPUT!M153","v":"ABS"},{"$f":"INPUT!N153","v":"ABS"},{"$f":"INPUT!P153","v":"*"},{"$f":"INPUT!Q153","v":"0031"},{"$f":"INPUT!S153","v":"ABS"},{"$f":"INPUT!T153","v":"ABS"},{"$f":"INPUT!W153","v":"ABS"},{"$f":"INPUT!X153","v":"ABS"},{"$f":"INPUT!Z153","v":"*"},{"$f":"INPUT!AA153","v":"0051"},{"$f":"INPUT!AC153","v":"ABS"},{"$f":"INPUT!AD153","v":"ABS"},{"$f":"INPUT!AG153","v":"ABS"},{"$f":"INPUT!AH153","v":"ABS"},{"$f":"INPUT!AJ153","v":"*"},{"$f":"INPUT!AK153","v":0},{"$f":"INPUT!AM153","v":"ABS"},{"$f":"INPUT!AN153","v":"ABS"},{"$f":"INPUT!AQ153","v":"ABS"},{"$f":"INPUT!AR153","v":"ABS"},{"$f":"INPUT!AT153","v":"*"},{"$f":"INPUT!AU153","v":0},{"$f":"INPUT!AW153","v":"ABS"},{"$f":"INPUT!AX153","v":"ABS"},{"$f":"INPUT!BA153","v":"ABS"},{"$f":"INPUT!BB153","v":"ABS"},{"$f":"INPUT!BD153","v":"*"},{"$f":"INPUT!BE153","v":0},{"$f":"INPUT!BG153","v":"ABS"},{"$f":"INPUT!BH153","v":"ABS"},{"$f":"INPUT!BK153","v":"ABS"},{"$f":"INPUT!BL153","v":"ABS"},{"$f":"INPUT!BN153","v":"*"},{"$f":"INPUT!BO153","v":"-"},{"$f":"INPUT!BP153","v":0},{"$f":"INPUT!BR153","v":"ABS"},{"$f":"INPUT!BS153","v":"ABS"},{"$f":"INPUT!BV153","v":"ABS"},{"$f":"INPUT!BW153","v":"ABS"},{"$f":"INPUT!BY153","v":""},"","ABS","",null,null,null,null,null,{"$f":"AP153&\"_\"&COUNTIF($AP$5:AP153,AP153)","v":"-_146"}]
[null,{"$f":"INPUT!F154","v":0},{"$f":"INPUT!C154","v":0},{"$f":"INPUT!D154","v":"00:00:00"},{"$f":"INPUT!E154","v":0},{"$f":"INPUT!G154","v":"0011"},{"$f":"INPUT!I154","v":"ABS"},{"$f":"INPUT!J154","v":"ABS"},{"$f":"INPUT!M154","v":"ABS"},{"$f":"INPUT!N154","v":"ABS"},{"$f":"INPUT!P154","v":"*"},{"$f":"INPUT!Q154","v":"0031"},{"$f":"INPUT!S154","v":"ABS"},{"$f":"INPUT!T154","v":"ABS"},{"$f":"INPUT!W154","v":"ABS"},{"$f":"INPUT!X154","v":"ABS"},{"$f":"INPUT!Z154","v":"*"},{"$f":"INPUT!AA154","v":"0051"},{"$f":"INPUT!AC154","v":"ABS"},{"$f":"INPUT!AD154","v":"ABS"},{"$f":"INPUT!AG154","v":"ABS"},{"$f":"INPUT!AH154","v":"ABS"},{"$f":"INPUT!AJ154","v":"*"},{"$f":"INPUT!AK154","v":0},{"$f":"INPUT!AM154","v":"ABS"},{"$f":"INPUT!AN154","v":"ABS"},{"$f":"INPUT!AQ154","v":"ABS"},{"$f":"INPUT!AR154","v":"ABS"},{"$f":"INPUT!AT154","v":"*"},{"$f":"INPUT!AU154","v":0},{"$f":"INPUT!AW154","v":"ABS"},{"$f":"INPUT!AX154","v":"ABS"},{"$f":"INPUT!BA154","v":"ABS"},{"$f":"INPUT!BB154","v":"ABS"},{"$f":"INPUT!BD154","v":"*"},{"$f":"INPUT!BE154","v":0},{"$f":"INPUT!BG154","v":"ABS"},{"$f":"INPUT!BH154","v":"ABS"},{"$f":"INPUT!BK154","v":"ABS"},{"$f":"INPUT!BL154","v":"ABS"},{"$f":"INPUT!BN154","v":"*"},{"$f":"INPUT!BO154","v":"-"},{"$f":"INPUT!BP154","v":0},{"$f":"INPUT!BR154","v":"ABS"},{"$f":"INPUT!BS154","v":"ABS"},{"$f":"INPUT!BV154","v":"ABS"},{"$f":"INPUT!BW154","v":"ABS"},{"$f":"INPUT!BY154","v":""},"","ABS","",null,null,null,null,null,{"$f":"AP154&\"_\"&COUNTIF($AP$5:AP154,AP154)","v":"-_147"}]
[null,null,null,null,null,null,null,null,null,null,null,null,null,null,null,null,null,null,null,null,null,null,null,null,null,null,null,null,null,null,null,null,null,null,null,null,null,null,null,null,null,null,null,null,null,null,null,null,{"$f":"COUNTIF(AW5:AW154,\"=NG\")","v":0},{"$f":"COUNTIFS(AX5:AX154,\"=ABS\",B5:B154,\">0\")","v":0},{"$f":"COUNTIF(AY5:AY154,\"=W\")","v":0}]
[null,{"$f":"COUNTIF(B5:B154,\">0\")","v":26}]
[null,null,null,null,null,null,null,null,null,null,null,null,null,null,null,null,null,null,null,null,null,null,null,null,null,null,null,null,null,null,null,null,null,null,null,null,null,null,null,null,"A+ (=4 GPA)",{"$f":"COUNTIF(GPA,\"=4\")","v":0}]
[null,null,null,null,null,null,null,null,null,null,null,null,null,null,null,null,null,null,null,null,null,null,null,null,null,null,null,null,null,null,null,null,null,null,null,null,null,null,null,null,"A (>=3.6 GPA)",{"$f":"COUNTIFS(GPA,\">=3.6\",GPA,\"<4\")","v":0}]
[null,null,null,null,null,null,null,null,null,null,null,null,null,null,null,null,null,null,null,null,null,null,null,null,null,null,null,null,null,null,null,null,null,null,null,null,null,null,null,null,"B+ (>=3.2 GPA)",{"$f":"COUNTIFS(GPA,\">=3.2\",GPA,\"<3.6\")","v":0}]
[null,null,null,null,null,null,null,null,null,null,null,null,null,null,null,null,null,null,null,null,null,null,null,null,null,null,null,null,null,null,null,null,null,null,null,null,null,null,null,null,"B (>=2.8 GPA)",{"$f":"COUNTIFS(GPA,\">=2.8\",GPA,\"<3.2\")","v":3}]
[null,null,null,null,null,null,null,null,null,null,null,null,null,null,null,null,null,null,null,null,null,null,null,null,null,null,null,null,null,null,null,null,null,null,null,null,null,null,null,null,"C+ (>=2.4 GPA)",{"$f":"COUNTIFS(GPA,\">=2.4\",GPA,\"<2.8\")","v":0}]
[null,null,null,null,null,null,null,null,null,null,null,null,null,null,null,null,null,null,null,null,null,null,null,null,null,null,null,null,null,null,null,null,null,null,null,null,null,null,null,null,"C (>=2 GPA)",{"$f":"COUNTIFS(GPA,\">=2.0\",GPA,\"<2.4\")","v":0}]
[null,null,null,null,null,null,null,null,null,null,null,null,null,null,null,null,null,null,null,null,null,null,null,null,null,null,null,null,null,null,null,null,null,null,null,null,null,null,null,null,"D (>=1.6)",{"$f":"COUNTIFS(GPA,\">=1.6\",GPA,\"<2.0\")","v":0}]

{"sheet":"OUTPUT_1","index":3,"n_rows":42,"n_cols":10,"rows_kept":42,"cut":false,"hidden":false,"merged":[[18,8,19,8],[20,8,21,8],[12,7,12,8],[11,2,11,4],[11,5,11,9],[13,2,13,3],[13,5,13,6],[14,2,14,4],[18,3,18,4],[19,3,19,4],[16,2,17,2],[16,3,17,4],[16,5,17,5],[16,6,17,6],[16,7,17,7],[16,8,17,8],[30,2,30,7],[22,8,23,8],[39,2,39,9],[38,2,38,6],[31,2,31,9],[23,3,23,4],[24,3,24,4],[25,3,25,4],[26,3,26,4],[27,3,27,4],[24,8,25,8],[26,8,27,8],[36,7,36,9],[34,2,34,4],[35,2,35,4],[28,8,29,8],[40,2,40,6],[41,7,41,8],[41,2,41,3],[2,2,6,9],[14,5,14,6],[14,7,14,9],[16,9,17,9],[33,3,33,4],[36,2,36,3],[20,3,20,4],[21,3,21,4],[32,3,32,4],[22,3,22,4],[32,8,33,8],[28,3,28,4],[29,3,29,4]]}
[]
[]
[]
[]
[]
[]
[]
[]
[]
[]
[]
[null,null,"THE GRADE(S) SECURED BY   :",null,null,{"$f":"IFERROR(VLOOKUP(H14,ledger,2,0),\"This Symbol No. is not in Grade Ledger\")","v":"SAUGAT SHRESTHA "}]
[null,null,"DATE OF BIRTH :",null,{"$f":"VLOOKUP(H14,ledger,3,0)","v":"2062-01-05"},"B.S.","       (",null,null,"A.D.)"]
[null,null,"REGISTRATION NO.",null,{"$f":"VLOOKUP(H14,ledger,4,0)","v":"801130210025"},"SYMBOL NO.",null,11301344,"GRADE","XI"]
[null,null,"IN THE EXAMINATION CONDUCTED IN ",null,null,"2080 B.S. (2022 A.D.)",null,"ARE GIVEN BELOW."]
[]
[null,null,"SUBJECT CODE","SUBJECTS",null,"CREDIT HOUR (CH)","GRADE","GARDE POINT (GP)","FINAL GRADE (FG) ","REMARKS"]
[]
[null,null,{"$f":"VLOOKUP(H14,ledger,5,0)","v":"0011"},{"$f":"IFERROR(VLOOKUP(C19,codesub,2,0),\"SUB.CODE IS WRONG\")","v":"COM. NEPALI (TH)"},null,2.25,{"$f":"VLOOKUP(H14,ledger,6,0)","v":"C+"},{"$f":"VLOOKUP(H14,ledger,7,0)","v":2.4},{"$f":"VLOOKUP(H14,ledger,10,0)","v":"C+"}]
[null,null,{"$f":"IF(C19=\"0011\",\"0012\",\"SORRY\")","v":"0012"},{"$f":"IF(C20=\"0012\",\"COM. NEPALI (IN)\",\"SUB.CODE IS WRONG\")","v":"COM. NEPALI (IN)"},null,0.75,{"$f":"VLOOKUP(H14,ledger,8,0)","v":"C"},{"$f":"VLOOKUP(H14,ledger,9,0)","v":2}]
[null,null,{"$f":"VLOOKUP(H14,ledger,11,0)","v":"0031"},{"$f":"IFERROR(VLOOKUP(C21,codesub,2,0),\"SUB.CODE IS WRONG\")","v":"COM. ENGLISH (TH)"},null,3,{"$f":"VLOOKUP(H14,ledger,12,0)","v":"C+"},{"$f":"VLOOKUP(H14,ledger,13,0)","v":2.4},{"$f":"VLOOKUP(H14,ledger,16,0)","v":"C+"}]
[null,null,{"$f":"IF(C21=\"0031\",\"0032\",\"SORRY\")","v":"0032"},{"$f":"IF(C22=\"0032\",\"COM. ENGLISH (IN)\",\"SUB.CODE IS WRONG\")","v":"COM. ENGLISH (IN)"},null,1,{"$f":"VLOOKUP(H14,ledger,14,0)","v":"C"},{"$f":"VLOOKUP(H14,ledger,15,0)","v":2}]
[null,null,{"$f":"VLOOKUP(H14,ledger,17,0)","v":"0051"},{"$f":"IF(C23=\"0051\",\"COM. SOCIAL STUDIES & LIFE SKILL (TH)\",IF(C23=\"0071\",\"COM. MATHEMATICS (TH)\",\"SUB.CODE IS WRONG\"))","v":"COM. SOCIAL STUDIES & LIFE SKILL (TH)"},null,3.75,{"$f":"VLOOKUP(H14,ledger,18,0)","v":"B+"},{"$f":"VLOOKUP(H14,ledger,19,0)","v":3.2},{"$f":"VLOOKUP(H14,ledger,22,0)","v":"A"},{"$f":"IF(OR($I$19=\"NG\",$I$21=\"NG\",$I$23=\"NG\",$I$25=\"NG\",$I$27=\"NG\",$I$29=\"NG\"),\"W\",\"\")","v":""}]
[null,null,{"$f":"IF(C23=\"0051\",\"0052\",IF(C23=\"0071\",\"0072\",\"SORRY\"))","v":"0052"},{"$f":"IF(C24=\"0052\",\"COM. SOCIAL STUDIES & LIFE SKILL (IN)\",IF(C24=\"0072\",\"COM. MATHEMATICS (IN)\",\"SUB.CODE IS WRONG\"))","v":"COM. SOCIAL STUDIES & LIFE SKILL (IN)"},null,1.25,{"$f":"VLOOKUP(H14,ledger,20,0)","v":"A"},{"$f":"VLOOKUP(H14,ledger,21,0)","v":3.6},null,{"$f":"IF(OR($I$19=\"ABS\",$I$21=\"ABS\",$I$23=\"ABS\",$I$25=\"ABS\",$I$27=\"ABS\",$I$29=\"ABS\"),\"ABS\",\"\")","v":""}]
[null,null,{"$f":"VLOOKUP(H14,ledger,23,0)","v":1031},{"$f":"IFERROR(VLOOKUP(C25,codesub,2,0),\"SUB.CODE IS WRONG\")","v":"ACCOUNTING (TH)"},null,3.75,{"$f":"VLOOKUP(H14,ledger,24,0)","v":"B"},{"$f":"VLOOKUP(H14,ledger,25,0)","v":2.8},{"$f":"VLOOKUP(H14,ledger,28,0)","v":"B+"}]
[null,null,{"$f":"C25+1","v":1032},"ACCOUNTING (IN)",null,1.25,{"$f":"VLOOKUP(H14,ledger,26,0)","v":"A"},{"$f":"VLOOKUP(H14,ledger,27,0)","v":3.6}]
[null,null,{"$f":"VLOOKUP(H14,ledger,29,0)","v":4251},"SINGING (TH)",null,3.75,{"$f":"VLOOKUP(H14,ledger,30,0)","v":"C"},{"$f":"VLOOKUP(H14,ledger,31,0)","v":2},{"$f":"VLOOKUP(H14,ledger,34,0)","v":"B"}]
[null,null,{"$f":"C27+1","v":4252},"SINGING (IN)",null,1.25,{"$f":"VLOOKUP(H14,ledger,32,0)","v":"A+"},{"$f":"VLOOKUP(H14,ledger,33,0)","v":4}]
[null,null,{"$f":"VLOOKUP(H14,ledger,35,0)","v":4171},{"$f":"IFERROR(VLOOKUP(C29,codesub,2,0),\"SUB.CODE IS WRONG\")","v":"FINANCE (TH)"},null,3.75,{"$f":"VLOOKUP(H14,ledger,36,0)","v":"C+"},{"$f":"VLOOKUP(H14,ledger,37,0)","v":2.4},{"$f":"VLOOKUP(H14,ledger,40,0)","v":"*"}]
[null,null,{"$f":"C29+1","v":4172},"FINANCE (IN)",null,1.25,{"$f":"VLOOKUP(H14,ledger,38,0)","v":"ABS"},{"$f":"VLOOKUP(H14,ledger,39,0)","v":"ABS"}]
[null,null,"GRADE POINT AVERAGE (GPA) :",null,null,null,null,null,{"$f":"VLOOKUP(H14,ledger,41,0)","v":"-"}]
[null,null,"EXTRA CREDIT SUBJECT"]
[null,null,{"$f":"IFERROR(VLOOKUP(H14,ledger,42,0),\"\")","v":0},{"$f":"IFERROR(VLOOKUP(C33,codesub,2,0),\"SUB.CODE IS WRONG\")","v":"SUB.CODE IS WRONG"},null,null,{"$f":"VLOOKUP(H14,ledger,43,0)","v":"ABS"},{"$f":"VLOOKUP(H14,ledger,44,0)","v":"ABS"},{"$f":"VLOOKUP(H14,ledger,47,0)","v":""}]
[null,null,{"$f":"IFERROR(C33+1,\"\")","v":1},{"$f":"IFERROR(VLOOKUP(C34,codesub,2,0),\"SUB.CODE IS WRONG\")","v":"SUB.CODE IS WRONG"},null,null,{"$f":"VLOOKUP(H14,ledger,45,0)","v":"ABS"},{"$f":"VLOOKUP(H14,ledger,46,0)","v":"ABS"}]
[null,null,"PREPARED BY : …………………………"]
[null,null,"CHECKED BY : …………………………"]
[null,null,"DATE OF ISSUE     :",null,"2079.03.15",null,null,"HEAD TEACHER"]
[]
[null,null,"NOTE : ONE CREDIT HOUR EQUALS TO 32 WORKING HOURS"]
[null,null,"INTERNAL (IN) : THIS COVERS THE PARTICIPATION, PRACTICAL/PROJECT WORKS, COMMUNITY \n                                     WORKS, INTERNSHIP, PRESENTATIONS, TERMINAL EXAMINATIONS."]
[null,null,"THEORY (TH) :  THIS COVERS WRITTEN EXTERNAL EXAMINATION"]
[null,null,"ABS = ABSENT",null,null,null,"       ","W= WITHHELD"]

{"sheet":"OUTPUT_2","index":4,"n_rows":164,"n_cols":7,"rows_kept":164,"cut":false,"hidden":false,"merged":[]}
[]
[]
[]
[]
[]
[]
[]
[]
[]
[]
[]
[]
[]
[null,"SYMBOL NO.","Name Of Student","DOB","Registration No.","GPA","Rank"]
[null,{"$f":"PROCESSING!B5","v":11301320},{"$f":"PROCESSING!C5","v":"ALISHA KARKI "},{"$f":"PROCESSING!D5","v":"4/31/2063"},{"$f":"PROCESSING!E5","v":"801130210001"},{"$f":"PROCESSING!AP5","v":2.8},{"$f":"IFERROR(RANK(Table2[[#This Row],[GPA]],[GPA],0)+COUNTIF(Table2[[#This Row],[GPA]],Table2[[#This Row],[GPA]])-1,\"*\")","v":3}]
[null,{"$f":"PROCESSING!B6","v":11301321},{"$f":"PROCESSING!C6","v":"AMRITA RAI "},{"$f":"PROCESSING!D6","v":"2063-09-02"},{"$f":"PROCESSING!E6","v":"801130210002"},{"$f":"PROCESSING!AP6","v":3.1518518518518515},{"$f":"IFERROR(RANK(Table2[[#This Row],[GPA]],[GPA],0)+COUNTIF(Table2[[#This Row],[GPA]],Table2[[#This Row],[GPA]])-1,\"*\")","v":1}]
[null,{"$f":"PROCESSING!B7","v":11301322},{"$f":"PROCESSING!C7","v":"ANISHA THAPA MAGAR "},{"$f":"PROCESSING!D7","v":"2062-07-07"},{"$f":"PROCESSING!E7","v":"801130210003"},{"$f":"PROCESSING!AP7","v":3.0222222222222221},{"$f":"IFERROR(RANK(Table2[[#This Row],[GPA]],[GPA],0)+COUNTIF(Table2[[#This Row],[GPA]],Table2[[#This Row],[GPA]])-1,\"*\")","v":2}]
[null,{"$f":"PROCESSING!B8","v":11301323},{"$f":"PROCESSING!C8","v":"ANUPAMA TAMANG "},{"$f":"PROCESSING!D8","v":"2062-12-20"},{"$f":"PROCESSING!E8","v":"801130210004"},{"$f":"PROCESSING!AP8","v":"-"},{"$f":"IFERROR(RANK(Table2[[#This Row],[GPA]],[GPA],0)+COUNTIF(Table2[[#This Row],[GPA]],Table2[[#This Row],[GPA]])-1,\"*\")","v":"*"}]
[null,{"$f":"PROCESSING!B9","v":11301324},{"$f":"PROCESSING!C9","v":"ASMITA PARIYAR "},{"$f":"PROCESSING!D9","v":"2062-12-27"},{"$f":"PROCESSING!E9","v":"801130210005"},{"$f":"PROCESSING!AP9","v":"-"},{"$f":"IFERROR(RANK(Table2[[#This Row],[GPA]],[GPA],0)+COUNTIF(Table2[[#This Row],[GPA]],Table2[[#This Row],[GPA]])-1,\"*\")","v":"*"}]
[null,{"$f":"PROCESSING!B10","v":11301325},{"$f":"PROCESSING!C10","v":"BIKASH RAI "},{"$f":"PROCESSING!D10","v":"2063-03-10"},{"$f":"PROCESSING!E10","v":"801130210006"},{"$f":"PROCESSING!AP10","v":"-"},{"$f":"IFERROR(RANK(Table2[[#This Row],[GPA]],[GPA],0)+COUNTIF(Table2[[#This Row],[GPA]],Table2[[#This Row],[GPA]])-1,\"*\")","v":"*"}]
[null,{"$f":"PROCESSING!B11","v":11301326},{"$f":"PROCESSING!C11","v":"DIKESH RAI "},{"$f":"PROCESSING!D11","v":"2063-07-06"},{"$f":"PROCESSING!E11","v":"801130210007"},{"$f":"PROCESSING!AP11","v":"-"},{"$f":"IFERROR(RANK(Table2[[#This Row],[GPA]],[GPA],0)+COUNTIF(Table2[[#This Row],[GPA]],Table2[[#This Row],[GPA]])-1,\"*\")","v":"*"}]
[null,{"$f":"PROCESSING!B12","v":11301327},{"$f":"PROCESSING!C12","v":"ERON BHUJEL "},{"$f":"PROCESSING!D12","v":"2064-06-02"},{"$f":"PROCESSING!E12","v":"801130210008"},{"$f":"PROCESSING!AP12","v":"-"},{"$f":"IFERROR(RANK(Table2[[#This Row],[GPA]],[GPA],0)+COUNTIF(Table2[[#This Row],[GPA]],Table2[[#This Row],[GPA]])-1,\"*\")","v":"*"}]
[null,{"$f":"PROCESSING!B13","v":11301328},{"$f":"PROCESSING!C13","v":"ISMITA RAI "},{"$f":"PROCESSING!D13","v":"2062-06-05"},{"$f":"PROCESSING!E13","v":"801130210009"},{"$f":"PROCESSING!AP13","v":"-"},{"$f":"IFERROR(RANK(Table2[[#This Row],[GPA]],[GPA],0)+COUNTIF(Table2[[#This Row],[GPA]],Table2[[#This Row],[GPA]])-1,\"*\")","v":"*"}]
[null,{"$f":"PROCESSING!B14","v":11301329},{"$f":"PROCESSING!C14","v":"KANCHAN KHATRI "},{"$f":"PROCESSING!D14","v":"2063-12-05"},{"$f":"PROCESSING!E14","v":"801130210010"},{"$f":"PROCESSING!AP14","v":"-"},{"$f":"IFERROR(RANK(Table2[[#This Row],[GPA]],[GPA],0)+COUNTIF(Table2[[#This Row],[GPA]],Table2[[#This Row],[GPA]])-1,\"*\")","v":"*"}]
[null,{"$f":"PROCESSING!B15","v":11301330},{"$f":"PROCESSING!C15","v":"KAUSTUV JUNG KHADKA "},{"$f":"PROCESSING!D15","v":"2064-03-11"},{"$f":"PROCESSING!E15","v":"801130210011"},{"$f":"PROCESSING!AP15","v":"-"},{"$f":"IFERROR(RANK(Table2[[#This Row],[GPA]],[GPA],0)+COUNTIF(Table2[[#This Row],[GPA]],Table2[[#This Row],[GPA]])-1,\"*\")","v":"*"}]
[null,{"$f":"PROCESSING!B16","v":11301331},{"$f":"PROCESSING!C16","v":"KUSUM RAI "},{"$f":"PROCESSING!D16","v":"2063-01-19"},{"$f":"PROCESSING!E16","v":"801130210012"},{"$f":"PROCESSING!AP16","v":"-"},{"$f":"IFERROR(RANK(Table2[[#This Row],[GPA]],[GPA],0)+COUNTIF(Table2[[#This Row],[GPA]],Table2[[#This Row],[GPA]])-1,\"*\")","v":"*"}]
[null,{"$f":"PROCESSING!B17","v":11301332},{"$f":"PROCESSING!C17","v":"LEPMUHANG RAI "},{"$f":"PROCESSING!D17","v":"2062-04-23"},{"$f":"PROCESSING!E17","v":"801130210013"},{"$f":"PROCESSING!AP17","v":"-"},{"$f":"IFERROR(RANK(Table2[[#This Row],[GPA]],[GPA],0)+COUNTIF(Table2[[#This Row],[GPA]],Table2[[#This Row],[GPA]])-1,\"*\")","v":"*"}]
[null,{"$f":"PROCESSING!B18","v":11301333},{"$f":"PROCESSING!C18","v":"MAHESH DAHAL "},{"$f":"PROCESSING!D18","v":"2061-04-01"},{"$f":"PROCESSING!E18","v":"801130210014"},{"$f":"PROCESSING!AP18","v":"-"},{"$f":"IFERROR(RANK(Table2[[#This Row],[GPA]],[GPA],0)+COUNTIF(Table2[[#This Row],[GPA]],Table2[[#This Row],[GPA]])-1,\"*\")","v":"*"}]
[null,{"$f":"PROCESSING!B19","v":11301334},{"$f":"PROCESSING!C19","v":"MANISHA RAI "},{"$f":"PROCESSING!D19","v":"2064-01-15"},{"$f":"PROCESSING!E19","v":"801130210015"},{"$f":"PROCESSING!AP19","v":"-"},{"$f":"IFERROR(RANK(Table2[[#This Row],[GPA]],[GPA],0)+COUNTIF(Table2[[#This Row],[GPA]],Table2[[#This Row],[GPA]])-1,\"*\")","v":"*"}]
[null,{"$f":"PROCESSING!B20","v":11301335},{"$f":"PROCESSING!C20","v":"MANISHA THAPA "},{"$f":"PROCESSING!D20","v":"2062-06-25"},{"$f":"PROCESSING!E20","v":"801130210016"},{"$f":"PROCESSING!AP20","v":"-"},{"$f":"IFERROR(RANK(Table2[[#This Row],[GPA]],[GPA],0)+COUNTIF(Table2[[#This Row],[GPA]],Table2[[#This Row],[GPA]])-1,\"*\")","v":"*"}]
[null,{"$f":"PROCESSING!B21","v":11301336},{"$f":"PROCESSING!C21","v":"MOUSAM RAI "},{"$f":"PROCESSING!D21","v":"2063-06-29"},{"$f":"PROCESSING!E21","v":"801130210017"},{"$f":"PROCESSING!AP21","v":"-"},{"$f":"IFERROR(RANK(Table2[[#This Row],[GPA]],[GPA],0)+COUNTIF(Table2[[#This Row],[GPA]],Table2[[#This Row],[GPA]])-1,\"*\")","v":"*"}]
[null,{"$f":"PROCESSING!B22","v":11301337},{"$f":"PROCESSING!C22","v":"NANIMA SHRESTHA "},{"$f":"PROCESSING!D22","v":"2064-11-16"},{"$f":"PROCESSING!E22","v":"801130210018"},{"$f":"PROCESSING!AP22","v":"-"},{"$f":"IFERROR(RANK(Table2[[#This Row],[GPA]],[GPA],0)+COUNTIF(Table2[[#This Row],[GPA]],Table2[[#This Row],[GPA]])-1,\"*\")","v":"*"}]
[null,{"$f":"PROCESSING!B23","v":11301338},{"$f":"PROCESSING!C23","v":"PRABIN TAMANG "},{"$f":"PROCESSING!D23","v":"2062-02-27"},{"$f":"PROCESSING!E23","v":"801130210019"},{"$f":"PROCESSING!AP23","v":"-"},{"$f":"IFERROR(RANK(Table2[[#This Row],[GPA]],[GPA],0)+COUNTIF(Table2[[#This Row],[GPA]],Table2[[#This Row],[GPA]])-1,\"*\")","v":"*"}]
[null,{"$f":"PROCESSING!B24","v":11301339},{"$f":"PROCESSING!C24","v":"PRAMISAN RAI "},{"$f":"PROCESSING!D24","v":"2063-05-27"},{"$f":"PROCESSING!E24","v":"801130210020"},{"$f":"PROCESSING!AP24","v":"-"},{"$f":"IFERROR(RANK(Table2[[#This Row],[GPA]],[GPA],0)+COUNTIF(Table2[[#This Row],[GPA]],Table2[[#This Row],[GPA]])-1,\"*\")","v":"*"}]
[null,{"$f":"PROCESSING!B25","v":11301340},{"$f":"PROCESSING!C25","v":"REJINA RAI "},{"$f":"PROCESSING!D25","v":"2062-02-27"},{"$f":"PROCESSING!E25","v":"801130210021"},{"$f":"PROCESSING!AP25","v":"-"},{"$f":"IFERROR(RANK(Table2[[#This Row],[GPA]],[GPA],0)+COUNTIF(Table2[[#This Row],[GPA]],Table2[[#This Row],[GPA]])-1,\"*\")","v":"*"}]
[null,{"$f":"PROCESSING!B26","v":11301341},{"$f":"PROCESSING!C26","v":"ROHAN JOSHI "},{"$f":"PROCESSING!D26","v":"2062-04-08"},{"$f":"PROCESSING!E26","v":"801130210022"},{"$f":"PROCESSING!AP26","v":"-"},{"$f":"IFERROR(RANK(Table2[[#This Row],[GPA]],[GPA],0)+COUNTIF(Table2[[#This Row],[GPA]],Table2[[#This Row],[GPA]])-1,\"*\")","v":"*"}]
[null,{"$f":"PROCESSING!B27","v":11301342},{"$f":"PROCESSING!C27","v":"SALINA GAJMER "},{"$f":"PROCESSING!D27","v":"2063-04-25"},{"$f":"PROCESSING!E27","v":"801130210023"},{"$f":"PROCESSING!AP27","v":"-"},{"$f":"IFERROR(RANK(Table2[[#This Row],[GPA]],[GPA],0)+COUNTIF(Table2[[#This Row],[GPA]],Table2[[#This Row],[GPA]])-1,\"*\")","v":"*"}]
[null,{"$f":"PROCESSING!B28","v":11301343},{"$f":"PROCESSING!C28","v":"SAPHAL SHRESTHA "},{"$f":"PROCESSING!D28","v":"2062-08-06"},{"$f":"PROCESSING!E28","v":"801130210024"},{"$f":"PROCESSING!AP28","v":"-"},{"$f":"IFERROR(RANK(Table2[[#This Row],[GPA]],[GPA],0)+COUNTIF(Table2[[#This Row],[GPA]],Table2[[#This Row],[GPA]])-1,\"*\")","v":"*"}]
[null,{"$f":"PROCESSING!B29","v":11301344},{"$f":"PROCESSING!C29","v":"SAUGAT SHRESTHA "},{"$f":"PROCESSING!D29","v":"2062-01-05"},{"$f":"PROCESSING!E29","v":"801130210025"},{"$f":"PROCESSING!AP29","v":"-"},{"$f":"IFERROR(RANK(Table2[[#This Row],[GPA]],[GPA],0)+COUNTIF(Table2[[#This Row],[GPA]],Table2[[#This Row],[GPA]])-1,\"*\")","v":"*"}]
[null,{"$f":"PROCESSING!B30","v":11301345},{"$f":"PROCESSING!C30","v":"SIKSHA RAI "},{"$f":"PROCESSING!D30","v":"2064-03-21"},{"$f":"PROCESSING!E30","v":"801130210026"},{"$f":"PROCESSING!AP30","v":"-"},{"$f":"IFERROR(RANK(Table2[[#This Row],[GPA]],[GPA],0)+COUNTIF(Table2[[#This Row],[GPA]],Table2[[#This Row],[GPA]])-1,\"*\")","v":"*"}]
[null,{"$f":"PROCESSING!B31","v":0},{"$f":"PROCESSING!C31","v":"ESAN  RAI"},{"$f":"PROCESSING!D31","v":"MALE"},{"$f":"PROCESSING!E31","v":58291},{"$f":"PROCESSING!AP31","v":"-"},{"$f":"IFERROR(RANK(Table2[[#This Row],[GPA]],[GPA],0)+COUNTIF(Table2[[#This Row],[GPA]],Table2[[#This Row],[GPA]])-1,\"*\")","v":"*"}]
[null,{"$f":"PROCESSING!B32","v":0},{"$f":"PROCESSING!C32","v":"ESHAN  RAI"},{"$f":"PROCESSING!D32","v":"MALE"},{"$f":"PROCESSING!E32","v":59856},{"$f":"PROCESSING!AP32","v":"-"},{"$f":"IFERROR(RANK(Table2[[#This Row],[GPA]],[GPA],0)+COUNTIF(Table2[[#This Row],[GPA]],Table2[[#This Row],[GPA]])-1,\"*\")","v":"*"}]
[null,{"$f":"PROCESSING!B33","v":0},{"$f":"PROCESSING!C33","v":"INDESH  RAI"},{"$f":"PROCESSING!D33","v":"MALE"},{"$f":"PROCESSING!E33","v":58546},{"$f":"PROCESSING!AP33","v":"-"},{"$f":"IFERROR(RANK(Table2[[#This Row],[GPA]],[GPA],0)+COUNTIF(Table2[[#This Row],[GPA]],Table2[[#This Row],[GPA]])-1,\"*\")","v":"*"}]
[null,{"$f":"PROCESSING!B34","v":0},{"$f":"PROCESSING!C34","v":"JENY  RAI"},{"$f":"PROCESSING!D34","v":"FEMALE"},{"$f":"PROCESSING!E34","v":58353},{"$f":"PROCESSING!AP34","v":"-"},{"$f":"IFERROR(RANK(Table2[[#This Row],[GPA]],[GPA],0)+COUNTIF(Table2[[#This Row],[GPA]],Table2[[#This Row],[GPA]])-1,\"*\")","v":"*"}]
[null,{"$f":"PROCESSING!B35","v":0},{"$f":"PROCESSING!C35","v":"MANOJ  MAGAR"},{"$f":"PROCESSING!D35","v":"MALE"},{"$f":"PROCESSING!E35","v":59378},{"$f":"PROCESSING!AP35","v":"-"},{"$f":"IFERROR(RANK(Table2[[#This Row],[GPA]],[GPA],0)+COUNTIF(Table2[[#This Row],[GPA]],Table2[[#This Row],[GPA]])-1,\"*\")","v":"*"}]
[null,{"$f":"PROCESSING!B36","v":0},{"$f":"PROCESSING!C36","v":0},{"$f":"PROCESSING!D36","v":"00:00:00"},{"$f":"PROCESSING!E36","v":0},{"$f":"PROCESSING!AP36","v":"-"},{"$f":"IFERROR(RANK(Table2[[#This Row],[GPA]],[GPA],0)+COUNTIF(Table2[[#This Row],[GPA]],Table2[[#This Row],[GPA]])-1,\"*\")","v":"*"}]
[null,{"$f":"PROCESSING!B37","v":0},{"$f":"PROCESSING!C37","v":0},{"$f":"PROCESSING!D37","v":"00:00:00"},{"$f":"PROCESSING!E37","v":0},{"$f":"PROCESSING!AP37","v":"-"},{"$f":"IFERROR(RANK(Table2[[#This Row],[GPA]],[GPA],0)+COUNTIF(Table2[[#This Row],[GPA]],Table2[[#This Row],[GPA]])-1,\"*\")","v":"*"}]
[null,{"$f":"PROCESSING!B38","v":0},{"$f":"PROCESSING!C38","v":0},{"$f":"PROCESSING!D38","v":"00:00:00"},{"$f":"PROCESSING!E38","v":0},{"$f":"PROCESSING!AP38","v":"-"},{"$f":"IFERROR(RANK(Table2[[#This Row],[GPA]],[GPA],0)+COUNTIF(Table2[[#This Row],[GPA]],Table2[[#This Row],[GPA]])-1,\"*\")","v":"*"}]
[null,{"$f":"PROCESSING!B39","v":0},{"$f":"PROCESSING!C39","v":0},{"$f":"PROCESSING!D39","v":"00:00:00"},{"$f":"PROCESSING!E39","v":0},{"$f":"PROCESSING!AP39","v":"-"},{"$f":"IFERROR(RANK(Table2[[#This Row],[GPA]],[GPA],0)+COUNTIF(Table2[[#This Row],[GPA]],Table2[[#This Row],[GPA]])-1,\"*\")","v":"*"}]
[null,{"$f":"PROCESSING!B40","v":0},{"$f":"PROCESSING!C40","v":0},{"$f":"PROCESSING!D40","v":"00:00:00"},{"$f":"PROCESSING!E40","v":0},{"$f":"PROCESSING!AP40","v":"-"},{"$f":"IFERROR(RANK(Table2[[#This Row],[GPA]],[GPA],0)+COUNTIF(Table2[[#This Row],[GPA]],Table2[[#This Row],[GPA]])-1,\"*\")","v":"*"}]
[null,{"$f":"PROCESSING!B41","v":0},{"$f":"PROCESSING!C41","v":0},{"$f":"PROCESSING!D41","v":"00:00:00"},{"$f":"PROCESSING!E41","v":0},{"$f":"PROCESSING!AP41","v":"-"},{"$f":"IFERROR(RANK(Table2[[#This Row],[GPA]],[GPA],0)+COUNTIF(Table2[[#This Row],[GPA]],Table2[[#This Row],[GPA]])-1,\"*\")","v":"*"}]
[null,{"$f":"PROCESSING!B42","v":0},{"$f":"PROCESSING!C42","v":0},{"$f":"PROCESSING!D42","v":"00:00:00"},{"$f":"PROCESSING!E42","v":0},{"$f":"PROCESSING!AP42","v":"-"},{"$f":"IFERROR(RANK(Table2[[#This Row],[GPA]],[GPA],0)+COUNTIF(Table2[[#This Row],[GPA]],Table2[[#This Row],[GPA]])-1,\"*\")","v":"*"}]
[null,{"$f":"PROCESSING!B43","v":0},{"$f":"PROCESSING!C43","v":0},{"$f":"PROCESSING!D43","v":"00:00:00"},{"$f":"PROCESSING!E43","v":0},{"$f":"PROCESSING!AP43","v":"-"},{"$f":"IFERROR(RANK(Table2[[#This Row],[GPA]],[GPA],0)+COUNTIF(Table2[[#This Row],[GPA]],Table2[[#This Row],[GPA]])-1,\"*\")","v":"*"}]
[null,{"$f":"PROCESSING!B44","v":0},{"$f":"PROCESSING!C44","v":0},{"$f":"PROCESSING!D44","v":"00:00:00"},{"$f":"PROCESSING!E44","v":0},{"$f":"PROCESSING!AP44","v":"-"},{"$f":"IFERROR(RANK(Table2[[#This Row],[GPA]],[GPA],0)+COUNTIF(Table2[[#This Row],[GPA]],Table2[[#This Row],[GPA]])-1,\"*\")","v":"*"}]
[null,{"$f":"PROCESSING!B45","v":0},{"$f":"PROCESSING!C45","v":0},{"$f":"PROCESSING!D45","v":"00:00:00"},{"$f":"PROCESSING!E45","v":0},{"$f":"PROCESSING!AP45","v":"-"},{"$f":"IFERROR(RANK(Table2[[#This Row],[GPA]],[GPA],0)+COUNTIF(Table2[[#This Row],[GPA]],Table2[[#This Row],[GPA]])-1,\"*\")","v":"*"}]
[null,{"$f":"PROCESSING!B46","v":0},{"$f":"PROCESSING!C46","v":0},{"$f":"PROCESSING!D46","v":"00:00:00"},{"$f":"PROCESSING!E46","v":0},{"$f":"PROCESSING!AP46","v":"-"},{"$f":"IFERROR(RANK(Table2[[#This Row],[GPA]],[GPA],0)+COUNTIF(Table2[[#This Row],[GPA]],Table2[[#This Row],[GPA]])-1,\"*\")","v":"*"}]
[null,{"$f":"PROCESSING!B47","v":0},{"$f":"PROCESSING!C47","v":0},{"$f":"PROCESSING!D47","v":"00:00:00"},{"$f":"PROCESSING!E47","v":0},{"$f":"PROCESSING!AP47","v":"-"},{"$f":"IFERROR(RANK(Table2[[#This Row],[GPA]],[GPA],0)+COUNTIF(Table2[[#This Row],[GPA]],Table2[[#This Row],[GPA]])-1,\"*\")","v":"*"}]
[null,{"$f":"PROCESSING!B48","v":0},{"$f":"PROCESSING!C48","v":0},{"$f":"PROCESSING!D48","v":"00:00:00"},{"$f":"PROCESSING!E48","v":0},{"$f":"PROCESSING!AP48","v":"-"},{"$f":"IFERROR(RANK(Table2[[#This Row],[GPA]],[GPA],0)+COUNTIF(Table2[[#This Row],[GPA]],Table2[[#This Row],[GPA]])-1,\"*\")","v":"*"}]
[null,{"$f":"PROCESSING!B49","v":0},{"$f":"PROCESSING!C49","v":0},{"$f":"PROCESSING!D49","v":"00:00:00"},{"$f":"PROCESSING!E49","v":0},{"$f":"PROCESSING!AP49","v":"-"},{"$f":"IFERROR(RANK(Table2[[#This Row],[GPA]],[GPA],0)+COUNTIF(Table2[[#This Row],[GPA]],Table2[[#This Row],[GPA]])-1,\"*\")","v":"*"}]
[null,{"$f":"PROCESSING!B50","v":0},{"$f":"PROCESSING!C50","v":0},{"$f":"PROCESSING!D50","v":"00:00:00"},{"$f":"PROCESSING!E50","v":0},{"$f":"PROCESSING!AP50","v":"-"},{"$f":"IFERROR(RANK(Table2[[#This Row],[GPA]],[GPA],0)+COUNTIF(Table2[[#This Row],[GPA]],Table2[[#This Row],[GPA]])-1,\"*\")","v":"*"}]
[null,{"$f":"PROCESSING!B51","v":0},{"$f":"PROCESSING!C51","v":0},{"$f":"PROCESSING!D51","v":"00:00:00"},{"$f":"PROCESSING!E51","v":0},{"$f":"PROCESSING!AP51","v":"-"},{"$f":"IFERROR(RANK(Table2[[#This Row],[GPA]],[GPA],0)+COUNTIF(Table2[[#This Row],[GPA]],Table2[[#This Row],[GPA]])-1,\"*\")","v":"*"}]
[null,{"$f":"PROCESSING!B52","v":0},{"$f":"PROCESSING!C52","v":0},{"$f":"PROCESSING!D52","v":"00:00:00"},{"$f":"PROCESSING!E52","v":0},{"$f":"PROCESSING!AP52","v":"-"},{"$f":"IFERROR(RANK(Table2[[#This Row],[GPA]],[GPA],0)+COUNTIF(Table2[[#This Row],[GPA]],Table2[[#This Row],[GPA]])-1,\"*\")","v":"*"}]
[null,{"$f":"PROCESSING!B53","v":0},{"$f":"PROCESSING!C53","v":0},{"$f":"PROCESSING!D53","v":"00:00:00"},{"$f":"PROCESSING!E53","v":0},{"$f":"PROCESSING!AP53","v":"-"},{"$f":"IFERROR(RANK(Table2[[#This Row],[GPA]],[GPA],0)+COUNTIF(Table2[[#This Row],[GPA]],Table2[[#This Row],[GPA]])-1,\"*\")","v":"*"}]
[null,{"$f":"PROCESSING!B54","v":0},{"$f":"PROCESSING!C54","v":0},{"$f":"PROCESSING!D54","v":"00:00:00"},{"$f":"PROCESSING!E54","v":0},{"$f":"PROCESSING!AP54","v":"-"},{"$f":"IFERROR(RANK(Table2[[#This Row],[GPA]],[GPA],0)+COUNTIF(Table2[[#This Row],[GPA]],Table2[[#This Row],[GPA]])-1,\"*\")","v":"*"}]
[null,{"$f":"PROCESSING!B55","v":0},{"$f":"PROCESSING!C55","v":0},{"$f":"PROCESSING!D55","v":"00:00:00"},{"$f":"PROCESSING!E55","v":0},{"$f":"PROCESSING!AP55","v":"-"},{"$f":"IFERROR(RANK(Table2[[#This Row],[GPA]],[GPA],0)+COUNTIF(Table2[[#This Row],[GPA]],Table2[[#This Row],[GPA]])-1,\"*\")","v":"*"}]
[null,{"$f":"PROCESSING!B56","v":0},{"$f":"PROCESSING!C56","v":0},{"$f":"PROCESSING!D56","v":"00:00:00"},{"$f":"PROCESSING!E56","v":0},{"$f":"PROCESSING!AP56","v":"-"},{"$f":"IFERROR(RANK(Table2[[#This Row],[GPA]],[GPA],0)+COUNTIF(Table2[[#This Row],[GPA]],Table2[[#This Row],[GPA]])-1,\"*\")","v":"*"}]
[null,{"$f":"PROCESSING!B57","v":0},{"$f":"PROCESSING!C57","v":0},{"$f":"PROCESSING!D57","v":"00:00:00"},{"$f":"PROCESSING!E57","v":0},{"$f":"PROCESSING!AP57","v":"-"},{"$f":"IFERROR(RANK(Table2[[#This Row],[GPA]],[GPA],0)+COUNTIF(Table2[[#This Row],[GPA]],Table2[[#This Row],[GPA]])-1,\"*\")","v":"*"}]
[null,{"$f":"PROCESSING!B58","v":0},{"$f":"PROCESSING!C58","v":0},{"$f":"PROCESSING!D58","v":"00:00:00"},{"$f":"PROCESSING!E58","v":0},{"$f":"PROCESSING!AP58","v":"-"},{"$f":"IFERROR(RANK(Table2[[#This Row],[GPA]],[GPA],0)+COUNTIF(Table2[[#This Row],[GPA]],Table2[[#This Row],[GPA]])-1,\"*\")","v":"*"}]
[null,{"$f":"PROCESSING!B59","v":0},{"$f":"PROCESSING!C59","v":0},{"$f":"PROCESSING!D59","v":"00:00:00"},{"$f":"PROCESSING!E59","v":0},{"$f":"PROCESSING!AP59","v":"-"},{"$f":"IFERROR(RANK(Table2[[#This Row],[GPA]],[GPA],0)+COUNTIF(Table2[[#This Row],[GPA]],Table2[[#This Row],[GPA]])-1,\"*\")","v":"*"}]
[null,{"$f":"PROCESSING!B60","v":0},{"$f":"PROCESSING!C60","v":0},{"$f":"PROCESSING!D60","v":"00:00:00"},{"$f":"PROCESSING!E60","v":0},{"$f":"PROCESSING!AP60","v":"-"},{"$f":"IFERROR(RANK(Table2[[#This Row],[GPA]],[GPA],0)+COUNTIF(Table2[[#This Row],[GPA]],Table2[[#This Row],[GPA]])-1,\"*\")","v":"*"}]
[null,{"$f":"PROCESSING!B61","v":0},{"$f":"PROCESSING!C61","v":0},{"$f":"PROCESSING!D61","v":"00:00:00"},{"$f":"PROCESSING!E61","v":0},{"$f":"PROCESSING!AP61","v":"-"},{"$f":"IFERROR(RANK(Table2[[#This Row],[GPA]],[GPA],0)+COUNTIF(Table2[[#This Row],[GPA]],Table2[[#This Row],[GPA]])-1,\"*\")","v":"*"}]
[null,{"$f":"PROCESSING!B62","v":0},{"$f":"PROCESSING!C62","v":0},{"$f":"PROCESSING!D62","v":"00:00:00"},{"$f":"PROCESSING!E62","v":0},{"$f":"PROCESSING!AP62","v":"-"},{"$f":"IFERROR(RANK(Table2[[#This Row],[GPA]],[GPA],0)+COUNTIF(Table2[[#This Row],[GPA]],Table2[[#This Row],[GPA]])-1,\"*\")","v":"*"}]
[null,{"$f":"PROCESSING!B63","v":0},{"$f":"PROCESSING!C63","v":0},{"$f":"PROCESSING!D63","v":"00:00:00"},{"$f":"PROCESSING!E63","v":0},{"$f":"PROCESSING!AP63","v":"-"},{"$f":"IFERROR(RANK(Table2[[#This Row],[GPA]],[GPA],0)+COUNTIF(Table2[[#This Row],[GPA]],Table2[[#This Row],[GPA]])-1,\"*\")","v":"*"}]
[null,{"$f":"PROCESSING!B64","v":0},{"$f":"PROCESSING!C64","v":0},{"$f":"PROCESSING!D64","v":"00:00:00"},{"$f":"PROCESSING!E64","v":0},{"$f":"PROCESSING!AP64","v":"-"},{"$f":"IFERROR(RANK(Table2[[#This Row],[GPA]],[GPA],0)+COUNTIF(Table2[[#This Row],[GPA]],Table2[[#This Row],[GPA]])-1,\"*\")","v":"*"}]
[null,{"$f":"PROCESSING!B65","v":0},{"$f":"PROCESSING!C65","v":0},{"$f":"PROCESSING!D65","v":"00:00:00"},{"$f":"PROCESSING!E65","v":0},{"$f":"PROCESSING!AP65","v":"-"},{"$f":"IFERROR(RANK(Table2[[#This Row],[GPA]],[GPA],0)+COUNTIF(Table2[[#This Row],[GPA]],Table2[[#This Row],[GPA]])-1,\"*\")","v":"*"}]
[null,{"$f":"PROCESSING!B66","v":0},{"$f":"PROCESSING!C66","v":0},{"$f":"PROCESSING!D66","v":"00:00:00"},{"$f":"PROCESSING!E66","v":0},{"$f":"PROCESSING!AP66","v":"-"},{"$f":"IFERROR(RANK(Table2[[#This Row],[GPA]],[GPA],0)+COUNTIF(Table2[[#This Row],[GPA]],Table2[[#This Row],[GPA]])-1,\"*\")","v":"*"}]
[null,{"$f":"PROCESSING!B67","v":0},{"$f":"PROCESSING!C67","v":0},{"$f":"PROCESSING!D67","v":"00:00:00"},{"$f":"PROCESSING!E67","v":0},{"$f":"PROCESSING!AP67","v":"-"},{"$f":"IFERROR(RANK(Table2[[#This Row],[GPA]],[GPA],0)+COUNTIF(Table2[[#This Row],[GPA]],Table2[[#This Row],[GPA]])-1,\"*\")","v":"*"}]
[null,{"$f":"PROCESSING!B68","v":0},{"$f":"PROCESSING!C68","v":0},{"$f":"PROCESSING!D68","v":"00:00:00"},{"$f":"PROCESSING!E68","v":0},{"$f":"PROCESSING!AP68","v":"-"},{"$f":"IFERROR(RANK(Table2[[#This Row],[GPA]],[GPA],0)+COUNTIF(Table2[[#This Row],[GPA]],Table2[[#This Row],[GPA]])-1,\"*\")","v":"*"}]
[null,{"$f":"PROCESSING!B69","v":0},{"$f":"PROCESSING!C69","v":0},{"$f":"PROCESSING!D69","v":"00:00:00"},{"$f":"PROCESSING!E69","v":0},{"$f":"PROCESSING!AP69","v":"-"},{"$f":"IFERROR(RANK(Table2[[#This Row],[GPA]],[GPA],0)+COUNTIF(Table2[[#This Row],[GPA]],Table2[[#This Row],[GPA]])-1,\"*\")","v":"*"}]
[null,{"$f":"PROCESSING!B70","v":0},{"$f":"PROCESSING!C70","v":0},{"$f":"PROCESSING!D70","v":"00:00:00"},{"$f":"PROCESSING!E70","v":0},{"$f":"PROCESSING!AP70","v":"-"},{"$f":"IFERROR(RANK(Table2[[#This Row],[GPA]],[GPA],0)+COUNTIF(Table2[[#This Row],[GPA]],Table2[[#This Row],[GPA]])-1,\"*\")","v":"*"}]
[null,{"$f":"PROCESSING!B71","v":0},{"$f":"PROCESSING!C71","v":0},{"$f":"PROCESSING!D71","v":"00:00:00"},{"$f":"PROCESSING!E71","v":0},{"$f":"PROCESSING!AP71","v":"-"},{"$f":"IFERROR(RANK(Table2[[#This Row],[GPA]],[GPA],0)+COUNTIF(Table2[[#This Row],[GPA]],Table2[[#This Row],[GPA]])-1,\"*\")","v":"*"}]
[null,{"$f":"PROCESSING!B72","v":0},{"$f":"PROCESSING!C72","v":0},{"$f":"PROCESSING!D72","v":"00:00:00"},{"$f":"PROCESSING!E72","v":0},{"$f":"PROCESSING!AP72","v":"-"},{"$f":"IFERROR(RANK(Table2[[#This Row],[GPA]],[GPA],0)+COUNTIF(Table2[[#This Row],[GPA]],Table2[[#This Row],[GPA]])-1,\"*\")","v":"*"}]
[null,{"$f":"PROCESSING!B73","v":0},{"$f":"PROCESSING!C73","v":0},{"$f":"PROCESSING!D73","v":"00:00:00"},{"$f":"PROCESSING!E73","v":0},{"$f":"PROCESSING!AP73","v":"-"},{"$f":"IFERROR(RANK(Table2[[#This Row],[GPA]],[GPA],0)+COUNTIF(Table2[[#This Row],[GPA]],Table2[[#This Row],[GPA]])-1,\"*\")","v":"*"}]
[null,{"$f":"PROCESSING!B74","v":0},{"$f":"PROCESSING!C74","v":0},{"$f":"PROCESSING!D74","v":"00:00:00"},{"$f":"PROCESSING!E74","v":0},{"$f":"PROCESSING!AP74","v":"-"},{"$f":"IFERROR(RANK(Table2[[#This Row],[GPA]],[GPA],0)+COUNTIF(Table2[[#This Row],[GPA]],Table2[[#This Row],[GPA]])-1,\"*\")","v":"*"}]
[null,{"$f":"PROCESSING!B75","v":0},{"$f":"PROCESSING!C75","v":0},{"$f":"PROCESSING!D75","v":"00:00:00"},{"$f":"PROCESSING!E75","v":0},{"$f":"PROCESSING!AP75","v":"-"},{"$f":"IFERROR(RANK(Table2[[#This Row],[GPA]],[GPA],0)+COUNTIF(Table2[[#This Row],[GPA]],Table2[[#This Row],[GPA]])-1,\"*\")","v":"*"}]
[null,{"$f":"PROCESSING!B76","v":0},{"$f":"PROCESSING!C76","v":0},{"$f":"PROCESSING!D76","v":"00:00:00"},{"$f":"PROCESSING!E76","v":0},{"$f":"PROCESSING!AP76","v":"-"},{"$f":"IFERROR(RANK(Table2[[#This Row],[GPA]],[GPA],0)+COUNTIF(Table2[[#This Row],[GPA]],Table2[[#This Row],[GPA]])-1,\"*\")","v":"*"}]
[null,{"$f":"PROCESSING!B77","v":0},{"$f":"PROCESSING!C77","v":0},{"$f":"PROCESSING!D77","v":"00:00:00"},{"$f":"PROCESSING!E77","v":0},{"$f":"PROCESSING!AP77","v":"-"},{"$f":"IFERROR(RANK(Table2[[#This Row],[GPA]],[GPA],0)+COUNTIF(Table2[[#This Row],[GPA]],Table2[[#This Row],[GPA]])-1,\"*\")","v":"*"}]
[null,{"$f":"PROCESSING!B78","v":0},{"$f":"PROCESSING!C78","v":0},{"$f":"PROCESSING!D78","v":"00:00:00"},{"$f":"PROCESSING!E78","v":0},{"$f":"PROCESSING!AP78","v":"-"},{"$f":"IFERROR(RANK(Table2[[#This Row],[GPA]],[GPA],0)+COUNTIF(Table2[[#This Row],[GPA]],Table2[[#This Row],[GPA]])-1,\"*\")","v":"*"}]
[null,{"$f":"PROCESSING!B79","v":0},{"$f":"PROCESSING!C79","v":0},{"$f":"PROCESSING!D79","v":"00:00:00"},{"$f":"PROCESSING!E79","v":0},{"$f":"PROCESSING!AP79","v":"-"},{"$f":"IFERROR(RANK(Table2[[#This Row],[GPA]],[GPA],0)+COUNTIF(Table2[[#This Row],[GPA]],Table2[[#This Row],[GPA]])-1,\"*\")","v":"*"}]
[null,{"$f":"PROCESSING!B80","v":0},{"$f":"PROCESSING!C80","v":0},{"$f":"PROCESSING!D80","v":"00:00:00"},{"$f":"PROCESSING!E80","v":0},{"$f":"PROCESSING!AP80","v":"-"},{"$f":"IFERROR(RANK(Table2[[#This Row],[GPA]],[GPA],0)+COUNTIF(Table2[[#This Row],[GPA]],Table2[[#This Row],[GPA]])-1,\"*\")","v":"*"}]
[null,{"$f":"PROCESSING!B81","v":0},{"$f":"PROCESSING!C81","v":0},{"$f":"PROCESSING!D81","v":"00:00:00"},{"$f":"PROCESSING!E81","v":0},{"$f":"PROCESSING!AP81","v":"-"},{"$f":"IFERROR(RANK(Table2[[#This Row],[GPA]],[GPA],0)+COUNTIF(Table2[[#This Row],[GPA]],Table2[[#This Row],[GPA]])-1,\"*\")","v":"*"}]
[null,{"$f":"PROCESSING!B82","v":0},{"$f":"PROCESSING!C82","v":0},{"$f":"PROCESSING!D82","v":"00:00:00"},{"$f":"PROCESSING!E82","v":0},{"$f":"PROCESSING!AP82","v":"-"},{"$f":"IFERROR(RANK(Table2[[#This Row],[GPA]],[GPA],0)+COUNTIF(Table2[[#This Row],[GPA]],Table2[[#This Row],[GPA]])-1,\"*\")","v":"*"}]
[null,{"$f":"PROCESSING!B83","v":0},{"$f":"PROCESSING!C83","v":0},{"$f":"PROCESSING!D83","v":"00:00:00"},{"$f":"PROCESSING!E83","v":0},{"$f":"PROCESSING!AP83","v":"-"},{"$f":"IFERROR(RANK(Table2[[#This Row],[GPA]],[GPA],0)+COUNTIF(Table2[[#This Row],[GPA]],Table2[[#This Row],[GPA]])-1,\"*\")","v":"*"}]
[null,{"$f":"PROCESSING!B84","v":0},{"$f":"PROCESSING!C84","v":0},{"$f":"PROCESSING!D84","v":"00:00:00"},{"$f":"PROCESSING!E84","v":0},{"$f":"PROCESSING!AP84","v":"-"},{"$f":"IFERROR(RANK(Table2[[#This Row],[GPA]],[GPA],0)+COUNTIF(Table2[[#This Row],[GPA]],Table2[[#This Row],[GPA]])-1,\"*\")","v":"*"}]
[null,{"$f":"PROCESSING!B85","v":0},{"$f":"PROCESSING!C85","v":0},{"$f":"PROCESSING!D85","v":"00:00:00"},{"$f":"PROCESSING!E85","v":0},{"$f":"PROCESSING!AP85","v":"-"},{"$f":"IFERROR(RANK(Table2[[#This Row],[GPA]],[GPA],0)+COUNTIF(Table2[[#This Row],[GPA]],Table2[[#This Row],[GPA]])-1,\"*\")","v":"*"}]
[null,{"$f":"PROCESSING!B86","v":0},{"$f":"PROCESSING!C86","v":0},{"$f":"PROCESSING!D86","v":"00:00:00"},{"$f":"PROCESSING!E86","v":0},{"$f":"PROCESSING!AP86","v":"-"},{"$f":"IFERROR(RANK(Table2[[#This Row],[GPA]],[GPA],0)+COUNTIF(Table2[[#This Row],[GPA]],Table2[[#This Row],[GPA]])-1,\"*\")","v":"*"}]
[null,{"$f":"PROCESSING!B87","v":0},{"$f":"PROCESSING!C87","v":0},{"$f":"PROCESSING!D87","v":"00:00:00"},{"$f":"PROCESSING!E87","v":0},{"$f":"PROCESSING!AP87","v":"-"},{"$f":"IFERROR(RANK(Table2[[#This Row],[GPA]],[GPA],0)+COUNTIF(Table2[[#This Row],[GPA]],Table2[[#This Row],[GPA]])-1,\"*\")","v":"*"}]
[null,{"$f":"PROCESSING!B88","v":0},{"$f":"PROCESSING!C88","v":0},{"$f":"PROCESSING!D88","v":"00:00:00"},{"$f":"PROCESSING!E88","v":0},{"$f":"PROCESSING!AP88","v":"-"},{"$f":"IFERROR(RANK(Table2[[#This Row],[GPA]],[GPA],0)+COUNTIF(Table2[[#This Row],[GPA]],Table2[[#This Row],[GPA]])-1,\"*\")","v":"*"}]
[null,{"$f":"PROCESSING!B89","v":0},{"$f":"PROCESSING!C89","v":0},{"$f":"PROCESSING!D89","v":"00:00:00"},{"$f":"PROCESSING!E89","v":0},{"$f":"PROCESSING!AP89","v":"-"},{"$f":"IFERROR(RANK(Table2[[#This Row],[GPA]],[GPA],0)+COUNTIF(Table2[[#This Row],[GPA]],Table2[[#This Row],[GPA]])-1,\"*\")","v":"*"}]
[null,{"$f":"PROCESSING!B90","v":0},{"$f":"PROCESSING!C90","v":0},{"$f":"PROCESSING!D90","v":"00:00:00"},{"$f":"PROCESSING!E90","v":0},{"$f":"PROCESSING!AP90","v":"-"},{"$f":"IFERROR(RANK(Table2[[#This Row],[GPA]],[GPA],0)+COUNTIF(Table2[[#This Row],[GPA]],Table2[[#This Row],[GPA]])-1,\"*\")","v":"*"}]
[null,{"$f":"PROCESSING!B91","v":0},{"$f":"PROCESSING!C91","v":0},{"$f":"PROCESSING!D91","v":"00:00:00"},{"$f":"PROCESSING!E91","v":0},{"$f":"PROCESSING!AP91","v":"-"},{"$f":"IFERROR(RANK(Table2[[#This Row],[GPA]],[GPA],0)+COUNTIF(Table2[[#This Row],[GPA]],Table2[[#This Row],[GPA]])-1,\"*\")","v":"*"}]
[null,{"$f":"PROCESSING!B92","v":0},{"$f":"PROCESSING!C92","v":0},{"$f":"PROCESSING!D92","v":"00:00:00"},{"$f":"PROCESSING!E92","v":0},{"$f":"PROCESSING!AP92","v":"-"},{"$f":"IFERROR(RANK(Table2[[#This Row],[GPA]],[GPA],0)+COUNTIF(Table2[[#This Row],[GPA]],Table2[[#This Row],[GPA]])-1,\"*\")","v":"*"}]
[null,{"$f":"PROCESSING!B93","v":0},{"$f":"PROCESSING!C93","v":0},{"$f":"PROCESSING!D93","v":"00:00:00"},{"$f":"PROCESSING!E93","v":0},{"$f":"PROCESSING!AP93","v":"-"},{"$f":"IFERROR(RANK(Table2[[#This Row],[GPA]],[GPA],0)+COUNTIF(Table2[[#This Row],[GPA]],Table2[[#This Row],[GPA]])-1,\"*\")","v":"*"}]
[null,{"$f":"PROCESSING!B94","v":0},{"$f":"PROCESSING!C94","v":0},{"$f":"PROCESSING!D94","v":"00:00:00"},{"$f":"PROCESSING!E94","v":0},{"$f":"PROCESSING!AP94","v":"-"},{"$f":"IFERROR(RANK(Table2[[#This Row],[GPA]],[GPA],0)+COUNTIF(Table2[[#This Row],[GPA]],Table2[[#This Row],[GPA]])-1,\"*\")","v":"*"}]
[null,{"$f":"PROCESSING!B95","v":0},{"$f":"PROCESSING!C95","v":0},{"$f":"PROCESSING!D95","v":"00:00:00"},{"$f":"PROCESSING!E95","v":0},{"$f":"PROCESSING!AP95","v":"-"},{"$f":"IFERROR(RANK(Table2[[#This Row],[GPA]],[GPA],0)+COUNTIF(Table2[[#This Row],[GPA]],Table2[[#This Row],[GPA]])-1,\"*\")","v":"*"}]
[null,{"$f":"PROCESSING!B96","v":0},{"$f":"PROCESSING!C96","v":0},{"$f":"PROCESSING!D96","v":"00:00:00"},{"$f":"PROCESSING!E96","v":0},{"$f":"PROCESSING!AP96","v":"-"},{"$f":"IFERROR(RANK(Table2[[#This Row],[GPA]],[GPA],0)+COUNTIF(Table2[[#This Row],[GPA]],Table2[[#This Row],[GPA]])-1,\"*\")","v":"*"}]
[null,{"$f":"PROCESSING!B97","v":0},{"$f":"PROCESSING!C97","v":0},{"$f":"PROCESSING!D97","v":"00:00:00"},{"$f":"PROCESSING!E97","v":0},{"$f":"PROCESSING!AP97","v":"-"},{"$f":"IFERROR(RANK(Table2[[#This Row],[GPA]],[GPA],0)+COUNTIF(Table2[[#This Row],[GPA]],Table2[[#This Row],[GPA]])-1,\"*\")","v":"*"}]
[null,{"$f":"PROCESSING!B98","v":0},{"$f":"PROCESSING!C98","v":0},{"$f":"PROCESSING!D98","v":"00:00:00"},{"$f":"PROCESSING!E98","v":0},{"$f":"PROCESSING!AP98","v":"-"},{"$f":"IFERROR(RANK(Table2[[#This Row],[GPA]],[GPA],0)+COUNTIF(Table2[[#This Row],[GPA]],Table2[[#This Row],[GPA]])-1,\"*\")","v":"*"}]
[null,{"$f":"PROCESSING!B99","v":0},{"$f":"PROCESSING!C99","v":0},{"$f":"PROCESSING!D99","v":"00:00:00"},{"$f":"PROCESSING!E99","v":0},{"$f":"PROCESSING!AP99","v":"-"},{"$f":"IFERROR(RANK(Table2[[#This Row],[GPA]],[GPA],0)+COUNTIF(Table2[[#This Row],[GPA]],Table2[[#This Row],[GPA]])-1,\"*\")","v":"*"}]
[null,{"$f":"PROCESSING!B100","v":0},{"$f":"PROCESSING!C100","v":0},{"$f":"PROCESSING!D100","v":"00:00:00"},{"$f":"PROCESSING!E100","v":0},{"$f":"PROCESSING!AP100","v":"-"},{"$f":"IFERROR(RANK(Table2[[#This Row],[GPA]],[GPA],0)+COUNTIF(Table2[[#This Row],[GPA]],Table2[[#This Row],[GPA]])-1,\"*\")","v":"*"}]
[null,{"$f":"PROCESSING!B101","v":0},{"$f":"PROCESSING!C101","v":0},{"$f":"PROCESSING!D101","v":"00:00:00"},{"$f":"PROCESSING!E101","v":0},{"$f":"PROCESSING!AP101","v":"-"},{"$f":"IFERROR(RANK(Table2[[#This Row],[GPA]],[GPA],0)+COUNTIF(Table2[[#This Row],[GPA]],Table2[[#This Row],[GPA]])-1,\"*\")","v":"*"}]
[null,{"$f":"PROCESSING!B102","v":0},{"$f":"PROCESSING!C102","v":0},{"$f":"PROCESSING!D102","v":"00:00:00"},{"$f":"PROCESSING!E102","v":0},{"$f":"PROCESSING!AP102","v":"-"},{"$f":"IFERROR(RANK(Table2[[#This Row],[GPA]],[GPA],0)+COUNTIF(Table2[[#This Row],[GPA]],Table2[[#This Row],[GPA]])-1,\"*\")","v":"*"}]
[null,{"$f":"PROCESSING!B103","v":0},{"$f":"PROCESSING!C103","v":0},{"$f":"PROCESSING!D103","v":"00:00:00"},{"$f":"PROCESSING!E103","v":0},{"$f":"PROCESSING!AP103","v":"-"},{"$f":"IFERROR(RANK(Table2[[#This Row],[GPA]],[GPA],0)+COUNTIF(Table2[[#This Row],[GPA]],Table2[[#This Row],[GPA]])-1,\"*\")","v":"*"}]
[null,{"$f":"PROCESSING!B104","v":0},{"$f":"PROCESSING!C104","v":0},{"$f":"PROCESSING!D104","v":"00:00:00"},{"$f":"PROCESSING!E104","v":0},{"$f":"PROCESSING!AP104","v":"-"},{"$f":"IFERROR(RANK(Table2[[#This Row],[GPA]],[GPA],0)+COUNTIF(Table2[[#This Row],[GPA]],Table2[[#This Row],[GPA]])-1,\"*\")","v":"*"}]
[null,{"$f":"PROCESSING!B105","v":0},{"$f":"PROCESSING!C105","v":0},{"$f":"PROCESSING!D105","v":"00:00:00"},{"$f":"PROCESSING!E105","v":0},{"$f":"PROCESSING!AP105","v":"-"},{"$f":"IFERROR(RANK(Table2[[#This Row],[GPA]],[GPA],0)+COUNTIF(Table2[[#This Row],[GPA]],Table2[[#This Row],[GPA]])-1,\"*\")","v":"*"}]
[null,{"$f":"PROCESSING!B106","v":0},{"$f":"PROCESSING!C106","v":0},{"$f":"PROCESSING!D106","v":"00:00:00"},{"$f":"PROCESSING!E106","v":0},{"$f":"PROCESSING!AP106","v":"-"},{"$f":"IFERROR(RANK(Table2[[#This Row],[GPA]],[GPA],0)+COUNTIF(Table2[[#This Row],[GPA]],Table2[[#This Row],[GPA]])-1,\"*\")","v":"*"}]
[null,{"$f":"PROCESSING!B107","v":0},{"$f":"PROCESSING!C107","v":0},{"$f":"PROCESSING!D107","v":"00:00:00"},{"$f":"PROCESSING!E107","v":0},{"$f":"PROCESSING!AP107","v":"-"},{"$f":"IFERROR(RANK(Table2[[#This Row],[GPA]],[GPA],0)+COUNTIF(Table2[[#This Row],[GPA]],Table2[[#This Row],[GPA]])-1,\"*\")","v":"*"}]
[null,{"$f":"PROCESSING!B108","v":0},{"$f":"PROCESSING!C108","v":0},{"$f":"PROCESSING!D108","v":"00:00:00"},{"$f":"PROCESSING!E108","v":0},{"$f":"PROCESSING!AP108","v":"-"},{"$f":"IFERROR(RANK(Table2[[#This Row],[GPA]],[GPA],0)+COUNTIF(Table2[[#This Row],[GPA]],Table2[[#This Row],[GPA]])-1,\"*\")","v":"*"}]
[null,{"$f":"PROCESSING!B109","v":0},{"$f":"PROCESSING!C109","v":0},{"$f":"PROCESSING!D109","v":"00:00:00"},{"$f":"PROCESSING!E109","v":0},{"$f":"PROCESSING!AP109","v":"-"},{"$f":"IFERROR(RANK(Table2[[#This Row],[GPA]],[GPA],0)+COUNTIF(Table2[[#This Row],[GPA]],Table2[[#This Row],[GPA]])-1,\"*\")","v":"*"}]
[null,{"$f":"PROCESSING!B110","v":0},{"$f":"PROCESSING!C110","v":0},{"$f":"PROCESSING!D110","v":"00:00:00"},{"$f":"PROCESSING!E110","v":0},{"$f":"PROCESSING!AP110","v":"-"},{"$f":"IFERROR(RANK(Table2[[#This Row],[GPA]],[GPA],0)+COUNTIF(Table2[[#This Row],[GPA]],Table2[[#This Row],[GPA]])-1,\"*\")","v":"*"}]
[null,{"$f":"PROCESSING!B111","v":0},{"$f":"PROCESSING!C111","v":0},{"$f":"PROCESSING!D111","v":"00:00:00"},{"$f":"PROCESSING!E111","v":0},{"$f":"PROCESSING!AP111","v":"-"},{"$f":"IFERROR(RANK(Table2[[#This Row],[GPA]],[GPA],0)+COUNTIF(Table2[[#This Row],[GPA]],Table2[[#This Row],[GPA]])-1,\"*\")","v":"*"}]
[null,{"$f":"PROCESSING!B112","v":0},{"$f":"PROCESSING!C112","v":0},{"$f":"PROCESSING!D112","v":"00:00:00"},{"$f":"PROCESSING!E112","v":0},{"$f":"PROCESSING!AP112","v":"-"},{"$f":"IFERROR(RANK(Table2[[#This Row],[GPA]],[GPA],0)+COUNTIF(Table2[[#This Row],[GPA]],Table2[[#This Row],[GPA]])-1,\"*\")","v":"*"}]
[null,{"$f":"PROCESSING!B113","v":0},{"$f":"PROCESSING!C113","v":0},{"$f":"PROCESSING!D113","v":"00:00:00"},{"$f":"PROCESSING!E113","v":0},{"$f":"PROCESSING!AP113","v":"-"},{"$f":"IFERROR(RANK(Table2[[#This Row],[GPA]],[GPA],0)+COUNTIF(Table2[[#This Row],[GPA]],Table2[[#This Row],[GPA]])-1,\"*\")","v":"*"}]
[null,{"$f":"PROCESSING!B114","v":0},{"$f":"PROCESSING!C114","v":0},{"$f":"PROCESSING!D114","v":"00:00:00"},{"$f":"PROCESSING!E114","v":0},{"$f":"PROCESSING!AP114","v":"-"},{"$f":"IFERROR(RANK(Table2[[#This Row],[GPA]],[GPA],0)+COUNTIF(Table2[[#This Row],[GPA]],Table2[[#This Row],[GPA]])-1,\"*\")","v":"*"}]
[null,{"$f":"PROCESSING!B115","v":0},{"$f":"PROCESSING!C115","v":0},{"$f":"PROCESSING!D115","v":"00:00:00"},{"$f":"PROCESSING!E115","v":0},{"$f":"PROCESSING!AP115","v":"-"},{"$f":"IFERROR(RANK(Table2[[#This Row],[GPA]],[GPA],0)+COUNTIF(Table2[[#This Row],[GPA]],Table2[[#This Row],[GPA]])-1,\"*\")","v":"*"}]
[null,{"$f":"PROCESSING!B116","v":0},{"$f":"PROCESSING!C116","v":0},{"$f":"PROCESSING!D116","v":"00:00:00"},{"$f":"PROCESSING!E116","v":0},{"$f":"PROCESSING!AP116","v":"-"},{"$f":"IFERROR(RANK(Table2[[#This Row],[GPA]],[GPA],0)+COUNTIF(Table2[[#This Row],[GPA]],Table2[[#This Row],[GPA]])-1,\"*\")","v":"*"}]
[null,{"$f":"PROCESSING!B117","v":0},{"$f":"PROCESSING!C117","v":0},{"$f":"PROCESSING!D117","v":"00:00:00"},{"$f":"PROCESSING!E117","v":0},{"$f":"PROCESSING!AP117","v":"-"},{"$f":"IFERROR(RANK(Table2[[#This Row],[GPA]],[GPA],0)+COUNTIF(Table2[[#This Row],[GPA]],Table2[[#This Row],[GPA]])-1,\"*\")","v":"*"}]
[null,{"$f":"PROCESSING!B118","v":0},{"$f":"PROCESSING!C118","v":0},{"$f":"PROCESSING!D118","v":"00:00:00"},{"$f":"PROCESSING!E118","v":0},{"$f":"PROCESSING!AP118","v":"-"},{"$f":"IFERROR(RANK(Table2[[#This Row],[GPA]],[GPA],0)+COUNTIF(Table2[[#This Row],[GPA]],Table2[[#This Row],[GPA]])-1,\"*\")","v":"*"}]
[null,{"$f":"PROCESSING!B119","v":0},{"$f":"PROCESSING!C119","v":0},{"$f":"PROCESSING!D119","v":"00:00:00"},{"$f":"PROCESSING!E119","v":0},{"$f":"PROCESSING!AP119","v":"-"},{"$f":"IFERROR(RANK(Table2[[#This Row],[GPA]],[GPA],0)+COUNTIF(Table2[[#This Row],[GPA]],Table2[[#This Row],[GPA]])-1,\"*\")","v":"*"}]
[null,{"$f":"PROCESSING!B120","v":0},{"$f":"PROCESSING!C120","v":0},{"$f":"PROCESSING!D120","v":"00:00:00"},{"$f":"PROCESSING!E120","v":0},{"$f":"PROCESSING!AP120","v":"-"},{"$f":"IFERROR(RANK(Table2[[#This Row],[GPA]],[GPA],0)+COUNTIF(Table2[[#This Row],[GPA]],Table2[[#This Row],[GPA]])-1,\"*\")","v":"*"}]
[null,{"$f":"PROCESSING!B121","v":0},{"$f":"PROCESSING!C121","v":0},{"$f":"PROCESSING!D121","v":"00:00:00"},{"$f":"PROCESSING!E121","v":0},{"$f":"PROCESSING!AP121","v":"-"},{"$f":"IFERROR(RANK(Table2[[#This Row],[GPA]],[GPA],0)+COUNTIF(Table2[[#This Row],[GPA]],Table2[[#This Row],[GPA]])-1,\"*\")","v":"*"}]
[null,{"$f":"PROCESSING!B122","v":0},{"$f":"PROCESSING!C122","v":0},{"$f":"PROCESSING!D122","v":"00:00:00"},{"$f":"PROCESSING!E122","v":0},{"$f":"PROCESSING!AP122","v":"-"},{"$f":"IFERROR(RANK(Table2[[#This Row],[GPA]],[GPA],0)+COUNTIF(Table2[[#This Row],[GPA]],Table2[[#This Row],[GPA]])-1,\"*\")","v":"*"}]
[null,{"$f":"PROCESSING!B123","v":0},{"$f":"PROCESSING!C123","v":0},{"$f":"PROCESSING!D123","v":"00:00:00"},{"$f":"PROCESSING!E123","v":0},{"$f":"PROCESSING!AP123","v":"-"},{"$f":"IFERROR(RANK(Table2[[#This Row],[GPA]],[GPA],0)+COUNTIF(Table2[[#This Row],[GPA]],Table2[[#This Row],[GPA]])-1,\"*\")","v":"*"}]
[null,{"$f":"PROCESSING!B124","v":0},{"$f":"PROCESSING!C124","v":0},{"$f":"PROCESSING!D124","v":"00:00:00"},{"$f":"PROCESSING!E124","v":0},{"$f":"PROCESSING!AP124","v":"-"},{"$f":"IFERROR(RANK(Table2[[#This Row],[GPA]],[GPA],0)+COUNTIF(Table2[[#This Row],[GPA]],Table2[[#This Row],[GPA]])-1,\"*\")","v":"*"}]
[null,{"$f":"PROCESSING!B125","v":0},{"$f":"PROCESSING!C125","v":0},{"$f":"PROCESSING!D125","v":"00:00:00"},{"$f":"PROCESSING!E125","v":0},{"$f":"PROCESSING!AP125","v":"-"},{"$f":"IFERROR(RANK(Table2[[#This Row],[GPA]],[GPA],0)+COUNTIF(Table2[[#This Row],[GPA]],Table2[[#This Row],[GPA]])-1,\"*\")","v":"*"}]
[null,{"$f":"PROCESSING!B126","v":0},{"$f":"PROCESSING!C126","v":0},{"$f":"PROCESSING!D126","v":"00:00:00"},{"$f":"PROCESSING!E126","v":0},{"$f":"PROCESSING!AP126","v":"-"},{"$f":"IFERROR(RANK(Table2[[#This Row],[GPA]],[GPA],0)+COUNTIF(Table2[[#This Row],[GPA]],Table2[[#This Row],[GPA]])-1,\"*\")","v":"*"}]
[null,{"$f":"PROCESSING!B127","v":0},{"$f":"PROCESSING!C127","v":0},{"$f":"PROCESSING!D127","v":"00:00:00"},{"$f":"PROCESSING!E127","v":0},{"$f":"PROCESSING!AP127","v":"-"},{"$f":"IFERROR(RANK(Table2[[#This Row],[GPA]],[GPA],0)+COUNTIF(Table2[[#This Row],[GPA]],Table2[[#This Row],[GPA]])-1,\"*\")","v":"*"}]
[null,{"$f":"PROCESSING!B128","v":0},{"$f":"PROCESSING!C128","v":0},{"$f":"PROCESSING!D128","v":"00:00:00"},{"$f":"PROCESSING!E128","v":0},{"$f":"PROCESSING!AP128","v":"-"},{"$f":"IFERROR(RANK(Table2[[#This Row],[GPA]],[GPA],0)+COUNTIF(Table2[[#This Row],[GPA]],Table2[[#This Row],[GPA]])-1,\"*\")","v":"*"}]
[null,{"$f":"PROCESSING!B129","v":0},{"$f":"PROCESSING!C129","v":0},{"$f":"PROCESSING!D129","v":"00:00:00"},{"$f":"PROCESSING!E129","v":0},{"$f":"PROCESSING!AP129","v":"-"},{"$f":"IFERROR(RANK(Table2[[#This Row],[GPA]],[GPA],0)+COUNTIF(Table2[[#This Row],[GPA]],Table2[[#This Row],[GPA]])-1,\"*\")","v":"*"}]
[null,{"$f":"PROCESSING!B130","v":0},{"$f":"PROCESSING!C130","v":0},{"$f":"PROCESSING!D130","v":"00:00:00"},{"$f":"PROCESSING!E130","v":0},{"$f":"PROCESSING!AP130","v":"-"},{"$f":"IFERROR(RANK(Table2[[#This Row],[GPA]],[GPA],0)+COUNTIF(Table2[[#This Row],[GPA]],Table2[[#This Row],[GPA]])-1,\"*\")","v":"*"}]
[null,{"$f":"PROCESSING!B131","v":0},{"$f":"PROCESSING!C131","v":0},{"$f":"PROCESSING!D131","v":"00:00:00"},{"$f":"PROCESSING!E131","v":0},{"$f":"PROCESSING!AP131","v":"-"},{"$f":"IFERROR(RANK(Table2[[#This Row],[GPA]],[GPA],0)+COUNTIF(Table2[[#This Row],[GPA]],Table2[[#This Row],[GPA]])-1,\"*\")","v":"*"}]
[null,{"$f":"PROCESSING!B132","v":0},{"$f":"PROCESSING!C132","v":0},{"$f":"PROCESSING!D132","v":"00:00:00"},{"$f":"PROCESSING!E132","v":0},{"$f":"PROCESSING!AP132","v":"-"},{"$f":"IFERROR(RANK(Table2[[#This Row],[GPA]],[GPA],0)+COUNTIF(Table2[[#This Row],[GPA]],Table2[[#This Row],[GPA]])-1,\"*\")","v":"*"}]
[null,{"$f":"PROCESSING!B133","v":0},{"$f":"PROCESSING!C133","v":0},{"$f":"PROCESSING!D133","v":"00:00:00"},{"$f":"PROCESSING!E133","v":0},{"$f":"PROCESSING!AP133","v":"-"},{"$f":"IFERROR(RANK(Table2[[#This Row],[GPA]],[GPA],0)+COUNTIF(Table2[[#This Row],[GPA]],Table2[[#This Row],[GPA]])-1,\"*\")","v":"*"}]
[null,{"$f":"PROCESSING!B134","v":0},{"$f":"PROCESSING!C134","v":0},{"$f":"PROCESSING!D134","v":"00:00:00"},{"$f":"PROCESSING!E134","v":0},{"$f":"PROCESSING!AP134","v":"-"},{"$f":"IFERROR(RANK(Table2[[#This Row],[GPA]],[GPA],0)+COUNTIF(Table2[[#This Row],[GPA]],Table2[[#This Row],[GPA]])-1,\"*\")","v":"*"}]
[null,{"$f":"PROCESSING!B135","v":0},{"$f":"PROCESSING!C135","v":0},{"$f":"PROCESSING!D135","v":"00:00:00"},{"$f":"PROCESSING!E135","v":0},{"$f":"PROCESSING!AP135","v":"-"},{"$f":"IFERROR(RANK(Table2[[#This Row],[GPA]],[GPA],0)+COUNTIF(Table2[[#This Row],[GPA]],Table2[[#This Row],[GPA]])-1,\"*\")","v":"*"}]
[null,{"$f":"PROCESSING!B136","v":0},{"$f":"PROCESSING!C136","v":0},{"$f":"PROCESSING!D136","v":"00:00:00"},{"$f":"PROCESSING!E136","v":0},{"$f":"PROCESSING!AP136","v":"-"},{"$f":"IFERROR(RANK(Table2[[#This Row],[GPA]],[GPA],0)+COUNTIF(Table2[[#This Row],[GPA]],Table2[[#This Row],[GPA]])-1,\"*\")","v":"*"}]
[null,{"$f":"PROCESSING!B137","v":0},{"$f":"PROCESSING!C137","v":0},{"$f":"PROCESSING!D137","v":"00:00:00"},{"$f":"PROCESSING!E137","v":0},{"$f":"PROCESSING!AP137","v":"-"},{"$f":"IFERROR(RANK(Table2[[#This Row],[GPA]],[GPA],0)+COUNTIF(Table2[[#This Row],[GPA]],Table2[[#This Row],[GPA]])-1,\"*\")","v":"*"}]
[null,{"$f":"PROCESSING!B138","v":0},{"$f":"PROCESSING!C138","v":0},{"$f":"PROCESSING!D138","v":"00:00:00"},{"$f":"PROCESSING!E138","v":0},{"$f":"PROCESSING!AP138","v":"-"},{"$f":"IFERROR(RANK(Table2[[#This Row],[GPA]],[GPA],0)+COUNTIF(Table2[[#This Row],[GPA]],Table2[[#This Row],[GPA]])-1,\"*\")","v":"*"}]
[null,{"$f":"PROCESSING!B139","v":0},{"$f":"PROCESSING!C139","v":0},{"$f":"PROCESSING!D139","v":"00:00:00"},{"$f":"PROCESSING!E139","v":0},{"$f":"PROCESSING!AP139","v":"-"},{"$f":"IFERROR(RANK(Table2[[#This Row],[GPA]],[GPA],0)+COUNTIF(Table2[[#This Row],[GPA]],Table2[[#This Row],[GPA]])-1,\"*\")","v":"*"}]
[null,{"$f":"PROCESSING!B140","v":0},{"$f":"PROCESSING!C140","v":0},{"$f":"PROCESSING!D140","v":"00:00:00"},{"$f":"PROCESSING!E140","v":0},{"$f":"PROCESSING!AP140","v":"-"},{"$f":"IFERROR(RANK(Table2[[#This Row],[GPA]],[GPA],0)+COUNTIF(Table2[[#This Row],[GPA]],Table2[[#This Row],[GPA]])-1,\"*\")","v":"*"}]
[null,{"$f":"PROCESSING!B141","v":0},{"$f":"PROCESSING!C141","v":0},{"$f":"PROCESSING!D141","v":"00:00:00"},{"$f":"PROCESSING!E141","v":0},{"$f":"PROCESSING!AP141","v":"-"},{"$f":"IFERROR(RANK(Table2[[#This Row],[GPA]],[GPA],0)+COUNTIF(Table2[[#This Row],[GPA]],Table2[[#This Row],[GPA]])-1,\"*\")","v":"*"}]
[null,{"$f":"PROCESSING!B142","v":0},{"$f":"PROCESSING!C142","v":0},{"$f":"PROCESSING!D142","v":"00:00:00"},{"$f":"PROCESSING!E142","v":0},{"$f":"PROCESSING!AP142","v":"-"},{"$f":"IFERROR(RANK(Table2[[#This Row],[GPA]],[GPA],0)+COUNTIF(Table2[[#This Row],[GPA]],Table2[[#This Row],[GPA]])-1,\"*\")","v":"*"}]
[null,{"$f":"PROCESSING!B143","v":0},{"$f":"PROCESSING!C143","v":0},{"$f":"PROCESSING!D143","v":"00:00:00"},{"$f":"PROCESSING!E143","v":0},{"$f":"PROCESSING!AP143","v":"-"},{"$f":"IFERROR(RANK(Table2[[#This Row],[GPA]],[GPA],0)+COUNTIF(Table2[[#This Row],[GPA]],Table2[[#This Row],[GPA]])-1,\"*\")","v":"*"}]
[null,{"$f":"PROCESSING!B144","v":0},{"$f":"PROCESSING!C144","v":0},{"$f":"PROCESSING!D144","v":"00:00:00"},{"$f":"PROCESSING!E144","v":0},{"$f":"PROCESSING!AP144","v":"-"},{"$f":"IFERROR(RANK(Table2[[#This Row],[GPA]],[GPA],0)+COUNTIF(Table2[[#This Row],[GPA]],Table2[[#This Row],[GPA]])-1,\"*\")","v":"*"}]
[null,{"$f":"PROCESSING!B145","v":0},{"$f":"PROCESSING!C145","v":0},{"$f":"PROCESSING!D145","v":"00:00:00"},{"$f":"PROCESSING!E145","v":0},{"$f":"PROCESSING!AP145","v":"-"},{"$f":"IFERROR(RANK(Table2[[#This Row],[GPA]],[GPA],0)+COUNTIF(Table2[[#This Row],[GPA]],Table2[[#This Row],[GPA]])-1,\"*\")","v":"*"}]
[null,{"$f":"PROCESSING!B146","v":0},{"$f":"PROCESSING!C146","v":0},{"$f":"PROCESSING!D146","v":"00:00:00"},{"$f":"PROCESSING!E146","v":0},{"$f":"PROCESSING!AP146","v":"-"},{"$f":"IFERROR(RANK(Table2[[#This Row],[GPA]],[GPA],0)+COUNTIF(Table2[[#This Row],[GPA]],Table2[[#This Row],[GPA]])-1,\"*\")","v":"*"}]
[null,{"$f":"PROCESSING!B147","v":0},{"$f":"PROCESSING!C147","v":0},{"$f":"PROCESSING!D147","v":"00:00:00"},{"$f":"PROCESSING!E147","v":0},{"$f":"PROCESSING!AP147","v":"-"},{"$f":"IFERROR(RANK(Table2[[#This Row],[GPA]],[GPA],0)+COUNTIF(Table2[[#This Row],[GPA]],Table2[[#This Row],[GPA]])-1,\"*\")","v":"*"}]
[null,{"$f":"PROCESSING!B148","v":0},{"$f":"PROCESSING!C148","v":0},{"$f":"PROCESSING!D148","v":"00:00:00"},{"$f":"PROCESSING!E148","v":0},{"$f":"PROCESSING!AP148","v":"-"},{"$f":"IFERROR(RANK(Table2[[#This Row],[GPA]],[GPA],0)+COUNTIF(Table2[[#This Row],[GPA]],Table2[[#This Row],[GPA]])-1,\"*\")","v":"*"}]
[null,{"$f":"PROCESSING!B149","v":0},{"$f":"PROCESSING!C149","v":0},{"$f":"PROCESSING!D149","v":"00:00:00"},{"$f":"PROCESSING!E149","v":0},{"$f":"PROCESSING!AP149","v":"-"},{"$f":"IFERROR(RANK(Table2[[#This Row],[GPA]],[GPA],0)+COUNTIF(Table2[[#This Row],[GPA]],Table2[[#This Row],[GPA]])-1,\"*\")","v":"*"}]
[null,{"$f":"PROCESSING!B150","v":0},{"$f":"PROCESSING!C150","v":0},{"$f":"PROCESSING!D150","v":"00:00:00"},{"$f":"PROCESSING!E150","v":0},{"$f":"PROCESSING!AP150","v":"-"},{"$f":"IFERROR(RANK(Table2[[#This Row],[GPA]],[GPA],0)+COUNTIF(Table2[[#This Row],[GPA]],Table2[[#This Row],[GPA]])-1,\"*\")","v":"*"}]
[null,{"$f":"PROCESSING!B151","v":0},{"$f":"PROCESSING!C151","v":0},{"$f":"PROCESSING!D151","v":"00:00:00"},{"$f":"PROCESSING!E151","v":0},{"$f":"PROCESSING!AP151","v":"-"},{"$f":"IFERROR(RANK(Table2[[#This Row],[GPA]],[GPA],0)+COUNTIF(Table2[[#This Row],[GPA]],Table2[[#This Row],[GPA]])-1,\"*\")","v":"*"}]
[null,{"$f":"PROCESSING!B152","v":0},{"$f":"PROCESSING!C152","v":0},{"$f":"PROCESSING!D152","v":"00:00:00"},{"$f":"PROCESSING!E152","v":0},{"$f":"PROCESSING!AP152","v":"-"},{"$f":"IFERROR(RANK(Table2[[#This Row],[GPA]],[GPA],0)+COUNTIF(Table2[[#This Row],[GPA]],Table2[[#This Row],[GPA]])-1,\"*\")","v":"*"}]
[null,{"$f":"PROCESSING!B153","v":0},{"$f":"PROCESSING!C153","v":0},{"$f":"PROCESSING!D153","v":"00:00:00"},{"$f":"PROCESSING!E153","v":0},{"$f":"PROCESSING!AP153","v":"-"},{"$f":"IFERROR(RANK(Table2[[#This Row],[GPA]],[GPA],0)+COUNTIF(Table2[[#This Row],[GPA]],Table2[[#This Row],[GPA]])-1,\"*\")","v":"*"}]
[null,{"$f":"PROCESSING!B154","v":0},{"$f":"PROCESSING!C154","v":0},{"$f":"PROCESSING!D154","v":"00:00:00"},{"$f":"PROCESSING!E154","v":0},{"$f":"PROCESSING!AP154","v":"-"},{"$f":"IFERROR(RANK(Table2[[#This Row],[GPA]],[GPA],0)+COUNTIF(Table2[[#This Row],[GPA]],Table2[[#This Row],[GPA]])-1,\"*\")","v":"*"}]

{"sheet":"std1","index":5,"n_rows":42,"n_cols":10,"rows_kept":42,"cut":false,"hidden":false,"merged":[[2,2,6,9],[11,2,11,4],[11,5,11,9],[12,7,12,8],[13,2,13,3],[13,5,13,6],[14,2,14,4],[14,5,14,6],[14,7,14,9],[16,2,17,2],[16,3,17,4],[16,5,17,5],[16,6,17,6],[16,7,17,7],[16,8,17,8],[16,9,17,9],[18,3,18,4],[18,8,19,8],[19,3,19,4],[20,3,20,4],[20,8,21,8],[21,3,21,4],[22,3,22,4],[22,8,23,8],[23,3,23,4],[24,3,24,4],[24,8,25,8],[25,3,25,4],[34,2,34,4],[26,3,26,4],[26,8,27,8],[27,3,27,4],[28,3,28,4],[28,8,29,8],[29,3,29,4],[30,2,30,7],[31,2,31,9],[32,3,32,4],[32,8,33,8],[33,3,33,4],[41,2,41,3],[41,7,41,8],[35,2,35,4],[36,2,36,3],[36,7,36,9],[38,2,38,6],[39,2,39,9],[40,2,40,6]]}
[]
[]
[]
[]
[]
[]
[]
[]
[]
[]
[]
[null,null,"THE GRADE(S) SECURED BY   :",null,null,{"$f":"IFERROR(VLOOKUP(H14,ledger,2,0),\"This Symbol No. is not in Grade Ledger\")","v":"ALISHA KARKI "}]
[null,null,"DATE OF BIRTH :",null,{"$f":"VLOOKUP(H14,ledger,3,0)","v":"4/31/2063"},"B.S.","       (",null,null,"A.D.)"]
[null,null,"REGISTRATION NO.",null,{"$f":"VLOOKUP(H14,ledger,4,0)","v":"801130210001"},"SYMBOL NO.",null,11301320,"GRADE","XI"]
[null,null,"IN THE EXAMINATION CONDUCTED IN ",null,null,"2080 B.S. (2022 A.D.)",null,"ARE GIVEN BELOW."]
[]
[null,null,"SUBJECT CODE","SUBJECTS",null,"CREDIT HOUR (CH)","GRADE","GARDE POINT (GP)","FINAL GRADE (FG) ","REMARKS"]
[]
[null,null,{"$f":"VLOOKUP(H14,ledger,5,0)","v":"0011"},{"$f":"IFERROR(VLOOKUP(C19,codesub,2,0),\"SUB.CODE IS WRONG\")","v":"COM. NEPALI (TH)"},null,2.25,{"$f":"VLOOKUP(H14,ledger,6,0)","v":"C+"},{"$f":"VLOOKUP(H14,ledger,7,0)","v":2.4},{"$f":"VLOOKUP(H14,ledger,10,0)","v":"C+"}]
[null,null,{"$f":"IF(C19=\"0011\",\"0012\",\"SORRY\")","v":"0012"},{"$f":"IF(C20=\"0012\",\"COM. NEPALI (IN)\",\"SUB.CODE IS WRONG\")","v":"COM. NEPALI (IN)"},null,0.75,{"$f":"VLOOKUP(H14,ledger,8,0)","v":"C"},{"$f":"VLOOKUP(H14,ledger,9,0)","v":2}]
[null,null,{"$f":"VLOOKUP(H14,ledger,11,0)","v":"0031"},{"$f":"IFERROR(VLOOKUP(C21,codesub,2,0),\"SUB.CODE IS WRONG\")","v":"COM. ENGLISH (TH)"},null,3,{"$f":"VLOOKUP(H14,ledger,12,0)","v":"C+"},{"$f":"VLOOKUP(H14,ledger,13,0)","v":2.4},{"$f":"VLOOKUP(H14,ledger,16,0)","v":"C+"}]
[null,null,{"$f":"IF(C21=\"0031\",\"0032\",\"SORRY\")","v":"0032"},{"$f":"IF(C22=\"0032\",\"COM. ENGLISH (IN)\",\"SUB.CODE IS WRONG\")","v":"COM. ENGLISH (IN)"},null,1,{"$f":"VLOOKUP(H14,ledger,14,0)","v":"C"},{"$f":"VLOOKUP(H14,ledger,15,0)","v":2}]
[null,null,{"$f":"VLOOKUP(H14,ledger,17,0)","v":"0051"},{"$f":"IF(C23=\"0051\",\"COM. SOCIAL STUDIES & LIFE SKILL (TH)\",IF(C23=\"0071\",\"COM. MATHEMATICS (TH)\",\"SUB.CODE IS WRONG\"))","v":"COM. SOCIAL STUDIES & LIFE SKILL (TH)"},null,3.75,{"$f":"VLOOKUP(H14,ledger,18,0)","v":"C+"},{"$f":"VLOOKUP(H14,ledger,19,0)","v":2.4},{"$f":"VLOOKUP(H14,ledger,22,0)","v":"B"},{"$f":"IF(OR($I$19=\"NG\",$I$21=\"NG\",$I$23=\"NG\",$I$25=\"NG\",$I$27=\"NG\",$I$29=\"NG\"),\"W\",\"\")","v":""}]
[null,null,{"$f":"IF(C23=\"0051\",\"0052\",IF(C23=\"0071\",\"0072\",\"SORRY\"))","v":"0052"},{"$f":"IF(C24=\"0052\",\"COM. SOCIAL STUDIES & LIFE SKILL (IN)\",IF(C24=\"0072\",\"COM. MATHEMATICS (IN)\",\"SUB.CODE IS WRONG\"))","v":"COM. SOCIAL STUDIES & LIFE SKILL (IN)"},null,1.25,{"$f":"VLOOKUP(H14,ledger,20,0)","v":"A"},{"$f":"VLOOKUP(H14,ledger,21,0)","v":3.6},null,{"$f":"IF(OR($I$19=\"ABS\",$I$21=\"ABS\",$I$23=\"ABS\",$I$25=\"ABS\",$I$27=\"ABS\",$I$29=\"ABS\"),\"ABS\",\"\")","v":""}]
[null,null,{"$f":"VLOOKUP(H14,ledger,23,0)","v":1031},{"$f":"IFERROR(VLOOKUP(C25,codesub,2,0),\"SUB.CODE IS WRONG\")","v":"ACCOUNTING (TH)"},null,3.75,{"$f":"VLOOKUP(H14,ledger,24,0)","v":"A"},{"$f":"VLOOKUP(H14,ledger,25,0)","v":3.6},{"$f":"VLOOKUP(H14,ledger,28,0)","v":"A+"}]
[null,null,{"$f":"C25+1","v":1032},"ACCOUNTING (IN)",null,1.25,{"$f":"VLOOKUP(H14,ledger,26,0)","v":"A+"},{"$f":"VLOOKUP(H14,ledger,27,0)","v":4}]
[null,null,{"$f":"VLOOKUP(H14,ledger,29,0)","v":4251},"SINGING (TH)",null,3.75,{"$f":"VLOOKUP(H14,ledger,30,0)","v":"C"},{"$f":"VLOOKUP(H14,ledger,31,0)","v":2},{"$f":"VLOOKUP(H14,ledger,34,0)","v":"B"}]
[null,null,{"$f":"C27+1","v":4252},"SINGING (IN)",null,1.25,{"$f":"VLOOKUP(H14,ledger,32,0)","v":"A+"},{"$f":"VLOOKUP(H14,ledger,33,0)","v":4}]
[null,null,{"$f":"VLOOKUP(H14,ledger,35,0)","v":4171},{"$f":"IFERROR(VLOOKUP(C29,codesub,2,0),\"SUB.CODE IS WRONG\")","v":"FINANCE (TH)"},null,3.75,{"$f":"VLOOKUP(H14,ledger,36,0)","v":"B"},{"$f":"VLOOKUP(H14,ledger,37,0)","v":2.8},{"$f":"VLOOKUP(H14,ledger,40,0)","v":"B+"}]
[null,null,{"$f":"C29+1","v":4172},"FINANCE (IN)",null,1.25,{"$f":"VLOOKUP(H14,ledger,38,0)","v":"A"},{"$f":"VLOOKUP(H14,ledger,39,0)","v":3.6}]
[null,null,"GRADE POINT AVERAGE (GPA) :",null,null,null,null,null,{"$f":"VLOOKUP(H14,ledger,41,0)","v":2.8}]
[null,null,"EXTRA CREDIT SUBJECT"]
[null,null,{"$f":"IFERROR(VLOOKUP(H14,ledger,42,0),\"\")","v":0},{"$f":"IFERROR(VLOOKUP(C33,codesub,2,0),\"SUB.CODE IS WRONG\")","v":"SUB.CODE IS WRONG"},null,null,{"$f":"VLOOKUP(H14,ledger,43,0)","v":"ABS"},{"$f":"VLOOKUP(H14,ledger,44,0)","v":"ABS"},{"$f":"VLOOKUP(H14,ledger,47,0)","v":""}]
[null,null,{"$f":"IFERROR(C33+1,\"\")","v":1},{"$f":"IFERROR(VLOOKUP(C34,codesub,2,0),\"SUB.CODE IS WRONG\")","v":"SUB.CODE IS WRONG"},null,null,{"$f":"VLOOKUP(H14,ledger,45,0)","v":"ABS"},{"$f":"VLOOKUP(H14,ledger,46,0)","v":"ABS"}]
[null,null,"PREPARED BY : …………………………"]
[null,null,"CHECKED BY : …………………………"]
[null,null,"DATE OF ISSUE     :",null,"2079.03.15",null,null,"HEAD TEACHER"]
[]
[null,null,"NOTE : ONE CREDIT HOUR EQUALS TO 32 WORKING HOURS"]
[null,null,"INTERNAL (IN) : THIS COVERS THE PARTICIPATION, PRACTICAL/PROJECT WORKS, COMMUNITY \n                                     WORKS, INTERNSHIP, PRESENTATIONS, TERMINAL EXAMINATIONS."]
[null,null,"THEORY (TH) :  THIS COVERS WRITTEN EXTERNAL EXAMINATION"]
[null,null,"ABS = ABSENT",null,null,null,"       ","W= WITHHELD"]

{"sheet":"std2","index":6,"n_rows":42,"n_cols":10,"rows_kept":42,"cut":false,"hidden":false,"merged":[[2,2,6,9],[11,2,11,4],[11,5,11,9],[12,7,12,8],[13,2,13,3],[13,5,13,6],[14,2,14,4],[14,5,14,6],[14,7,14,9],[16,2,17,2],[16,3,17,4],[16,5,17,5],[16,6,17,6],[16,7,17,7],[16,8,17,8],[16,9,17,9],[18,3,18,4],[18,8,19,8],[19,3,19,4],[20,3,20,4],[20,8,21,8],[21,3,21,4],[22,3,22,4],[22,8,23,8],[23,3,23,4],[24,3,24,4],[24,8,25,8],[25,3,25,4],[34,2,34,4],[26,3,26,4],[26,8,27,8],[27,3,27,4],[28,3,28,4],[28,8,29,8],[29,3,29,4],[30,2,30,7],[31,2,31,9],[32,3,32,4],[32,8,33,8],[33,3,33,4],[41,2,41,3],[41,7,41,8],[35,2,35,4],[36,2,36,3],[36,7,36,9],[38,2,38,6],[39,2,39,9],[40,2,40,6]]}
[]
[]
[]
[]
[]
[]
[]
[]
[]
[]
[]
[null,null,"THE GRADE(S) SECURED BY   :",null,null,{"$f":"IFERROR(VLOOKUP(H14,ledger,2,0),\"This Symbol No. is not in Grade Ledger\")","v":"AMRITA RAI "}]
[null,null,"DATE OF BIRTH :",null,{"$f":"VLOOKUP(H14,ledger,3,0)","v":"2063-09-02"},"B.S.","       (",null,null,"A.D.)"]
[null,null,"REGISTRATION NO.",null,{"$f":"VLOOKUP(H14,ledger,4,0)","v":"801130210002"},"SYMBOL NO.",null,11301321,"GRADE","XI"]
[null,null,"IN THE EXAMINATION CONDUCTED IN ",null,null,"2080 B.S. (2022 A.D.)",null,"ARE GIVEN BELOW."]
[]
[null,null,"SUBJECT CODE","SUBJECTS",null,"CREDIT HOUR (CH)","GRADE","GARDE POINT (GP)","FINAL GRADE (FG) ","REMARKS"]
[]
[null,null,{"$f":"VLOOKUP(H14,ledger,5,0)","v":"0011"},{"$f":"IFERROR(VLOOKUP(C19,codesub,2,0),\"SUB.CODE IS WRONG\")","v":"COM. NEPALI (TH)"},null,2.25,{"$f":"VLOOKUP(H14,ledger,6,0)","v":"C+"},{"$f":"VLOOKUP(H14,ledger,7,0)","v":2.4},{"$f":"VLOOKUP(H14,ledger,10,0)","v":"C+"}]
[null,null,{"$f":"IF(C19=\"0011\",\"0012\",\"SORRY\")","v":"0012"},{"$f":"IF(C20=\"0012\",\"COM. NEPALI (IN)\",\"SUB.CODE IS WRONG\")","v":"COM. NEPALI (IN)"},null,0.75,{"$f":"VLOOKUP(H14,ledger,8,0)","v":"C"},{"$f":"VLOOKUP(H14,ledger,9,0)","v":2}]
[null,null,{"$f":"VLOOKUP(H14,ledger,11,0)","v":"0031"},{"$f":"IFERROR(VLOOKUP(C21,codesub,2,0),\"SUB.CODE IS WRONG\")","v":"COM. ENGLISH (TH)"},null,3,{"$f":"VLOOKUP(H14,ledger,12,0)","v":"C+"},{"$f":"VLOOKUP(H14,ledger,13,0)","v":2.4},{"$f":"VLOOKUP(H14,ledger,16,0)","v":"C+"}]
[null,null,{"$f":"IF(C21=\"0031\",\"0032\",\"SORRY\")","v":"0032"},{"$f":"IF(C22=\"0032\",\"COM. ENGLISH (IN)\",\"SUB.CODE IS WRONG\")","v":"COM. ENGLISH (IN)"},null,1,{"$f":"VLOOKUP(H14,ledger,14,0)","v":"C"},{"$f":"VLOOKUP(H14,ledger,15,0)","v":2}]
[null,null,{"$f":"VLOOKUP(H14,ledger,17,0)","v":"0051"},{"$f":"IF(C23=\"0051\",\"COM. SOCIAL STUDIES & LIFE SKILL (TH)\",IF(C23=\"0071\",\"COM. MATHEMATICS (TH)\",\"SUB.CODE IS WRONG\"))","v":"COM. SOCIAL STUDIES & LIFE SKILL (TH)"},null,3.75,{"$f":"VLOOKUP(H14,ledger,18,0)","v":"A+"},{"$f":"VLOOKUP(H14,ledger,19,0)","v":4},{"$f":"VLOOKUP(H14,ledger,22,0)","v":"A+"},{"$f":"IF(OR($I$19=\"NG\",$I$21=\"NG\",$I$23=\"NG\",$I$25=\"NG\",$I$27=\"NG\",$I$29=\"NG\"),\"W\",\"\")","v":""}]
[null,null,{"$f":"IF(C23=\"0051\",\"0052\",IF(C23=\"0071\",\"0072\",\"SORRY\"))","v":"0052"},{"$f":"IF(C24=\"0052\",\"COM. SOCIAL STUDIES & LIFE SKILL (IN)\",IF(C24=\"0072\",\"COM. MATHEMATICS (IN)\",\"SUB.CODE IS WRONG\"))","v":"COM. SOCIAL STUDIES & LIFE SKILL (IN)"},null,1.25,{"$f":"VLOOKUP(H14,ledger,20,0)","v":"A+"},{"$f":"VLOOKUP(H14,ledger,21,0)","v":4},null,{"$f":"IF(OR($I$19=\"ABS\",$I$21=\"ABS\",$I$23=\"ABS\",$I$25=\"ABS\",$I$27=\"ABS\",$I$29=\"ABS\"),\"ABS\",\"\")","v":""}]
[null,null,{"$f":"VLOOKUP(H14,ledger,23,0)","v":1031},{"$f":"IFERROR(VLOOKUP(C25,codesub,2,0),\"SUB.CODE IS WRONG\")","v":"ACCOUNTING (TH)"},null,3.75,{"$f":"VLOOKUP(H14,ledger,24,0)","v":"A"},{"$f":"VLOOKUP(H14,ledger,25,0)","v":3.6},{"$f":"VLOOKUP(H14,ledger,28,0)","v":"A+"}]
[null,null,{"$f":"C25+1","v":1032},"ACCOUNTING (IN)",null,1.25,{"$f":"VLOOKUP(H14,ledger,26,0)","v":"A+"},{"$f":"VLOOKUP(H14,ledger,27,0)","v":4}]
[null,null,{"$f":"VLOOKUP(H14,ledger,29,0)","v":4251},"SINGING (TH)",null,3.75,{"$f":"VLOOKUP(H14,ledger,30,0)","v":"C"},{"$f":"VLOOKUP(H14,ledger,31,0)","v":2},{"$f":"VLOOKUP(H14,ledger,34,0)","v":"B"}]
[null,null,{"$f":"C27+1","v":4252},"SINGING (IN)",null,1.25,{"$f":"VLOOKUP(H14,ledger,32,0)","v":"A+"},{"$f":"VLOOKUP(H14,ledger,33,0)","v":4}]
[null,null,{"$f":"VLOOKUP(H14,ledger,35,0)","v":4171},{"$f":"IFERROR(VLOOKUP(C29,codesub,2,0),\"SUB.CODE IS WRONG\")","v":"FINANCE (TH)"},null,3.75,{"$f":"VLOOKUP(H14,ledger,36,0)","v":"A"},{"$f":"VLOOKUP(H14,ledger,37,0)","v":3.6},{"$f":"VLOOKUP(H14,ledger,40,0)","v":"A"}]
[null,null,{"$f":"C29+1","v":4172},"FINANCE (IN)",null,1.25,{"$f":"VLOOKUP(H14,ledger,38,0)","v":"A"},{"$f":"VLOOKUP(H14,ledger,39,0)","v":3.6}]
[null,null,"GRADE POINT AVERAGE (GPA) :",null,null,null,null,null,{"$f":"VLOOKUP(H14,ledger,41,0)","v":3.1518518518518515}]
[null,null,"EXTRA CREDIT SUBJECT"]
[null,null,{"$f":"IFERROR(VLOOKUP(H14,ledger,42,0),\"\")","v":0},{"$f":"IFERROR(VLOOKUP(C33,codesub,2,0),\"SUB.CODE IS WRONG\")","v":"SUB.CODE IS WRONG"},null,null,{"$f":"VLOOKUP(H14,ledger,43,0)","v":"ABS"},{"$f":"VLOOKUP(H14,ledger,44,0)","v":"ABS"},{"$f":"VLOOKUP(H14,ledger,47,0)","v":""}]
[null,null,{"$f":"IFERROR(C33+1,\"\")","v":1},{"$f":"IFERROR(VLOOKUP(C34,codesub,2,0),\"SUB.CODE IS WRONG\")","v":"SUB.CODE IS WRONG"},null,null,{"$f":"VLOOKUP(H14,ledger,45,0)","v":"ABS"},{"$f":"VLOOKUP(H14,ledger,46,0)","v":"ABS"}]
[null,null,"PREPARED BY : …………………………"]
[null,null,"CHECKED BY : …………………………"]
[null,null,"DATE OF ISSUE     :",null,"2079.03.15",null,null,"HEAD TEACHER"]
[]
[null,null,"NOTE : ONE CREDIT HOUR EQUALS TO 32 WORKING HOURS"]
[null,null,"INTERNAL (IN) : THIS COVERS THE PARTICIPATION, PRACTICAL/PROJECT WORKS, COMMUNITY \n                                     WORKS, INTERNSHIP, PRESENTATIONS, TERMINAL EXAMINATIONS."]
[null,null,"THEORY (TH) :  THIS COVERS WRITTEN EXTERNAL EXAMINATION"]
[null,null,"ABS = ABSENT",null,null,null,"       ","W= WITHHELD"]

{"sheet":"std3","index":7,"n_rows":42,"n_cols":10,"rows_kept":42,"cut":false,"hidden":false,"merged":[[2,2,6,9],[11,2,11,4],[11,5,11,9],[12,7,12,8],[13,2,13,3],[13,5,13,6],[14,2,14,4],[14,5,14,6],[14,7,14,9],[16,2,17,2],[16,3,17,4],[16,5,17,5],[16,6,17,6],[16,7,17,7],[16,8,17,8],[16,9,17,9],[18,3,18,4],[18,8,19,8],[19,3,19,4],[20,3,20,4],[20,8,21,8],[21,3,21,4],[22,3,22,4],[22,8,23,8],[23,3,23,4],[24,3,24,4],[24,8,25,8],[25,3,25,4],[34,2,34,4],[26,3,26,4],[26,8,27,8],[27,3,27,4],[28,3,28,4],[28,8,29,8],[29,3,29,4],[30,2,30,7],[31,2,31,9],[32,3,32,4],[32,8,33,8],[33,3,33,4],[41,2,41,3],[41,7,41,8],[35,2,35,4],[36,2,36,3],[36,7,36,9],[38,2,38,6],[39,2,39,9],[40,2,40,6]]}
[]
[]
[]
[]
[]
[]
[]
[]
[]
[]
[]
[null,null,"THE GRADE(S) SECURED BY   :",null,null,{"$f":"IFERROR(VLOOKUP(H14,ledger,2,0),\"This Symbol No. is not in Grade Ledger\")","v":"ANISHA THAPA MAGAR "}]
[null,null,"DATE OF BIRTH :",null,{"$f":"VLOOKUP(H14,ledger,3,0)","v":"2062-07-07"},"B.S.","       (",null,null,"A.D.)"]
[null,null,"REGISTRATION NO.",null,{"$f":"VLOOKUP(H14,ledger,4,0)","v":"801130210003"},"SYMBOL NO.",null,11301322,"GRADE","XI"]
[null,null,"IN THE EXAMINATION CONDUCTED IN ",null,null,"2080 B.S. (2022 A.D.)",null,"ARE GIVEN BELOW."]
[]
[null,null,"SUBJECT CODE","SUBJECTS",null,"CREDIT HOUR (CH)","GRADE","GARDE POINT (GP)","FINAL GRADE (FG) ","REMARKS"]
[]
[null,null,{"$f":"VLOOKUP(H14,ledger,5,0)","v":"0011"},{"$f":"IFERROR(VLOOKUP(C19,codesub,2,0),\"SUB.CODE IS WRONG\")","v":"COM. NEPALI (TH)"},null,2.25,{"$f":"VLOOKUP(H14,ledger,6,0)","v":"C+"},{"$f":"VLOOKUP(H14,ledger,7,0)","v":2.4},{"$f":"VLOOKUP(H14,ledger,10,0)","v":"C+"}]
[null,null,{"$f":"IF(C19=\"0011\",\"0012\",\"SORRY\")","v":"0012"},{"$f":"IF(C20=\"0012\",\"COM. NEPALI (IN)\",\"SUB.CODE IS WRONG\")","v":"COM. NEPALI (IN)"},null,0.75,{"$f":"VLOOKUP(H14,ledger,8,0)","v":"C"},{"$f":"VLOOKUP(H14,ledger,9,0)","v":2}]
[null,null,{"$f":"VLOOKUP(H14,ledger,11,0)","v":"0031"},{"$f":"IFERROR(VLOOKUP(C21,codesub,2,0),\"SUB.CODE IS WRONG\")","v":"COM. ENGLISH (TH)"},null,3,{"$f":"VLOOKUP(H14,ledger,12,0)","v":"C+"},{"$f":"VLOOKUP(H14,ledger,13,0)","v":2.4},{"$f":"VLOOKUP(H14,ledger,16,0)","v":"C+"}]
[null,null,{"$f":"IF(C21=\"0031\",\"0032\",\"SORRY\")","v":"0032"},{"$f":"IF(C22=\"0032\",\"COM. ENGLISH (IN)\",\"SUB.CODE IS WRONG\")","v":"COM. ENGLISH (IN)"},null,1,{"$f":"VLOOKUP(H14,ledger,14,0)","v":"C"},{"$f":"VLOOKUP(H14,ledger,15,0)","v":2}]
[null,null,{"$f":"VLOOKUP(H14,ledger,17,0)","v":"0051"},{"$f":"IF(C23=\"0051\",\"COM. SOCIAL STUDIES & LIFE SKILL (TH)\",IF(C23=\"0071\",\"COM. MATHEMATICS (TH)\",\"SUB.CODE IS WRONG\"))","v":"COM. SOCIAL STUDIES & LIFE SKILL (TH)"},null,3.75,{"$f":"VLOOKUP(H14,ledger,18,0)","v":"B+"},{"$f":"VLOOKUP(H14,ledger,19,0)","v":3.2},{"$f":"VLOOKUP(H14,ledger,22,0)","v":"A"},{"$f":"IF(OR($I$19=\"NG\",$I$21=\"NG\",$I$23=\"NG\",$I$25=\"NG\",$I$27=\"NG\",$I$29=\"NG\"),\"W\",\"\")","v":""}]
[null,null,{"$f":"IF(C23=\"0051\",\"0052\",IF(C23=\"0071\",\"0072\",\"SORRY\"))","v":"0052"},{"$f":"IF(C24=\"0052\",\"COM. SOCIAL STUDIES & LIFE SKILL (IN)\",IF(C24=\"0072\",\"COM. MATHEMATICS (IN)\",\"SUB.CODE IS WRONG\"))","v":"COM. SOCIAL STUDIES & LIFE SKILL (IN)"},null,1.25,{"$f":"VLOOKUP(H14,ledger,20,0)","v":"A"},{"$f":"VLOOKUP(H14,ledger,21,0)","v":3.6},null,{"$f":"IF(OR($I$19=\"ABS\",$I$21=\"ABS\",$I$23=\"ABS\",$I$25=\"ABS\",$I$27=\"ABS\",$I$29=\"ABS\"),\"ABS\",\"\")","v":""}]
[null,null,{"$f":"VLOOKUP(H14,ledger,23,0)","v":1031},{"$f":"IFERROR(VLOOKUP(C25,codesub,2,0),\"SUB.CODE IS WRONG\")","v":"ACCOUNTING (TH)"},null,3.75,{"$f":"VLOOKUP(H14,ledger,24,0)","v":"A"},{"$f":"VLOOKUP(H14,ledger,25,0)","v":3.6},{"$f":"VLOOKUP(H14,ledger,28,0)","v":"A+"}]
[null,null,{"$f":"C25+1","v":1032},"ACCOUNTING (IN)",null,1.25,{"$f":"VLOOKUP(H14,ledger,26,0)","v":"A+"},{"$f":"VLOOKUP(H14,ledger,27,0)","v":4}]
[null,null,{"$f":"VLOOKUP(H14,ledger,29,0)","v":4251},"SINGING (TH)",null,3.75,{"$f":"VLOOKUP(H14,ledger,30,0)","v":"C+"},{"$f":"VLOOKUP(H14,ledger,31,0)","v":2.4},{"$f":"VLOOKUP(H14,ledger,34,0)","v":"B"}]
[null,null,{"$f":"C27+1","v":4252},"SINGING (IN)",null,1.25,{"$f":"VLOOKUP(H14,ledger,32,0)","v":"A+"},{"$f":"VLOOKUP(H14,ledger,33,0)","v":4}]
[null,null,{"$f":"VLOOKUP(H14,ledger,35,0)","v":4171},{"$f":"IFERROR(VLOOKUP(C29,codesub,2,0),\"SUB.CODE IS WRONG\")","v":"FINANCE (TH)"},null,3.75,{"$f":"VLOOKUP(H14,ledger,36,0)","v":"B+"},{"$f":"VLOOKUP(H14,ledger,37,0)","v":3.2},{"$f":"VLOOKUP(H14,ledger,40,0)","v":"A"}]
[null,null,{"$f":"C29+1","v":4172},"FINANCE (IN)",null,1.25,{"$f":"VLOOKUP(H14,ledger,38,0)","v":"A"},{"$f":"VLOOKUP(H14,ledger,39,0)","v":3.6}]
[null,null,"GRADE POINT AVERAGE (GPA) :",null,null,null,null,null,{"$f":"VLOOKUP(H14,ledger,41,0)","v":3.0222222222222221}]
[null,null,"EXTRA CREDIT SUBJECT"]
[null,null,{"$f":"IFERROR(VLOOKUP(H14,ledger,42,0),\"\")","v":0},{"$f":"IFERROR(VLOOKUP(C33,codesub,2,0),\"SUB.CODE IS WRONG\")","v":"SUB.CODE IS WRONG"},null,null,{"$f":"VLOOKUP(H14,ledger,43,0)","v":"ABS"},{"$f":"VLOOKUP(H14,ledger,44,0)","v":"ABS"},{"$f":"VLOOKUP(H14,ledger,47,0)","v":""}]
[null,null,{"$f":"IFERROR(C33+1,\"\")","v":1},{"$f":"IFERROR(VLOOKUP(C34,codesub,2,0),\"SUB.CODE IS WRONG\")","v":"SUB.CODE IS WRONG"},null,null,{"$f":"VLOOKUP(H14,ledger,45,0)","v":"ABS"},{"$f":"VLOOKUP(H14,ledger,46,0)","v":"ABS"}]
[null,null,"PREPARED BY : …………………………"]
[null,null,"CHECKED BY : …………………………"]
[null,null,"DATE OF ISSUE     :",null,"2079.03.15",null,null,"HEAD TEACHER"]
[]
[null,null,"NOTE : ONE CREDIT HOUR EQUALS TO 32 WORKING HOURS"]
[null,null,"INTERNAL (IN) : THIS COVERS THE PARTICIPATION, PRACTICAL/PROJECT WORKS, COMMUNITY \n                                     WORKS, INTERNSHIP, PRESENTATIONS, TERMINAL EXAMINATIONS."]
[null,null,"THEORY (TH) :  THIS COVERS WRITTEN EXTERNAL EXAMINATION"]
[null,null,"ABS = ABSENT",null,null,null,"       ","W= WITHHELD"]

{"sheet":"std4","index":8,"n_rows":42,"n_cols":10,"rows_kept":42,"cut":false,"hidden":false,"merged":[[2,2,6,9],[11,2,11,4],[11,5,11,9],[12,7,12,8],[13,2,13,3],[13,5,13,6],[14,2,14,4],[14,5,14,6],[14,7,14,9],[16,2,17,2],[16,3,17,4],[16,5,17,5],[16,6,17,6],[16,7,17,7],[16,8,17,8],[16,9,17,9],[18,3,18,4],[18,8,19,8],[19,3,19,4],[20,3,20,4],[20,8,21,8],[21,3,21,4],[22,3,22,4],[22,8,23,8],[23,3,23,4],[24,3,24,4],[24,8,25,8],[25,3,25,4],[34,2,34,4],[26,3,26,4],[26,8,27,8],[27,3,27,4],[28,3,28,4],[28,8,29,8],[29,3,29,4],[30,2,30,7],[31,2,31,9],[32,3,32,4],[32,8,33,8],[33,3,33,4],[41,2,41,3],[41,7,41,8],[35,2,35,4],[36,2,36,3],[36,7,36,9],[38,2,38,6],[39,2,39,9],[40,2,40,6]]}
[]
[]
[]
[]
[]
[]
[]
[]
[]
[]
[]
[null,null,"THE GRADE(S) SECURED BY   :",null,null,{"$f":"IFERROR(VLOOKUP(H14,ledger,2,0),\"This Symbol No. is not in Grade Ledger\")","v":"ANUPAMA TAMANG "}]
[null,null,"DATE OF BIRTH :",null,{"$f":"VLOOKUP(H14,ledger,3,0)","v":"2062-12-20"},"B.S.","       (",null,null,"A.D.)"]
[null,null,"REGISTRATION NO.",null,{"$f":"VLOOKUP(H14,ledger,4,0)","v":"801130210004"},"SYMBOL NO.",null,11301323,"GRADE","XI"]
[null,null,"IN THE EXAMINATION CONDUCTED IN ",null,null,"2080 B.S. (2022 A.D.)",null,"ARE GIVEN BELOW."]
[]
[null,null,"SUBJECT CODE","SUBJECTS",null,"CREDIT HOUR (CH)","GRADE","GARDE POINT (GP)","FINAL GRADE (FG) ","REMARKS"]
[]
[null,null,{"$f":"VLOOKUP(H14,ledger,5,0)","v":"0011"},{"$f":"IFERROR(VLOOKUP(C19,codesub,2,0),\"SUB.CODE IS WRONG\")","v":"COM. NEPALI (TH)"},null,2.25,{"$f":"VLOOKUP(H14,ledger,6,0)","v":"C"},{"$f":"VLOOKUP(H14,ledger,7,0)","v":2},{"$f":"VLOOKUP(H14,ledger,10,0)","v":"C"}]
[null,null,{"$f":"IF(C19=\"0011\",\"0012\",\"SORRY\")","v":"0012"},{"$f":"IF(C20=\"0012\",\"COM. NEPALI (IN)\",\"SUB.CODE IS WRONG\")","v":"COM. NEPALI (IN)"},null,0.75,{"$f":"VLOOKUP(H14,ledger,8,0)","v":"C"},{"$f":"VLOOKUP(H14,ledger,9,0)","v":2}]
[null,null,{"$f":"VLOOKUP(H14,ledger,11,0)","v":"0031"},{"$f":"IFERROR(VLOOKUP(C21,codesub,2,0),\"SUB.CODE IS WRONG\")","v":"COM. ENGLISH (TH)"},null,3,{"$f":"VLOOKUP(H14,ledger,12,0)","v":"C"},{"$f":"VLOOKUP(H14,ledger,13,0)","v":2},{"$f":"VLOOKUP(H14,ledger,16,0)","v":"C"}]
[null,null,{"$f":"IF(C21=\"0031\",\"0032\",\"SORRY\")","v":"0032"},{"$f":"IF(C22=\"0032\",\"COM. ENGLISH (IN)\",\"SUB.CODE IS WRONG\")","v":"COM. ENGLISH (IN)"},null,1,{"$f":"VLOOKUP(H14,ledger,14,0)","v":"C"},{"$f":"VLOOKUP(H14,ledger,15,0)","v":2}]
[null,null,{"$f":"VLOOKUP(H14,ledger,17,0)","v":"0051"},{"$f":"IF(C23=\"0051\",\"COM. SOCIAL STUDIES & LIFE SKILL (TH)\",IF(C23=\"0071\",\"COM. MATHEMATICS (TH)\",\"SUB.CODE IS WRONG\"))","v":"COM. SOCIAL STUDIES & LIFE SKILL (TH)"},null,3.75,{"$f":"VLOOKUP(H14,ledger,18,0)","v":"B"},{"$f":"VLOOKUP(H14,ledger,19,0)","v":2.8},{"$f":"VLOOKUP(H14,ledger,22,0)","v":"B+"},{"$f":"IF(OR($I$19=\"NG\",$I$21=\"NG\",$I$23=\"NG\",$I$25=\"NG\",$I$27=\"NG\",$I$29=\"NG\"),\"W\",\"\")","v":""}]
[null,null,{"$f":"IF(C23=\"0051\",\"0052\",IF(C23=\"0071\",\"0072\",\"SORRY\"))","v":"0052"},{"$f":"IF(C24=\"0052\",\"COM. SOCIAL STUDIES & LIFE SKILL (IN)\",IF(C24=\"0072\",\"COM. MATHEMATICS (IN)\",\"SUB.CODE IS WRONG\"))","v":"COM. SOCIAL STUDIES & LIFE SKILL (IN)"},null,1.25,{"$f":"VLOOKUP(H14,ledger,20,0)","v":"A"},{"$f":"VLOOKUP(H14,ledger,21,0)","v":3.6},null,{"$f":"IF(OR($I$19=\"ABS\",$I$21=\"ABS\",$I$23=\"ABS\",$I$25=\"ABS\",$I$27=\"ABS\",$I$29=\"ABS\"),\"ABS\",\"\")","v":""}]
[null,null,{"$f":"VLOOKUP(H14,ledger,23,0)","v":1031},{"$f":"IFERROR(VLOOKUP(C25,codesub,2,0),\"SUB.CODE IS WRONG\")","v":"ACCOUNTING (TH)"},null,3.75,{"$f":"VLOOKUP(H14,ledger,24,0)","v":"B"},{"$f":"VLOOKUP(H14,ledger,25,0)","v":2.8},{"$f":"VLOOKUP(H14,ledger,28,0)","v":"B+"}]
[null,null,{"$f":"C25+1","v":1032},"ACCOUNTING (IN)",null,1.25,{"$f":"VLOOKUP(H14,ledger,26,0)","v":"A"},{"$f":"VLOOKUP(H14,ledger,27,0)","v":3.6}]
[null,null,{"$f":"VLOOKUP(H14,ledger,29,0)","v":4251},"SINGING (TH)",null,3.75,{"$f":"VLOOKUP(H14,ledger,30,0)","v":"C"},{"$f":"VLOOKUP(H14,ledger,31,0)","v":2},{"$f":"VLOOKUP(H14,ledger,34,0)","v":"B"}]
[null,null,{"$f":"C27+1","v":4252},"SINGING (IN)",null,1.25,{"$f":"VLOOKUP(H14,ledger,32,0)","v":"A+"},{"$f":"VLOOKUP(H14,ledger,33,0)","v":4}]
[null,null,{"$f":"VLOOKUP(H14,ledger,35,0)","v":4171},{"$f":"IFERROR(VLOOKUP(C29,codesub,2,0),\"SUB.CODE IS WRONG\")","v":"FINANCE (TH)"},null,3.75,{"$f":"VLOOKUP(H14,ledger,36,0)","v":"B+"},{"$f":"VLOOKUP(H14,ledger,37,0)","v":3.2},{"$f":"VLOOKUP(H14,ledger,40,0)","v":"*"}]
[null,null,{"$f":"C29+1","v":4172},"FINANCE (IN)",null,1.25,{"$f":"VLOOKUP(H14,ledger,38,0)","v":"ABS"},{"$f":"VLOOKUP(H14,ledger,39,0)","v":"ABS"}]
[null,null,"GRADE POINT AVERAGE (GPA) :",null,null,null,null,null,{"$f":"VLOOKUP(H14,ledger,41,0)","v":"-"}]
[null,null,"EXTRA CREDIT SUBJECT"]
[null,null,{"$f":"IFERROR(VLOOKUP(H14,ledger,42,0),\"\")","v":0},{"$f":"IFERROR(VLOOKUP(C33,codesub,2,0),\"SUB.CODE IS WRONG\")","v":"SUB.CODE IS WRONG"},null,null,{"$f":"VLOOKUP(H14,ledger,43,0)","v":"ABS"},{"$f":"VLOOKUP(H14,ledger,44,0)","v":"ABS"},{"$f":"VLOOKUP(H14,ledger,47,0)","v":""}]
[null,null,{"$f":"IFERROR(C33+1,\"\")","v":1},{"$f":"IFERROR(VLOOKUP(C34,codesub,2,0),\"SUB.CODE IS WRONG\")","v":"SUB.CODE IS WRONG"},null,null,{"$f":"VLOOKUP(H14,ledger,45,0)","v":"ABS"},{"$f":"VLOOKUP(H14,ledger,46,0)","v":"ABS"}]
[null,null,"PREPARED BY : …………………………"]
[null,null,"CHECKED BY : …………………………"]
[null,null,"DATE OF ISSUE     :",null,"2079.03.15",null,null,"HEAD TEACHER"]
[]
[null,null,"NOTE : ONE CREDIT HOUR EQUALS TO 32 WORKING HOURS"]
[null,null,"INTERNAL (IN) : THIS COVERS THE PARTICIPATION, PRACTICAL/PROJECT WORKS, COMMUNITY \n                                     WORKS, INTERNSHIP, PRESENTATIONS, TERMINAL EXAMINATIONS."]
[null,null,"THEORY (TH) :  THIS COVERS WRITTEN EXTERNAL EXAMINATION"]
[null,null,"ABS = ABSENT",null,null,null,"       ","W= WITHHELD"]

{"sheet":"std5","index":9,"n_rows":42,"n_cols":10,"rows_kept":42,"cut":false,"hidden":false,"merged":[[2,2,6,9],[11,2,11,4],[11,5,11,9],[12,7,12,8],[13,2,13,3],[13,5,13,6],[14,2,14,4],[14,5,14,6],[14,7,14,9],[16,2,17,2],[16,3,17,4],[16,5,17,5],[16,6,17,6],[16,7,17,7],[16,8,17,8],[16,9,17,9],[18,3,18,4],[18,8,19,8],[19,3,19,4],[20,3,20,4],[20,8,21,8],[21,3,21,4],[22,3,22,4],[22,8,23,8],[23,3,23,4],[24,3,24,4],[24,8,25,8],[25,3,25,4],[34,2,34,4],[26,3,26,4],[26,8,27,8],[27,3,27,4],[28,3,28,4],[28,8,29,8],[29,3,29,4],[30,2,30,7],[31,2,31,9],[32,3,32,4],[32,8,33,8],[33,3,33,4],[41,2,41,3],[41,7,41,8],[35,2,35,4],[36,2,36,3],[36,7,36,9],[38,2,38,6],[39,2,39,9],[40,2,40,6]]}
[]
[]
[]
[]
[]
[]
[]
[]
[]
[]
[]
[null,null,"THE GRADE(S) SECURED BY   :",null,null,{"$f":"IFERROR(VLOOKUP(H14,ledger,2,0),\"This Symbol No. is not in Grade Ledger\")","v":"ASMITA PARIYAR "}]
[null,null,"DATE OF BIRTH :",null,{"$f":"VLOOKUP(H14,ledger,3,0)","v":"2062-12-27"},"B.S.","       (",null,null,"A.D.)"]
[null,null,"REGISTRATION NO.",null,{"$f":"VLOOKUP(H14,ledger,4,0)","v":"801130210005"},"SYMBOL NO.",null,11301324,"GRADE","XI"]
[null,null,"IN THE EXAMINATION CONDUCTED IN ",null,null,"2080 B.S. (2022 A.D.)",null,"ARE GIVEN BELOW."]
[]
[null,null,"SUBJECT CODE","SUBJECTS",null,"CREDIT HOUR (CH)","GRADE","GARDE POINT (GP)","FINAL GRADE (FG) ","REMARKS"]
[]
[null,null,{"$f":"VLOOKUP(H14,ledger,5,0)","v":"0011"},{"$f":"IFERROR(VLOOKUP(C19,codesub,2,0),\"SUB.CODE IS WRONG\")","v":"COM. NEPALI (TH)"},null,2.25,{"$f":"VLOOKUP(H14,ledger,6,0)","v":"C"},{"$f":"VLOOKUP(H14,ledger,7,0)","v":2},{"$f":"VLOOKUP(H14,ledger,10,0)","v":"C"}]
[null,null,{"$f":"IF(C19=\"0011\",\"0012\",\"SORRY\")","v":"0012"},{"$f":"IF(C20=\"0012\",\"COM. NEPALI (IN)\",\"SUB.CODE IS WRONG\")","v":"COM. NEPALI (IN)"},null,0.75,{"$f":"VLOOKUP(H14,ledger,8,0)","v":"C"},{"$f":"VLOOKUP(H14,ledger,9,0)","v":2}]
[null,null,{"$f":"VLOOKUP(H14,ledger,11,0)","v":"0031"},{"$f":"IFERROR(VLOOKUP(C21,codesub,2,0),\"SUB.CODE IS WRONG\")","v":"COM. ENGLISH (TH)"},null,3,{"$f":"VLOOKUP(H14,ledger,12,0)","v":"C"},{"$f":"VLOOKUP(H14,ledger,13,0)","v":2},{"$f":"VLOOKUP(H14,ledger,16,0)","v":"C"}]
[null,null,{"$f":"IF(C21=\"0031\",\"0032\",\"SORRY\")","v":"0032"},{"$f":"IF(C22=\"0032\",\"COM. ENGLISH (IN)\",\"SUB.CODE IS WRONG\")","v":"COM. ENGLISH (IN)"},null,1,{"$f":"VLOOKUP(H14,ledger,14,0)","v":"C"},{"$f":"VLOOKUP(H14,ledger,15,0)","v":2}]
[null,null,{"$f":"VLOOKUP(H14,ledger,17,0)","v":"0051"},{"$f":"IF(C23=\"0051\",\"COM. SOCIAL STUDIES & LIFE SKILL (TH)\",IF(C23=\"0071\",\"COM. MATHEMATICS (TH)\",\"SUB.CODE IS WRONG\"))","v":"COM. SOCIAL STUDIES & LIFE SKILL (TH)"},null,3.75,{"$f":"VLOOKUP(H14,ledger,18,0)","v":"B"},{"$f":"VLOOKUP(H14,ledger,19,0)","v":2.8},{"$f":"VLOOKUP(H14,ledger,22,0)","v":"B+"},{"$f":"IF(OR($I$19=\"NG\",$I$21=\"NG\",$I$23=\"NG\",$I$25=\"NG\",$I$27=\"NG\",$I$29=\"NG\"),\"W\",\"\")","v":""}]
[null,null,{"$f":"IF(C23=\"0051\",\"0052\",IF(C23=\"0071\",\"0072\",\"SORRY\"))","v":"0052"},{"$f":"IF(C24=\"0052\",\"COM. SOCIAL STUDIES & LIFE SKILL (IN)\",IF(C24=\"0072\",\"COM. MATHEMATICS (IN)\",\"SUB.CODE IS WRONG\"))","v":"COM. SOCIAL STUDIES & LIFE SKILL (IN)"},null,1.25,{"$f":"VLOOKUP(H14,ledger,20,0)","v":"A"},{"$f":"VLOOKUP(H14,ledger,21,0)","v":3.6},null,{"$f":"IF(OR($I$19=\"ABS\",$I$21=\"ABS\",$I$23=\"ABS\",$I$25=\"ABS\",$I$27=\"ABS\",$I$29=\"ABS\"),\"ABS\",\"\")","v":""}]
[null,null,{"$f":"VLOOKUP(H14,ledger,23,0)","v":1031},{"$f":"IFERROR(VLOOKUP(C25,codesub,2,0),\"SUB.CODE IS WRONG\")","v":"ACCOUNTING (TH)"},null,3.75,{"$f":"VLOOKUP(H14,ledger,24,0)","v":"B"},{"$f":"VLOOKUP(H14,ledger,25,0)","v":2.8},{"$f":"VLOOKUP(H14,ledger,28,0)","v":"B+"}]
[null,null,{"$f":"C25+1","v":1032},"ACCOUNTING (IN)",null,1.25,{"$f":"VLOOKUP(H14,ledger,26,0)","v":"A"},{"$f":"VLOOKUP(H14,ledger,27,0)","v":3.6}]
[null,null,{"$f":"VLOOKUP(H14,ledger,29,0)","v":4251},"SINGING (TH)",null,3.75,{"$f":"VLOOKUP(H14,ledger,30,0)","v":"C"},{"$f":"VLOOKUP(H14,ledger,31,0)","v":2},{"$f":"VLOOKUP(H14,ledger,34,0)","v":"B"}]
[null,null,{"$f":"C27+1","v":4252},"SINGING (IN)",null,1.25,{"$f":"VLOOKUP(H14,ledger,32,0)","v":"A+"},{"$f":"VLOOKUP(H14,ledger,33,0)","v":4}]
[null,null,{"$f":"VLOOKUP(H14,ledger,35,0)","v":4171},{"$f":"IFERROR(VLOOKUP(C29,codesub,2,0),\"SUB.CODE IS WRONG\")","v":"FINANCE (TH)"},null,3.75,{"$f":"VLOOKUP(H14,ledger,36,0)","v":"A"},{"$f":"VLOOKUP(H14,ledger,37,0)","v":3.6},{"$f":"VLOOKUP(H14,ledger,40,0)","v":"*"}]
[null,null,{"$f":"C29+1","v":4172},"FINANCE (IN)",null,1.25,{"$f":"VLOOKUP(H14,ledger,38,0)","v":"ABS"},{"$f":"VLOOKUP(H14,ledger,39,0)","v":"ABS"}]
[null,null,"GRADE POINT AVERAGE (GPA) :",null,null,null,null,null,{"$f":"VLOOKUP(H14,ledger,41,0)","v":"-"}]
[null,null,"EXTRA CREDIT SUBJECT"]
[null,null,{"$f":"IFERROR(VLOOKUP(H14,ledger,42,0),\"\")","v":0},{"$f":"IFERROR(VLOOKUP(C33,codesub,2,0),\"SUB.CODE IS WRONG\")","v":"SUB.CODE IS WRONG"},null,null,{"$f":"VLOOKUP(H14,ledger,43,0)","v":"ABS"},{"$f":"VLOOKUP(H14,ledger,44,0)","v":"ABS"},{"$f":"VLOOKUP(H14,ledger,47,0)","v":""}]
[null,null,{"$f":"IFERROR(C33+1,\"\")","v":1},{"$f":"IFERROR(VLOOKUP(C34,codesub,2,0),\"SUB.CODE IS WRONG\")","v":"SUB.CODE IS WRONG"},null,null,{"$f":"VLOOKUP(H14,ledger,45,0)","v":"ABS"},{"$f":"VLOOKUP(H14,ledger,46,0)","v":"ABS"}]
[null,null,"PREPARED BY : …………………………"]
[null,null,"CHECKED BY : …………………………"]
[null,null,"DATE OF ISSUE     :",null,"2079.03.15",null,null,"HEAD TEACHER"]
[]
[null,null,"NOTE : ONE CREDIT HOUR EQUALS TO 32 WORKING HOURS"]
[null,null,"INTERNAL (IN) : THIS COVERS THE PARTICIPATION, PRACTICAL/PROJECT WORKS, COMMUNITY \n                                     WORKS, INTERNSHIP, PRESENTATIONS, TERMINAL EXAMINATIONS."]
[null,null,"THEORY (TH) :  THIS COVERS WRITTEN EXTERNAL EXAMINATION"]
[null,null,"ABS = ABSENT",null,null,null,"       ","W= WITHHELD"]

{"sheet":"std6","index":10,"n_rows":42,"n_cols":10,"rows_kept":42,"cut":false,"hidden":false,"merged":[[2,2,6,9],[11,2,11,4],[11,5,11,9],[12,7,12,8],[13,2,13,3],[13,5,13,6],[14,2,14,4],[14,5,14,6],[14,7,14,9],[16,2,17,2],[16,3,17,4],[16,5,17,5],[16,6,17,6],[16,7,17,7],[16,8,17,8],[16,9,17,9],[18,3,18,4],[18,8,19,8],[19,3,19,4],[20,3,20,4],[20,8,21,8],[21,3,21,4],[22,3,22,4],[22,8,23,8],[23,3,23,4],[24,3,24,4],[24,8,25,8],[25,3,25,4],[34,2,34,4],[26,3,26,4],[26,8,27,8],[27,3,27,4],[28,3,28,4],[28,8,29,8],[29,3,29,4],[30,2,30,7],[31,2,31,9],[32,3,32,4],[32,8,33,8],[33,3,33,4],[41,2,41,3],[41,7,41,8],[35,2,35,4],[36,2,36,3],[36,7,36,9],[38,2,38,6],[39,2,39,9],[40,2,40,6]]}
[]
[]
[]
[]
[]
[]
[]
[]
[]
[]
[]
[null,null,"THE GRADE(S) SECURED BY   :",null,null,{"$f":"IFERROR(VLOOKUP(H14,ledger,2,0),\"This Symbol No. is not in Grade Ledger\")","v":"BIKASH RAI "}]
[null,null,"DATE OF BIRTH :",null,{"$f":"VLOOKUP(H14,ledger,3,0)","v":"2063-03-10"},"B.S.","       (",null,null,"A.D.)"]
[null,null,"REGISTRATION NO.",null,{"$f":"VLOOKUP(H14,ledger,4,0)","v":"801130210006"},"SYMBOL NO.",null,11301325,"GRADE","XI"]
[null,null,"IN THE EXAMINATION CONDUCTED IN ",null,null,"2080 B.S. (2022 A.D.)",null,"ARE GIVEN BELOW."]
[]
[null,null,"SUBJECT CODE","SUBJECTS",null,"CREDIT HOUR (CH)","GRADE","GARDE POINT (GP)","FINAL GRADE (FG) ","REMARKS"]
[]
[null,null,{"$f":"VLOOKUP(H14,ledger,5,0)","v":"0011"},{"$f":"IFERROR(VLOOKUP(C19,codesub,2,0),\"SUB.CODE IS WRONG\")","v":"COM. NEPALI (TH)"},null,2.25,{"$f":"VLOOKUP(H14,ledger,6,0)","v":"C+"},{"$f":"VLOOKUP(H14,ledger,7,0)","v":2.4},{"$f":"VLOOKUP(H14,ledger,10,0)","v":"C+"}]
[null,null,{"$f":"IF(C19=\"0011\",\"0012\",\"SORRY\")","v":"0012"},{"$f":"IF(C20=\"0012\",\"COM. NEPALI (IN)\",\"SUB.CODE IS WRONG\")","v":"COM. NEPALI (IN)"},null,0.75,{"$f":"VLOOKUP(H14,ledger,8,0)","v":"C"},{"$f":"VLOOKUP(H14,ledger,9,0)","v":2}]
[null,null,{"$f":"VLOOKUP(H14,ledger,11,0)","v":"0031"},{"$f":"IFERROR(VLOOKUP(C21,codesub,2,0),\"SUB.CODE IS WRONG\")","v":"COM. ENGLISH (TH)"},null,3,{"$f":"VLOOKUP(H14,ledger,12,0)","v":"C+"},{"$f":"VLOOKUP(H14,ledger,13,0)","v":2.4},{"$f":"VLOOKUP(H14,ledger,16,0)","v":"C+"}]
[null,null,{"$f":"IF(C21=\"0031\",\"0032\",\"SORRY\")","v":"0032"},{"$f":"IF(C22=\"0032\",\"COM. ENGLISH (IN)\",\"SUB.CODE IS WRONG\")","v":"COM. ENGLISH (IN)"},null,1,{"$f":"VLOOKUP(H14,ledger,14,0)","v":"C"},{"$f":"VLOOKUP(H14,ledger,15,0)","v":2}]
[null,null,{"$f":"VLOOKUP(H14,ledger,17,0)","v":"0051"},{"$f":"IF(C23=\"0051\",\"COM. SOCIAL STUDIES & LIFE SKILL (TH)\",IF(C23=\"0071\",\"COM. MATHEMATICS (TH)\",\"SUB.CODE IS WRONG\"))","v":"COM. SOCIAL STUDIES & LIFE SKILL (TH)"},null,3.75,{"$f":"VLOOKUP(H14,ledger,18,0)","v":"A"},{"$f":"VLOOKUP(H14,ledger,19,0)","v":3.6},{"$f":"VLOOKUP(H14,ledger,22,0)","v":"A+"},{"$f":"IF(OR($I$19=\"NG\",$I$21=\"NG\",$I$23=\"NG\",$I$25=\"NG\",$I$27=\"NG\",$I$29=\"NG\"),\"W\",\"\")","v":""}]
[null,null,{"$f":"IF(C23=\"0051\",\"0052\",IF(C23=\"0071\",\"0072\",\"SORRY\"))","v":"0052"},{"$f":"IF(C24=\"0052\",\"COM. SOCIAL STUDIES & LIFE SKILL (IN)\",IF(C24=\"0072\",\"COM. MATHEMATICS (IN)\",\"SUB.CODE IS WRONG\"))","v":"COM. SOCIAL STUDIES & LIFE SKILL (IN)"},null,1.25,{"$f":"VLOOKUP(H14,ledger,20,0)","v":"A+"},{"$f":"VLOOKUP(H14,ledger,21,0)","v":4},null,{"$f":"IF(OR($I$19=\"ABS\",$I$21=\"ABS\",$I$23=\"ABS\",$I$25=\"ABS\",$I$27=\"ABS\",$I$29=\"ABS\"),\"ABS\",\"\")","v":""}]
[null,null,{"$f":"VLOOKUP(H14,ledger,23,0)","v":1031},{"$f":"IFERROR(VLOOKUP(C25,codesub,2,0),\"SUB.CODE IS WRONG\")","v":"ACCOUNTING (TH)"},null,3.75,{"$f":"VLOOKUP(H14,ledger,24,0)","v":"A"},{"$f":"VLOOKUP(H14,ledger,25,0)","v":3.6},{"$f":"VLOOKUP(H14,ledger,28,0)","v":"A+"}]
[null,null,{"$f":"C25+1","v":1032},"ACCOUNTING (IN)",null,1.25,{"$f":"VLOOKUP(H14,ledger,26,0)","v":"A+"},{"$f":"VLOOKUP(H14,ledger,27,0)","v":4}]
[null,null,{"$f":"VLOOKUP(H14,ledger,29,0)","v":4251},"SINGING (TH)",null,3.75,{"$f":"VLOOKUP(H14,ledger,30,0)","v":"C+"},{"$f":"VLOOKUP(H14,ledger,31,0)","v":2.4},{"$f":"VLOOKUP(H14,ledger,34,0)","v":"B"}]
[null,null,{"$f":"C27+1","v":4252},"SINGING (IN)",null,1.25,{"$f":"VLOOKUP(H14,ledger,32,0)","v":"A+"},{"$f":"VLOOKUP(H14,ledger,33,0)","v":4}]
[null,null,{"$f":"VLOOKUP(H14,ledger,35,0)","v":4171},{"$f":"IFERROR(VLOOKUP(C29,codesub,2,0),\"SUB.CODE IS WRONG\")","v":"FINANCE (TH)"},null,3.75,{"$f":"VLOOKUP(H14,ledger,36,0)","v":"A"},{"$f":"VLOOKUP(H14,ledger,37,0)","v":3.6},{"$f":"VLOOKUP(H14,ledger,40,0)","v":"*"}]
[null,null,{"$f":"C29+1","v":4172},"FINANCE (IN)",null,1.25,{"$f":"VLOOKUP(H14,ledger,38,0)","v":"ABS"},{"$f":"VLOOKUP(H14,ledger,39,0)","v":"ABS"}]
[null,null,"GRADE POINT AVERAGE (GPA) :",null,null,null,null,null,{"$f":"VLOOKUP(H14,ledger,41,0)","v":"-"}]
[null,null,"EXTRA CREDIT SUBJECT"]
[null,null,{"$f":"IFERROR(VLOOKUP(H14,ledger,42,0),\"\")","v":0},{"$f":"IFERROR(VLOOKUP(C33,codesub,2,0),\"SUB.CODE IS WRONG\")","v":"SUB.CODE IS WRONG"},null,null,{"$f":"VLOOKUP(H14,ledger,43,0)","v":"ABS"},{"$f":"VLOOKUP(H14,ledger,44,0)","v":"ABS"},{"$f":"VLOOKUP(H14,ledger,47,0)","v":""}]
[null,null,{"$f":"IFERROR(C33+1,\"\")","v":1},{"$f":"IFERROR(VLOOKUP(C34,codesub,2,0),\"SUB.CODE IS WRONG\")","v":"SUB.CODE IS WRONG"},null,null,{"$f":"VLOOKUP(H14,ledger,45,0)","v":"ABS"},{"$f":"VLOOKUP(H14,ledger,46,0)","v":"ABS"}]
[null,null,"PREPARED BY : …………………………"]
[null,null,"CHECKED BY : …………………………"]
[null,null,"DATE OF ISSUE     :",null,"2079.03.15",null,null,"HEAD TEACHER"]
[]
[null,null,"NOTE : ONE CREDIT HOUR EQUALS TO 32 WORKING HOURS"]
[null,null,"INTERNAL (IN) : THIS COVERS THE PARTICIPATION, PRACTICAL/PROJECT WORKS, COMMUNITY \n                                     WORKS, INTERNSHIP, PRESENTATIONS, TERMINAL EXAMINATIONS."]
[null,null,"THEORY (TH) :  THIS COVERS WRITTEN EXTERNAL EXAMINATION"]
[null,null,"ABS = ABSENT",null,null,null,"       ","W= WITHHELD"]

{"sheet":"std7","index":11,"n_rows":42,"n_cols":10,"rows_kept":42,"cut":false,"hidden":false,"merged":[[2,2,6,9],[11,2,11,4],[11,5,11,9],[12,7,12,8],[13,2,13,3],[13,5,13,6],[14,2,14,4],[14,5,14,6],[14,7,14,9],[16,2,17,2],[16,3,17,4],[16,5,17,5],[16,6,17,6],[16,7,17,7],[16,8,17,8],[16,9,17,9],[18,3,18,4],[18,8,19,8],[19,3,19,4],[20,3,20,4],[20,8,21,8],[21,3,21,4],[22,3,22,4],[22,8,23,8],[23,3,23,4],[24,3,24,4],[24,8,25,8],[25,3,25,4],[34,2,34,4],[26,3,26,4],[26,8,27,8],[27,3,27,4],[28,3,28,4],[28,8,29,8],[29,3,29,4],[30,2,30,7],[31,2,31,9],[32,3,32,4],[32,8,33,8],[33,3,33,4],[41,2,41,3],[41,7,41,8],[35,2,35,4],[36,2,36,3],[36,7,36,9],[38,2,38,6],[39,2,39,9],[40,2,40,6]]}
[]
[]
[]
[]
[]
[]
[]
[]
[]
[]
[]
[null,null,"THE GRADE(S) SECURED BY   :",null,null,{"$f":"IFERROR(VLOOKUP(H14,ledger,2,0),\"This Symbol No. is not in Grade Ledger\")","v":"DIKESH RAI "}]
[null,null,"DATE OF BIRTH :",null,{"$f":"VLOOKUP(H14,ledger,3,0)","v":"2063-07-06"},"B.S.","       (",null,null,"A.D.)"]
[null,null,"REGISTRATION NO.",null,{"$f":"VLOOKUP(H14,ledger,4,0)","v":"801130210007"},"SYMBOL NO.",null,11301326,"GRADE","XI"]
[null,null,"IN THE EXAMINATION CONDUCTED IN ",null,null,"2080 B.S. (2022 A.D.)",null,"ARE GIVEN BELOW."]
[]
[null,null,"SUBJECT CODE","SUBJECTS",null,"CREDIT HOUR (CH)","GRADE","GARDE POINT (GP)","FINAL GRADE (FG) ","REMARKS"]
[]
[null,null,{"$f":"VLOOKUP(H14,ledger,5,0)","v":"0011"},{"$f":"IFERROR(VLOOKUP(C19,codesub,2,0),\"SUB.CODE IS WRONG\")","v":"COM. NEPALI (TH)"},null,2.25,{"$f":"VLOOKUP(H14,ledger,6,0)","v":"C"},{"$f":"VLOOKUP(H14,ledger,7,0)","v":2},{"$f":"VLOOKUP(H14,ledger,10,0)","v":"C"}]
[null,null,{"$f":"IF(C19=\"0011\",\"0012\",\"SORRY\")","v":"0012"},{"$f":"IF(C20=\"0012\",\"COM. NEPALI (IN)\",\"SUB.CODE IS WRONG\")","v":"COM. NEPALI (IN)"},null,0.75,{"$f":"VLOOKUP(H14,ledger,8,0)","v":"C"},{"$f":"VLOOKUP(H14,ledger,9,0)","v":2}]
[null,null,{"$f":"VLOOKUP(H14,ledger,11,0)","v":"0031"},{"$f":"IFERROR(VLOOKUP(C21,codesub,2,0),\"SUB.CODE IS WRONG\")","v":"COM. ENGLISH (TH)"},null,3,{"$f":"VLOOKUP(H14,ledger,12,0)","v":"C"},{"$f":"VLOOKUP(H14,ledger,13,0)","v":2},{"$f":"VLOOKUP(H14,ledger,16,0)","v":"C"}]
[null,null,{"$f":"IF(C21=\"0031\",\"0032\",\"SORRY\")","v":"0032"},{"$f":"IF(C22=\"0032\",\"COM. ENGLISH (IN)\",\"SUB.CODE IS WRONG\")","v":"COM. ENGLISH (IN)"},null,1,{"$f":"VLOOKUP(H14,ledger,14,0)","v":"C"},{"$f":"VLOOKUP(H14,ledger,15,0)","v":2}]
[null,null,{"$f":"VLOOKUP(H14,ledger,17,0)","v":"0051"},{"$f":"IF(C23=\"0051\",\"COM. SOCIAL STUDIES & LIFE SKILL (TH)\",IF(C23=\"0071\",\"COM. MATHEMATICS (TH)\",\"SUB.CODE IS WRONG\"))","v":"COM. SOCIAL STUDIES & LIFE SKILL (TH)"},null,3.75,{"$f":"VLOOKUP(H14,ledger,18,0)","v":"C"},{"$f":"VLOOKUP(H14,ledger,19,0)","v":2},{"$f":"VLOOKUP(H14,ledger,22,0)","v":"C+"},{"$f":"IF(OR($I$19=\"NG\",$I$21=\"NG\",$I$23=\"NG\",$I$25=\"NG\",$I$27=\"NG\",$I$29=\"NG\"),\"W\",\"\")","v":""}]
[null,null,{"$f":"IF(C23=\"0051\",\"0052\",IF(C23=\"0071\",\"0072\",\"SORRY\"))","v":"0052"},{"$f":"IF(C24=\"0052\",\"COM. SOCIAL STUDIES & LIFE SKILL (IN)\",IF(C24=\"0072\",\"COM. MATHEMATICS (IN)\",\"SUB.CODE IS WRONG\"))","v":"COM. SOCIAL STUDIES & LIFE SKILL (IN)"},null,1.25,{"$f":"VLOOKUP(H14,ledger,20,0)","v":"A"},{"$f":"VLOOKUP(H14,ledger,21,0)","v":3.6},null,{"$f":"IF(OR($I$19=\"ABS\",$I$21=\"ABS\",$I$23=\"ABS\",$I$25=\"ABS\",$I$27=\"ABS\",$I$29=\"ABS\"),\"ABS\",\"\")","v":""}]
[null,null,{"$f":"VLOOKUP(H14,ledger,23,0)","v":1031},{"$f":"IFERROR(VLOOKUP(C25,codesub,2,0),\"SUB.CODE IS WRONG\")","v":"ACCOUNTING (TH)"},null,3.75,{"$f":"VLOOKUP(H14,ledger,24,0)","v":"B"},{"$f":"VLOOKUP(H14,ledger,25,0)","v":2.8},{"$f":"VLOOKUP(H14,ledger,28,0)","v":"B+"}]
[null,null,{"$f":"C25+1","v":1032},"ACCOUNTING (IN)",null,1.25,{"$f":"VLOOKUP(H14,ledger,26,0)","v":"A"},{"$f":"VLOOKUP(H14,ledger,27,0)","v":3.6}]
[null,null,{"$f":"VLOOKUP(H14,ledger,29,0)","v":4251},"SINGING (TH)",null,3.75,{"$f":"VLOOKUP(H14,ledger,30,0)","v":"C+"},{"$f":"VLOOKUP(H14,ledger,31,0)","v":2.4},{"$f":"VLOOKUP(H14,ledger,34,0)","v":"B"}]
[null,null,{"$f":"C27+1","v":4252},"SINGING (IN)",null,1.25,{"$f":"VLOOKUP(H14,ledger,32,0)","v":"A+"},{"$f":"VLOOKUP(H14,ledger,33,0)","v":4}]
[null,null,{"$f":"VLOOKUP(H14,ledger,35,0)","v":4171},{"$f":"IFERROR(VLOOKUP(C29,codesub,2,0),\"SUB.CODE IS WRONG\")","v":"FINANCE (TH)"},null,3.75,{"$f":"VLOOKUP(H14,ledger,36,0)","v":"A"},{"$f":"VLOOKUP(H14,ledger,37,0)","v":3.6},{"$f":"VLOOKUP(H14,ledger,40,0)","v":"*"}]
[null,null,{"$f":"C29+1","v":4172},"FINANCE (IN)",null,1.25,{"$f":"VLOOKUP(H14,ledger,38,0)","v":"ABS"},{"$f":"VLOOKUP(H14,ledger,39,0)","v":"ABS"}]
[null,null,"GRADE POINT AVERAGE (GPA) :",null,null,null,null,null,{"$f":"VLOOKUP(H14,ledger,41,0)","v":"-"}]
[null,null,"EXTRA CREDIT SUBJECT"]
[null,null,{"$f":"IFERROR(VLOOKUP(H14,ledger,42,0),\"\")","v":0},{"$f":"IFERROR(VLOOKUP(C33,codesub,2,0),\"SUB.CODE IS WRONG\")","v":"SUB.CODE IS WRONG"},null,null,{"$f":"VLOOKUP(H14,ledger,43,0)","v":"ABS"},{"$f":"VLOOKUP(H14,ledger,44,0)","v":"ABS"},{"$f":"VLOOKUP(H14,ledger,47,0)","v":""}]
[null,null,{"$f":"IFERROR(C33+1,\"\")","v":1},{"$f":"IFERROR(VLOOKUP(C34,codesub,2,0),\"SUB.CODE IS WRONG\")","v":"SUB.CODE IS WRONG"},null,null,{"$f":"VLOOKUP(H14,ledger,45,0)","v":"ABS"},{"$f":"VLOOKUP(H14,ledger,46,0)","v":"ABS"}]
[null,null,"PREPARED BY : …………………………"]
[null,null,"CHECKED BY : …………………………"]
[null,null,"DATE OF ISSUE     :",null,"2079.03.15",null,null,"HEAD TEACHER"]
[]
[null,null,"NOTE : ONE CREDIT HOUR EQUALS TO 32 WORKING HOURS"]
[null,null,"INTERNAL (IN) : THIS COVERS THE PARTICIPATION, PRACTICAL/PROJECT WORKS, COMMUNITY \n                                     WORKS, INTERNSHIP, PRESENTATIONS, TERMINAL EXAMINATIONS."]
[null,null,"THEORY (TH) :  THIS COVERS WRITTEN EXTERNAL EXAMINATION"]
[null,null,"ABS = ABSENT",null,null,null,"       ","W= WITHHELD"]

{"sheet":"std8","index":12,"n_rows":42,"n_cols":10,"rows_kept":42,"cut":false,"hidden":false,"merged":[[2,2,6,9],[11,2,11,4],[11,5,11,9],[12,7,12,8],[13,2,13,3],[13,5,13,6],[14,2,14,4],[14,5,14,6],[14,7,14,9],[16,2,17,2],[16,3,17,4],[16,5,17,5],[16,6,17,6],[16,7,17,7],[16,8,17,8],[16,9,17,9],[18,3,18,4],[18,8,19,8],[19,3,19,4],[20,3,20,4],[20,8,21,8],[21,3,21,4],[22,3,22,4],[22,8,23,8],[23,3,23,4],[24,3,24,4],[24,8,25,8],[25,3,25,4],[34,2,34,4],[26,3,26,4],[26,8,27,8],[27,3,27,4],[28,3,28,4],[28,8,29,8],[29,3,29,4],[30,2,30,7],[31,2,31,9],[32,3,32,4],[32,8,33,8],[33,3,33,4],[41,2,41,3],[41,7,41,8],[35,2,35,4],[36,2,36,3],[36,7,36,9],[38,2,38,6],[39,2,39,9],[40,2,40,6]]}
[]
[]
[]
[]
[]
[]
[]
[]
[]
[]
[]
[null,null,"THE GRADE(S) SECURED BY   :",null,null,{"$f":"IFERROR(VLOOKUP(H14,ledger,2,0),\"This Symbol No. is not in Grade Ledger\")","v":"ERON BHUJEL "}]
[null,null,"DATE OF BIRTH :",null,{"$f":"VLOOKUP(H14,ledger,3,0)","v":"2064-06-02"},"B.S.","       (",null,null,"A.D.)"]
[null,null,"REGISTRATION NO.",null,{"$f":"VLOOKUP(H14,ledger,4,0)","v":"801130210008"},"SYMBOL NO.",null,11301327,"GRADE","XI"]
[null,null,"IN THE EXAMINATION CONDUCTED IN ",null,null,"2080 B.S. (2022 A.D.)",null,"ARE GIVEN BELOW."]
[]
[null,null,"SUBJECT CODE","SUBJECTS",null,"CREDIT HOUR (CH)","GRADE","GARDE POINT (GP)","FINAL GRADE (FG) ","REMARKS"]
[]
[null,null,{"$f":"VLOOKUP(H14,ledger,5,0)","v":"0011"},{"$f":"IFERROR(VLOOKUP(C19,codesub,2,0),\"SUB.CODE IS WRONG\")","v":"COM. NEPALI (TH)"},null,2.25,{"$f":"VLOOKUP(H14,ledger,6,0)","v":"C"},{"$f":"VLOOKUP(H14,ledger,7,0)","v":2},{"$f":"VLOOKUP(H14,ledger,10,0)","v":"C"}]
[null,null,{"$f":"IF(C19=\"0011\",\"0012\",\"SORRY\")","v":"0012"},{"$f":"IF(C20=\"0012\",\"COM. NEPALI (IN)\",\"SUB.CODE IS WRONG\")","v":"COM. NEPALI (IN)"},null,0.75,{"$f":"VLOOKUP(H14,ledger,8,0)","v":"C"},{"$f":"VLOOKUP(H14,ledger,9,0)","v":2}]
[null,null,{"$f":"VLOOKUP(H14,ledger,11,0)","v":"0031"},{"$f":"IFERROR(VLOOKUP(C21,codesub,2,0),\"SUB.CODE IS WRONG\")","v":"COM. ENGLISH (TH)"},null,3,{"$f":"VLOOKUP(H14,ledger,12,0)","v":"C"},{"$f":"VLOOKUP(H14,ledger,13,0)","v":2},{"$f":"VLOOKUP(H14,ledger,16,0)","v":"C"}]
[null,null,{"$f":"IF(C21=\"0031\",\"0032\",\"SORRY\")","v":"0032"},{"$f":"IF(C22=\"0032\",\"COM. ENGLISH (IN)\",\"SUB.CODE IS WRONG\")","v":"COM. ENGLISH (IN)"},null,1,{"$f":"VLOOKUP(H14,ledger,14,0)","v":"C"},{"$f":"VLOOKUP(H14,ledger,15,0)","v":2}]
[null,null,{"$f":"VLOOKUP(H14,ledger,17,0)","v":"0051"},{"$f":"IF(C23=\"0051\",\"COM. SOCIAL STUDIES & LIFE SKILL (TH)\",IF(C23=\"0071\",\"COM. MATHEMATICS (TH)\",\"SUB.CODE IS WRONG\"))","v":"COM. SOCIAL STUDIES & LIFE SKILL (TH)"},null,3.75,{"$f":"VLOOKUP(H14,ledger,18,0)","v":"A"},{"$f":"VLOOKUP(H14,ledger,19,0)","v":3.6},{"$f":"VLOOKUP(H14,ledger,22,0)","v":"A+"},{"$f":"IF(OR($I$19=\"NG\",$I$21=\"NG\",$I$23=\"NG\",$I$25=\"NG\",$I$27=\"NG\",$I$29=\"NG\"),\"W\",\"\")","v":""}]
[null,null,{"$f":"IF(C23=\"0051\",\"0052\",IF(C23=\"0071\",\"0072\",\"SORRY\"))","v":"0052"},{"$f":"IF(C24=\"0052\",\"COM. SOCIAL STUDIES & LIFE SKILL (IN)\",IF(C24=\"0072\",\"COM. MATHEMATICS (IN)\",\"SUB.CODE IS WRONG\"))","v":"COM. SOCIAL STUDIES & LIFE SKILL (IN)"},null,1.25,{"$f":"VLOOKUP(H14,ledger,20,0)","v":"A+"},{"$f":"VLOOKUP(H14,ledger,21,0)","v":4},null,{"$f":"IF(OR($I$19=\"ABS\",$I$21=\"ABS\",$I$23=\"ABS\",$I$25=\"ABS\",$I$27=\"ABS\",$I$29=\"ABS\"),\"ABS\",\"\")","v":""}]
[null,null,{"$f":"VLOOKUP(H14,ledger,23,0)","v":1031},{"$f":"IFERROR(VLOOKUP(C25,codesub,2,0),\"SUB.CODE IS WRONG\")","v":"ACCOUNTING (TH)"},null,3.75,{"$f":"VLOOKUP(H14,ledger,24,0)","v":"B"},{"$f":"VLOOKUP(H14,ledger,25,0)","v":2.8},{"$f":"VLOOKUP(H14,ledger,28,0)","v":"B+"}]
[null,null,{"$f":"C25+1","v":1032},"ACCOUNTING (IN)",null,1.25,{"$f":"VLOOKUP(H14,ledger,26,0)","v":"A"},{"$f":"VLOOKUP(H14,ledger,27,0)","v":3.6}]
[null,null,{"$f":"VLOOKUP(H14,ledger,29,0)","v":4251},"SINGING (TH)",null,3.75,{"$f":"VLOOKUP(H14,ledger,30,0)","v":"C+"},{"$f":"VLOOKUP(H14,ledger,31,0)","v":2.4},{"$f":"VLOOKUP(H14,ledger,34,0)","v":"B"}]
[null,null,{"$f":"C27+1","v":4252},"SINGING (IN)",null,1.25,{"$f":"VLOOKUP(H14,ledger,32,0)","v":"A+"},{"$f":"VLOOKUP(H14,ledger,33,0)","v":4}]
[null,null,{"$f":"VLOOKUP(H14,ledger,35,0)","v":4171},{"$f":"IFERROR(VLOOKUP(C29,codesub,2,0),\"SUB.CODE IS WRONG\")","v":"FINANCE (TH)"},null,3.75,{"$f":"VLOOKUP(H14,ledger,36,0)","v":"B"},{"$f":"VLOOKUP(H14,ledger,37,0)","v":2.8},{"$f":"VLOOKUP(H14,ledger,40,0)","v":"*"}]
[null,null,{"$f":"C29+1","v":4172},"FINANCE (IN)",null,1.25,{"$f":"VLOOKUP(H14,ledger,38,0)","v":"ABS"},{"$f":"VLOOKUP(H14,ledger,39,0)","v":"ABS"}]
[null,null,"GRADE POINT AVERAGE (GPA) :",null,null,null,null,null,{"$f":"VLOOKUP(H14,ledger,41,0)","v":"-"}]
[null,null,"EXTRA CREDIT SUBJECT"]
[null,null,{"$f":"IFERROR(VLOOKUP(H14,ledger,42,0),\"\")","v":0},{"$f":"IFERROR(VLOOKUP(C33,codesub,2,0),\"SUB.CODE IS WRONG\")","v":"SUB.CODE IS WRONG"},null,null,{"$f":"VLOOKUP(H14,ledger,43,0)","v":"ABS"},{"$f":"VLOOKUP(H14,ledger,44,0)","v":"ABS"},{"$f":"VLOOKUP(H14,ledger,47,0)","v":""}]
[null,null,{"$f":"IFERROR(C33+1,\"\")","v":1},{"$f":"IFERROR(VLOOKUP(C34,codesub,2,0),\"SUB.CODE IS WRONG\")","v":"SUB.CODE IS WRONG"},null,null,{"$f":"VLOOKUP(H14,ledger,45,0)","v":"ABS"},{"$f":"VLOOKUP(H14,ledger,46,0)","v":"ABS"}]
[null,null,"PREPARED BY : …………………………"]
[null,null,"CHECKED BY : …………………………"]
[null,null,"DATE OF ISSUE     :",null,"2079.03.15",null,null,"HEAD TEACHER"]
[]
[null,null,"NOTE : ONE CREDIT HOUR EQUALS TO 32 WORKING HOURS"]
[null,null,"INTERNAL (IN) : THIS COVERS THE PARTICIPATION, PRACTICAL/PROJECT WORKS, COMMUNITY \n                                     WORKS, INTERNSHIP, PRESENTATIONS, TERMINAL EXAMINATIONS."]
[null,null,"THEORY (TH) :  THIS COVERS WRITTEN EXTERNAL EXAMINATION"]
[null,null,"ABS = ABSENT",null,null,null,"       ","W= WITHHELD"]

{"sheet":"std9","index":13,"n_rows":42,"n_cols":10,"rows_kept":42,"cut":false,"hidden":false,"merged":[[2,2,6,9],[11,2,11,4],[11,5,11,9],[12,7,12,8],[13,2,13,3],[13,5,13,6],[14,2,14,4],[14,5,14,6],[14,7,14,9],[16,2,17,2],[16,3,17,4],[16,5,17,5],[16,6,17,6],[16,7,17,7],[16,8,17,8],[16,9,17,9],[18,3,18,4],[18,8,19,8],[19,3,19,4],[20,3,20,4],[20,8,21,8],[21,3,21,4],[22,3,22,4],[22,8,23,8],[23,3,23,4],[24,3,24,4],[24,8,25,8],[25,3,25,4],[34,2,34,4],[26,3,26,4],[26,8,27,8],[27,3,27,4],[28,3,28,4],[28,8,29,8],[29,3,29,4],[30,2,30,7],[31,2,31,9],[32,3,32,4],[32,8,33,8],[33,3,33,4],[41,2,41,3],[41,7,41,8],[35,2,35,4],[36,2,36,3],[36,7,36,9],[38,2,38,6],[39,2,39,9],[40,2,40,6]]}
[]
[]
[]
[]
[]
[]
[]
[]
[]
[]
[]
[null,null,"THE GRADE(S) SECURED BY   :",null,null,{"$f":"IFERROR(VLOOKUP(H14,ledger,2,0),\"This Symbol No. is not in Grade Ledger\")","v":"ISMITA RAI "}]
[null,null,"DATE OF BIRTH :",null,{"$f":"VLOOKUP(H14,ledger,3,0)","v":"2062-06-05"},"B.S.","       (",null,null,"A.D.)"]
[null,null,"REGISTRATION NO.",null,{"$f":"VLOOKUP(H14,ledger,4,0)","v":"801130210009"},"SYMBOL NO.",null,11301328,"GRADE","XI"]
[null,null,"IN THE EXAMINATION CONDUCTED IN ",null,null,"2080 B.S. (2022 A.D.)",null,"ARE GIVEN BELOW."]
[]
[null,null,"SUBJECT CODE","SUBJECTS",null,"CREDIT HOUR (CH)","GRADE","GARDE POINT (GP)","FINAL GRADE (FG) ","REMARKS"]
[]
[null,null,{"$f":"VLOOKUP(H14,ledger,5,0)","v":"0011"},{"$f":"IFERROR(VLOOKUP(C19,codesub,2,0),\"SUB.CODE IS WRONG\")","v":"COM. NEPALI (TH)"},null,2.25,{"$f":"VLOOKUP(H14,ledger,6,0)","v":"C+"},{"$f":"VLOOKUP(H14,ledger,7,0)","v":2.4},{"$f":"VLOOKUP(H14,ledger,10,0)","v":"C+"}]
[null,null,{"$f":"IF(C19=\"0011\",\"0012\",\"SORRY\")","v":"0012"},{"$f":"IF(C20=\"0012\",\"COM. NEPALI (IN)\",\"SUB.CODE IS WRONG\")","v":"COM. NEPALI (IN)"},null,0.75,{"$f":"VLOOKUP(H14,ledger,8,0)","v":"C"},{"$f":"VLOOKUP(H14,ledger,9,0)","v":2}]
[null,null,{"$f":"VLOOKUP(H14,ledger,11,0)","v":"0031"},{"$f":"IFERROR(VLOOKUP(C21,codesub,2,0),\"SUB.CODE IS WRONG\")","v":"COM. ENGLISH (TH)"},null,3,{"$f":"VLOOKUP(H14,ledger,12,0)","v":"C+"},{"$f":"VLOOKUP(H14,ledger,13,0)","v":2.4},{"$f":"VLOOKUP(H14,ledger,16,0)","v":"C+"}]
[null,null,{"$f":"IF(C21=\"0031\",\"0032\",\"SORRY\")","v":"0032"},{"$f":"IF(C22=\"0032\",\"COM. ENGLISH (IN)\",\"SUB.CODE IS WRONG\")","v":"COM. ENGLISH (IN)"},null,1,{"$f":"VLOOKUP(H14,ledger,14,0)","v":"C"},{"$f":"VLOOKUP(H14,ledger,15,0)","v":2}]
[null,null,{"$f":"VLOOKUP(H14,ledger,17,0)","v":"0051"},{"$f":"IF(C23=\"0051\",\"COM. SOCIAL STUDIES & LIFE SKILL (TH)\",IF(C23=\"0071\",\"COM. MATHEMATICS (TH)\",\"SUB.CODE IS WRONG\"))","v":"COM. SOCIAL STUDIES & LIFE SKILL (TH)"},null,3.75,{"$f":"VLOOKUP(H14,ledger,18,0)","v":"A"},{"$f":"VLOOKUP(H14,ledger,19,0)","v":3.6},{"$f":"VLOOKUP(H14,ledger,22,0)","v":"A+"},{"$f":"IF(OR($I$19=\"NG\",$I$21=\"NG\",$I$23=\"NG\",$I$25=\"NG\",$I$27=\"NG\",$I$29=\"NG\"),\"W\",\"\")","v":""}]
[null,null,{"$f":"IF(C23=\"0051\",\"0052\",IF(C23=\"0071\",\"0072\",\"SORRY\"))","v":"0052"},{"$f":"IF(C24=\"0052\",\"COM. SOCIAL STUDIES & LIFE SKILL (IN)\",IF(C24=\"0072\",\"COM. MATHEMATICS (IN)\",\"SUB.CODE IS WRONG\"))","v":"COM. SOCIAL STUDIES & LIFE SKILL (IN)"},null,1.25,{"$f":"VLOOKUP(H14,ledger,20,0)","v":"A+"},{"$f":"VLOOKUP(H14,ledger,21,0)","v":4},null,{"$f":"IF(OR($I$19=\"ABS\",$I$21=\"ABS\",$I$23=\"ABS\",$I$25=\"ABS\",$I$27=\"ABS\",$I$29=\"ABS\"),\"ABS\",\"\")","v":""}]
[null,null,{"$f":"VLOOKUP(H14,ledger,23,0)","v":1031},{"$f":"IFERROR(VLOOKUP(C25,codesub,2,0),\"SUB.CODE IS WRONG\")","v":"ACCOUNTING (TH)"},null,3.75,{"$f":"VLOOKUP(H14,ledger,24,0)","v":"B+"},{"$f":"VLOOKUP(H14,ledger,25,0)","v":3.2},{"$f":"VLOOKUP(H14,ledger,28,0)","v":"A"}]
[null,null,{"$f":"C25+1","v":1032},"ACCOUNTING (IN)",null,1.25,{"$f":"VLOOKUP(H14,ledger,26,0)","v":"A+"},{"$f":"VLOOKUP(H14,ledger,27,0)","v":4}]
[null,null,{"$f":"VLOOKUP(H14,ledger,29,0)","v":4251},"SINGING (TH)",null,3.75,{"$f":"VLOOKUP(H14,ledger,30,0)","v":"C"},{"$f":"VLOOKUP(H14,ledger,31,0)","v":2},{"$f":"VLOOKUP(H14,ledger,34,0)","v":"B"}]
[null,null,{"$f":"C27+1","v":4252},"SINGING (IN)",null,1.25,{"$f":"VLOOKUP(H14,ledger,32,0)","v":"A+"},{"$f":"VLOOKUP(H14,ledger,33,0)","v":4}]
[null,null,{"$f":"VLOOKUP(H14,ledger,35,0)","v":4171},{"$f":"IFERROR(VLOOKUP(C29,codesub,2,0),\"SUB.CODE IS WRONG\")","v":"FINANCE (TH)"},null,3.75,{"$f":"VLOOKUP(H14,ledger,36,0)","v":"B+"},{"$f":"VLOOKUP(H14,ledger,37,0)","v":3.2},{"$f":"VLOOKUP(H14,ledger,40,0)","v":"*"}]
[null,null,{"$f":"C29+1","v":4172},"FINANCE (IN)",null,1.25,{"$f":"VLOOKUP(H14,ledger,38,0)","v":"ABS"},{"$f":"VLOOKUP(H14,ledger,39,0)","v":"ABS"}]
[null,null,"GRADE POINT AVERAGE (GPA) :",null,null,null,null,null,{"$f":"VLOOKUP(H14,ledger,41,0)","v":"-"}]
[null,null,"EXTRA CREDIT SUBJECT"]
[null,null,{"$f":"IFERROR(VLOOKUP(H14,ledger,42,0),\"\")","v":0},{"$f":"IFERROR(VLOOKUP(C33,codesub,2,0),\"SUB.CODE IS WRONG\")","v":"SUB.CODE IS WRONG"},null,null,{"$f":"VLOOKUP(H14,ledger,43,0)","v":"ABS"},{"$f":"VLOOKUP(H14,ledger,44,0)","v":"ABS"},{"$f":"VLOOKUP(H14,ledger,47,0)","v":""}]
[null,null,{"$f":"IFERROR(C33+1,\"\")","v":1},{"$f":"IFERROR(VLOOKUP(C34,codesub,2,0),\"SUB.CODE IS WRONG\")","v":"SUB.CODE IS WRONG"},null,null,{"$f":"VLOOKUP(H14,ledger,45,0)","v":"ABS"},{"$f":"VLOOKUP(H14,ledger,46,0)","v":"ABS"}]
[null,null,"PREPARED BY : …………………………"]
[null,null,"CHECKED BY : …………………………"]
[null,null,"DATE OF ISSUE     :",null,"2079.03.15",null,null,"HEAD TEACHER"]
[]
[null,null,"NOTE : ONE CREDIT HOUR EQUALS TO 32 WORKING HOURS"]
[null,null,"INTERNAL (IN) : THIS COVERS THE PARTICIPATION, PRACTICAL/PROJECT WORKS, COMMUNITY \n                                     WORKS, INTERNSHIP, PRESENTATIONS, TERMINAL EXAMINATIONS."]
[null,null,"THEORY (TH) :  THIS COVERS WRITTEN EXTERNAL EXAMINATION"]
[null,null,"ABS = ABSENT",null,null,null,"       ","W= WITHHELD"]

{"sheet":"std10","index":14,"n_rows":42,"n_cols":10,"rows_kept":42,"cut":false,"hidden":false,"merged":[[2,2,6,9],[11,2,11,4],[11,5,11,9],[12,7,12,8],[13,2,13,3],[13,5,13,6],[14,2,14,4],[14,5,14,6],[14,7,14,9],[16,2,17,2],[16,3,17,4],[16,5,17,5],[16,6,17,6],[16,7,17,7],[16,8,17,8],[16,9,17,9],[18,3,18,4],[18,8,19,8],[19,3,19,4],[20,3,20,4],[20,8,21,8],[21,3,21,4],[22,3,22,4],[22,8,23,8],[23,3,23,4],[24,3,24,4],[24,8,25,8],[25,3,25,4],[34,2,34,4],[26,3,26,4],[26,8,27,8],[27,3,27,4],[28,3,28,4],[28,8,29,8],[29,3,29,4],[30,2,30,7],[31,2,31,9],[32,3,32,4],[32,8,33,8],[33,3,33,4],[41,2,41,3],[41,7,41,8],[35,2,35,4],[36,2,36,3],[36,7,36,9],[38,2,38,6],[39,2,39,9],[40,2,40,6]]}
[]
[]
[]
[]
[]
[]
[]
[]
[]
[]
[]
[null,null,"THE GRADE(S) SECURED BY   :",null,null,{"$f":"IFERROR(VLOOKUP(H14,ledger,2,0),\"This Symbol No. is not in Grade Ledger\")","v":"KANCHAN KHATRI "}]
[null,null,"DATE OF BIRTH :",null,{"$f":"VLOOKUP(H14,ledger,3,0)","v":"2063-12-05"},"B.S.","       (",null,null,"A.D.)"]
[null,null,"REGISTRATION NO.",null,{"$f":"VLOOKUP(H14,ledger,4,0)","v":"801130210010"},"SYMBOL NO.",null,11301329,"GRADE","XI"]
[null,null,"IN THE EXAMINATION CONDUCTED IN ",null,null,"2080 B.S. (2022 A.D.)",null,"ARE GIVEN BELOW."]
[]
[null,null,"SUBJECT CODE","SUBJECTS",null,"CREDIT HOUR (CH)","GRADE","GARDE POINT (GP)","FINAL GRADE (FG) ","REMARKS"]
[]
[null,null,{"$f":"VLOOKUP(H14,ledger,5,0)","v":"0011"},{"$f":"IFERROR(VLOOKUP(C19,codesub,2,0),\"SUB.CODE IS WRONG\")","v":"COM. NEPALI (TH)"},null,2.25,{"$f":"VLOOKUP(H14,ledger,6,0)","v":"C+"},{"$f":"VLOOKUP(H14,ledger,7,0)","v":2.4},{"$f":"VLOOKUP(H14,ledger,10,0)","v":"C+"}]
[null,null,{"$f":"IF(C19=\"0011\",\"0012\",\"SORRY\")","v":"0012"},{"$f":"IF(C20=\"0012\",\"COM. NEPALI (IN)\",\"SUB.CODE IS WRONG\")","v":"COM. NEPALI (IN)"},null,0.75,{"$f":"VLOOKUP(H14,ledger,8,0)","v":"C"},{"$f":"VLOOKUP(H14,ledger,9,0)","v":2}]
[null,null,{"$f":"VLOOKUP(H14,ledger,11,0)","v":"0031"},{"$f":"IFERROR(VLOOKUP(C21,codesub,2,0),\"SUB.CODE IS WRONG\")","v":"COM. ENGLISH (TH)"},null,3,{"$f":"VLOOKUP(H14,ledger,12,0)","v":"C+"},{"$f":"VLOOKUP(H14,ledger,13,0)","v":2.4},{"$f":"VLOOKUP(H14,ledger,16,0)","v":"C+"}]
[null,null,{"$f":"IF(C21=\"0031\",\"0032\",\"SORRY\")","v":"0032"},{"$f":"IF(C22=\"0032\",\"COM. ENGLISH (IN)\",\"SUB.CODE IS WRONG\")","v":"COM. ENGLISH (IN)"},null,1,{"$f":"VLOOKUP(H14,ledger,14,0)","v":"C"},{"$f":"VLOOKUP(H14,ledger,15,0)","v":2}]
[null,null,{"$f":"VLOOKUP(H14,ledger,17,0)","v":"0051"},{"$f":"IF(C23=\"0051\",\"COM. SOCIAL STUDIES & LIFE SKILL (TH)\",IF(C23=\"0071\",\"COM. MATHEMATICS (TH)\",\"SUB.CODE IS WRONG\"))","v":"COM. SOCIAL STUDIES & LIFE SKILL (TH)"},null,3.75,{"$f":"VLOOKUP(H14,ledger,18,0)","v":"B+"},{"$f":"VLOOKUP(H14,ledger,19,0)","v":3.2},{"$f":"VLOOKUP(H14,ledger,22,0)","v":"A"},{"$f":"IF(OR($I$19=\"NG\",$I$21=\"NG\",$I$23=\"NG\",$I$25=\"NG\",$I$27=\"NG\",$I$29=\"NG\"),\"W\",\"\")","v":""}]
[null,null,{"$f":"IF(C23=\"0051\",\"0052\",IF(C23=\"0071\",\"0072\",\"SORRY\"))","v":"0052"},{"$f":"IF(C24=\"0052\",\"COM. SOCIAL STUDIES & LIFE SKILL (IN)\",IF(C24=\"0072\",\"COM. MATHEMATICS (IN)\",\"SUB.CODE IS WRONG\"))","v":"COM. SOCIAL STUDIES & LIFE SKILL (IN)"},null,1.25,{"$f":"VLOOKUP(H14,ledger,20,0)","v":"A+"},{"$f":"VLOOKUP(H14,ledger,21,0)","v":4},null,{"$f":"IF(OR($I$19=\"ABS\",$I$21=\"ABS\",$I$23=\"ABS\",$I$25=\"ABS\",$I$27=\"ABS\",$I$29=\"ABS\"),\"ABS\",\"\")","v":""}]
[null,null,{"$f":"VLOOKUP(H14,ledger,23,0)","v":1031},{"$f":"IFERROR(VLOOKUP(C25,codesub,2,0),\"SUB.CODE IS WRONG\")","v":"ACCOUNTING (TH)"},null,3.75,{"$f":"VLOOKUP(H14,ledger,24,0)","v":"B+"},{"$f":"VLOOKUP(H14,ledger,25,0)","v":3.2},{"$f":"VLOOKUP(H14,ledger,28,0)","v":"A"}]
[null,null,{"$f":"C25+1","v":1032},"ACCOUNTING (IN)",null,1.25,{"$f":"VLOOKUP(H14,ledger,26,0)","v":"A+"},{"$f":"VLOOKUP(H14,ledger,27,0)","v":4}]
[null,null,{"$f":"VLOOKUP(H14,ledger,29,0)","v":4251},"SINGING (TH)",null,3.75,{"$f":"VLOOKUP(H14,ledger,30,0)","v":"C+"},{"$f":"VLOOKUP(H14,ledger,31,0)","v":2.4},{"$f":"VLOOKUP(H14,ledger,34,0)","v":"B"}]
[null,null,{"$f":"C27+1","v":4252},"SINGING (IN)",null,1.25,{"$f":"VLOOKUP(H14,ledger,32,0)","v":"A+"},{"$f":"VLOOKUP(H14,ledger,33,0)","v":4}]
[null,null,{"$f":"VLOOKUP(H14,ledger,35,0)","v":4171},{"$f":"IFERROR(VLOOKUP(C29,codesub,2,0),\"SUB.CODE IS WRONG\")","v":"FINANCE (TH)"},null,3.75,{"$f":"VLOOKUP(H14,ledger,36,0)","v":"B+"},{"$f":"VLOOKUP(H14,ledger,37,0)","v":3.2},{"$f":"VLOOKUP(H14,ledger,40,0)","v":"*"}]
[null,null,{"$f":"C29+1","v":4172},"FINANCE (IN)",null,1.25,{"$f":"VLOOKUP(H14,ledger,38,0)","v":"ABS"},{"$f":"VLOOKUP(H14,ledger,39,0)","v":"ABS"}]
[null,null,"GRADE POINT AVERAGE (GPA) :",null,null,null,null,null,{"$f":"VLOOKUP(H14,ledger,41,0)","v":"-"}]
[null,null,"EXTRA CREDIT SUBJECT"]
[null,null,{"$f":"IFERROR(VLOOKUP(H14,ledger,42,0),\"\")","v":0},{"$f":"IFERROR(VLOOKUP(C33,codesub,2,0),\"SUB.CODE IS WRONG\")","v":"SUB.CODE IS WRONG"},null,null,{"$f":"VLOOKUP(H14,ledger,43,0)","v":"ABS"},{"$f":"VLOOKUP(H14,ledger,44,0)","v":"ABS"},{"$f":"VLOOKUP(H14,ledger,47,0)","v":""}]
[null,null,{"$f":"IFERROR(C33+1,\"\")","v":1},{"$f":"IFERROR(VLOOKUP(C34,codesub,2,0),\"SUB.CODE IS WRONG\")","v":"SUB.CODE IS WRONG"},null,null,{"$f":"VLOOKUP(H14,ledger,45,0)","v":"ABS"},{"$f":"VLOOKUP(H14,ledger,46,0)","v":"ABS"}]
[null,null,"PREPARED BY : …………………………"]
[null,null,"CHECKED BY : …………………………"]
[null,null,"DATE OF ISSUE     :",null,"2079.03.15",null,null,"HEAD TEACHER"]
[]
[null,null,"NOTE : ONE CREDIT HOUR EQUALS TO 32 WORKING HOURS"]
[null,null,"INTERNAL (IN) : THIS COVERS THE PARTICIPATION, PRACTICAL/PROJECT WORKS, COMMUNITY \n                                     WORKS, INTERNSHIP, PRESENTATIONS, TERMINAL EXAMINATIONS."]
[null,null,"THEORY (TH) :  THIS COVERS WRITTEN EXTERNAL EXAMINATION"]
[null,null,"ABS = ABSENT",null,null,null,"       ","W= WITHHELD"]

{"sheet":"std11","index":15,"n_rows":42,"n_cols":10,"rows_kept":42,"cut":false,"hidden":false,"merged":[[2,2,6,9],[11,2,11,4],[11,5,11,9],[12,7,12,8],[13,2,13,3],[13,5,13,6],[14,2,14,4],[14,5,14,6],[14,7,14,9],[16,2,17,2],[16,3,17,4],[16,5,17,5],[16,6,17,6],[16,7,17,7],[16,8,17,8],[16,9,17,9],[18,3,18,4],[18,8,19,8],[19,3,19,4],[20,3,20,4],[20,8,21,8],[21,3,21,4],[22,3,22,4],[22,8,23,8],[23,3,23,4],[24,3,24,4],[24,8,25,8],[25,3,25,4],[34,2,34,4],[26,3,26,4],[26,8,27,8],[27,3,27,4],[28,3,28,4],[28,8,29,8],[29,3,29,4],[30,2,30,7],[31,2,31,9],[32,3,32,4],[32,8,33,8],[33,3,33,4],[41,2,41,3],[41,7,41,8],[35,2,35,4],[36,2,36,3],[36,7,36,9],[38,2,38,6],[39,2,39,9],[40,2,40,6]]}
[]
[]
[]
[]
[]
[]
[]
[]
[]
[]
[]
[null,null,"THE GRADE(S) SECURED BY   :",null,null,{"$f":"IFERROR(VLOOKUP(H14,ledger,2,0),\"This Symbol No. is not in Grade Ledger\")","v":"KAUSTUV JUNG KHADKA "}]
[null,null,"DATE OF BIRTH :",null,{"$f":"VLOOKUP(H14,ledger,3,0)","v":"2064-03-11"},"B.S.","       (",null,null,"A.D.)"]
[null,null,"REGISTRATION NO.",null,{"$f":"VLOOKUP(H14,ledger,4,0)","v":"801130210011"},"SYMBOL NO.",null,11301330,"GRADE","XI"]
[null,null,"IN THE EXAMINATION CONDUCTED IN ",null,null,"2080 B.S. (2022 A.D.)",null,"ARE GIVEN BELOW."]
[]
[null,null,"SUBJECT CODE","SUBJECTS",null,"CREDIT HOUR (CH)","GRADE","GARDE POINT (GP)","FINAL GRADE (FG) ","REMARKS"]
[]
[null,null,{"$f":"VLOOKUP(H14,ledger,5,0)","v":"0011"},{"$f":"IFERROR(VLOOKUP(C19,codesub,2,0),\"SUB.CODE IS WRONG\")","v":"COM. NEPALI (TH)"},null,2.25,{"$f":"VLOOKUP(H14,ledger,6,0)","v":"B+"},{"$f":"VLOOKUP(H14,ledger,7,0)","v":3.2},{"$f":"VLOOKUP(H14,ledger,10,0)","v":"B+"}]
[null,null,{"$f":"IF(C19=\"0011\",\"0012\",\"SORRY\")","v":"0012"},{"$f":"IF(C20=\"0012\",\"COM. NEPALI (IN)\",\"SUB.CODE IS WRONG\")","v":"COM. NEPALI (IN)"},null,0.75,{"$f":"VLOOKUP(H14,ledger,8,0)","v":"B"},{"$f":"VLOOKUP(H14,ledger,9,0)","v":2.8}]
[null,null,{"$f":"VLOOKUP(H14,ledger,11,0)","v":"0031"},{"$f":"IFERROR(VLOOKUP(C21,codesub,2,0),\"SUB.CODE IS WRONG\")","v":"COM. ENGLISH (TH)"},null,3,{"$f":"VLOOKUP(H14,ledger,12,0)","v":"B+"},{"$f":"VLOOKUP(H14,ledger,13,0)","v":3.2},{"$f":"VLOOKUP(H14,ledger,16,0)","v":"B+"}]
[null,null,{"$f":"IF(C21=\"0031\",\"0032\",\"SORRY\")","v":"0032"},{"$f":"IF(C22=\"0032\",\"COM. ENGLISH (IN)\",\"SUB.CODE IS WRONG\")","v":"COM. ENGLISH (IN)"},null,1,{"$f":"VLOOKUP(H14,ledger,14,0)","v":"B"},{"$f":"VLOOKUP(H14,ledger,15,0)","v":2.8}]
[null,null,{"$f":"VLOOKUP(H14,ledger,17,0)","v":"0051"},{"$f":"IF(C23=\"0051\",\"COM. SOCIAL STUDIES & LIFE SKILL (TH)\",IF(C23=\"0071\",\"COM. MATHEMATICS (TH)\",\"SUB.CODE IS WRONG\"))","v":"COM. SOCIAL STUDIES & LIFE SKILL (TH)"},null,3.75,{"$f":"VLOOKUP(H14,ledger,18,0)","v":"A"},{"$f":"VLOOKUP(H14,ledger,19,0)","v":3.6},{"$f":"VLOOKUP(H14,ledger,22,0)","v":"A+"},{"$f":"IF(OR($I$19=\"NG\",$I$21=\"NG\",$I$23=\"NG\",$I$25=\"NG\",$I$27=\"NG\",$I$29=\"NG\"),\"W\",\"\")","v":""}]
[null,null,{"$f":"IF(C23=\"0051\",\"0052\",IF(C23=\"0071\",\"0072\",\"SORRY\"))","v":"0052"},{"$f":"IF(C24=\"0052\",\"COM. SOCIAL STUDIES & LIFE SKILL (IN)\",IF(C24=\"0072\",\"COM. MATHEMATICS (IN)\",\"SUB.CODE IS WRONG\"))","v":"COM. SOCIAL STUDIES & LIFE SKILL (IN)"},null,1.25,{"$f":"VLOOKUP(H14,ledger,20,0)","v":"A+"},{"$f":"VLOOKUP(H14,ledger,21,0)","v":4},null,{"$f":"IF(OR($I$19=\"ABS\",$I$21=\"ABS\",$I$23=\"ABS\",$I$25=\"ABS\",$I$27=\"ABS\",$I$29=\"ABS\"),\"ABS\",\"\")","v":""}]
[null,null,{"$f":"VLOOKUP(H14,ledger,23,0)","v":1031},{"$f":"IFERROR(VLOOKUP(C25,codesub,2,0),\"SUB.CODE IS WRONG\")","v":"ACCOUNTING (TH)"},null,3.75,{"$f":"VLOOKUP(H14,ledger,24,0)","v":"A"},{"$f":"VLOOKUP(H14,ledger,25,0)","v":3.6},{"$f":"VLOOKUP(H14,ledger,28,0)","v":"A+"}]
[null,null,{"$f":"C25+1","v":1032},"ACCOUNTING (IN)",null,1.25,{"$f":"VLOOKUP(H14,ledger,26,0)","v":"A+"},{"$f":"VLOOKUP(H14,ledger,27,0)","v":4}]
[null,null,{"$f":"VLOOKUP(H14,ledger,29,0)","v":4251},"SINGING (TH)",null,3.75,{"$f":"VLOOKUP(H14,ledger,30,0)","v":"C+"},{"$f":"VLOOKUP(H14,ledger,31,0)","v":2.4},{"$f":"VLOOKUP(H14,ledger,34,0)","v":"B"}]
[null,null,{"$f":"C27+1","v":4252},"SINGING (IN)",null,1.25,{"$f":"VLOOKUP(H14,ledger,32,0)","v":"A+"},{"$f":"VLOOKUP(H14,ledger,33,0)","v":4}]
[null,null,{"$f":"VLOOKUP(H14,ledger,35,0)","v":4171},{"$f":"IFERROR(VLOOKUP(C29,codesub,2,0),\"SUB.CODE IS WRONG\")","v":"FINANCE (TH)"},null,3.75,{"$f":"VLOOKUP(H14,ledger,36,0)","v":"B+"},{"$f":"VLOOKUP(H14,ledger,37,0)","v":3.2},{"$f":"VLOOKUP(H14,ledger,40,0)","v":"*"}]
[null,null,{"$f":"C29+1","v":4172},"FINANCE (IN)",null,1.25,{"$f":"VLOOKUP(H14,ledger,38,0)","v":"ABS"},{"$f":"VLOOKUP(H14,ledger,39,0)","v":"ABS"}]
[null,null,"GRADE POINT AVERAGE (GPA) :",null,null,null,null,null,{"$f":"VLOOKUP(H14,ledger,41,0)","v":"-"}]
[null,null,"EXTRA CREDIT SUBJECT"]
[null,null,{"$f":"IFERROR(VLOOKUP(H14,ledger,42,0),\"\")","v":0},{"$f":"IFERROR(VLOOKUP(C33,codesub,2,0),\"SUB.CODE IS WRONG\")","v":"SUB.CODE IS WRONG"},null,null,{"$f":"VLOOKUP(H14,ledger,43,0)","v":"ABS"},{"$f":"VLOOKUP(H14,ledger,44,0)","v":"ABS"},{"$f":"VLOOKUP(H14,ledger,47,0)","v":""}]
[null,null,{"$f":"IFERROR(C33+1,\"\")","v":1},{"$f":"IFERROR(VLOOKUP(C34,codesub,2,0),\"SUB.CODE IS WRONG\")","v":"SUB.CODE IS WRONG"},null,null,{"$f":"VLOOKUP(H14,ledger,45,0)","v":"ABS"},{"$f":"VLOOKUP(H14,ledger,46,0)","v":"ABS"}]
[null,null,"PREPARED BY : …………………………"]
[null,null,"CHECKED BY : …………………………"]
[null,null,"DATE OF ISSUE     :",null,"2079.03.15",null,null,"HEAD TEACHER"]
[]
[null,null,"NOTE : ONE CREDIT HOUR EQUALS TO 32 WORKING HOURS"]
[null,null,"INTERNAL (IN) : THIS COVERS THE PARTICIPATION, PRACTICAL/PROJECT WORKS, COMMUNITY \n                                     WORKS, INTERNSHIP, PRESENTATIONS, TERMINAL EXAMINATIONS."]
[null,null,"THEORY (TH) :  THIS COVERS WRITTEN EXTERNAL EXAMINATION"]
[null,null,"ABS = ABSENT",null,null,null,"       ","W= WITHHELD"]

{"sheet":"std12","index":16,"n_rows":42,"n_cols":10,"rows_kept":42,"cut":false,"hidden":false,"merged":[[2,2,6,9],[11,2,11,4],[11,5,11,9],[12,7,12,8],[13,2,13,3],[13,5,13,6],[14,2,14,4],[14,5,14,6],[14,7,14,9],[16,2,17,2],[16,3,17,4],[16,5,17,5],[16,6,17,6],[16,7,17,7],[16,8,17,8],[16,9,17,9],[18,3,18,4],[18,8,19,8],[19,3,19,4],[20,3,20,4],[20,8,21,8],[21,3,21,4],[22,3,22,4],[22,8,23,8],[23,3,23,4],[24,3,24,4],[24,8,25,8],[25,3,25,4],[34,2,34,4],[26,3,26,4],[26,8,27,8],[27,3,27,4],[28,3,28,4],[28,8,29,8],[29,3,29,4],[30,2,30,7],[31,2,31,9],[32,3,32,4],[32,8,33,8],[33,3,33,4],[41,2,41,3],[41,7,41,8],[35,2,35,4],[36,2,36,3],[36,7,36,9],[38,2,38,6],[39,2,39,9],[40,2,40,6]]}
[]
[]
[]
[]
[]
[]
[]
[]
[]
[]
[]
[null,null,"THE GRADE(S) SECURED BY   :",null,null,{"$f":"IFERROR(VLOOKUP(H14,ledger,2,0),\"This Symbol No. is not in Grade Ledger\")","v":"KUSUM RAI "}]
[null,null,"DATE OF BIRTH :",null,{"$f":"VLOOKUP(H14,ledger,3,0)","v":"2063-01-19"},"B.S.","       (",null,null,"A.D.)"]
[null,null,"REGISTRATION NO.",null,{"$f":"VLOOKUP(H14,ledger,4,0)","v":"801130210012"},"SYMBOL NO.",null,11301331,"GRADE","XI"]
[null,null,"IN THE EXAMINATION CONDUCTED IN ",null,null,"2080 B.S. (2022 A.D.)",null,"ARE GIVEN BELOW."]
[]
[null,null,"SUBJECT CODE","SUBJECTS",null,"CREDIT HOUR (CH)","GRADE","GARDE POINT (GP)","FINAL GRADE (FG) ","REMARKS"]
[]
[null,null,{"$f":"VLOOKUP(H14,ledger,5,0)","v":"0011"},{"$f":"IFERROR(VLOOKUP(C19,codesub,2,0),\"SUB.CODE IS WRONG\")","v":"COM. NEPALI (TH)"},null,2.25,{"$f":"VLOOKUP(H14,ledger,6,0)","v":"C+"},{"$f":"VLOOKUP(H14,ledger,7,0)","v":2.4},{"$f":"VLOOKUP(H14,ledger,10,0)","v":"C+"}]
[null,null,{"$f":"IF(C19=\"0011\",\"0012\",\"SORRY\")","v":"0012"},{"$f":"IF(C20=\"0012\",\"COM. NEPALI (IN)\",\"SUB.CODE IS WRONG\")","v":"COM. NEPALI (IN)"},null,0.75,{"$f":"VLOOKUP(H14,ledger,8,0)","v":"C"},{"$f":"VLOOKUP(H14,ledger,9,0)","v":2}]
[null,null,{"$f":"VLOOKUP(H14,ledger,11,0)","v":"0031"},{"$f":"IFERROR(VLOOKUP(C21,codesub,2,0),\"SUB.CODE IS WRONG\")","v":"COM. ENGLISH (TH)"},null,3,{"$f":"VLOOKUP(H14,ledger,12,0)","v":"C+"},{"$f":"VLOOKUP(H14,ledger,13,0)","v":2.4},{"$f":"VLOOKUP(H14,ledger,16,0)","v":"C+"}]
[null,null,{"$f":"IF(C21=\"0031\",\"0032\",\"SORRY\")","v":"0032"},{"$f":"IF(C22=\"0032\",\"COM. ENGLISH (IN)\",\"SUB.CODE IS WRONG\")","v":"COM. ENGLISH (IN)"},null,1,{"$f":"VLOOKUP(H14,ledger,14,0)","v":"C"},{"$f":"VLOOKUP(H14,ledger,15,0)","v":2}]
[null,null,{"$f":"VLOOKUP(H14,ledger,17,0)","v":"0051"},{"$f":"IF(C23=\"0051\",\"COM. SOCIAL STUDIES & LIFE SKILL (TH)\",IF(C23=\"0071\",\"COM. MATHEMATICS (TH)\",\"SUB.CODE IS WRONG\"))","v":"COM. SOCIAL STUDIES & LIFE SKILL (TH)"},null,3.75,{"$f":"VLOOKUP(H14,ledger,18,0)","v":"B"},{"$f":"VLOOKUP(H14,ledger,19,0)","v":2.8},{"$f":"VLOOKUP(H14,ledger,22,0)","v":"B+"},{"$f":"IF(OR($I$19=\"NG\",$I$21=\"NG\",$I$23=\"NG\",$I$25=\"NG\",$I$27=\"NG\",$I$29=\"NG\"),\"W\",\"\")","v":""}]
[null,null,{"$f":"IF(C23=\"0051\",\"0052\",IF(C23=\"0071\",\"0072\",\"SORRY\"))","v":"0052"},{"$f":"IF(C24=\"0052\",\"COM. SOCIAL STUDIES & LIFE SKILL (IN)\",IF(C24=\"0072\",\"COM. MATHEMATICS (IN)\",\"SUB.CODE IS WRONG\"))","v":"COM. SOCIAL STUDIES & LIFE SKILL (IN)"},null,1.25,{"$f":"VLOOKUP(H14,ledger,20,0)","v":"A"},{"$f":"VLOOKUP(H14,ledger,21,0)","v":3.6},null,{"$f":"IF(OR($I$19=\"ABS\",$I$21=\"ABS\",$I$23=\"ABS\",$I$25=\"ABS\",$I$27=\"ABS\",$I$29=\"ABS\"),\"ABS\",\"\")","v":""}]
[null,null,{"$f":"VLOOKUP(H14,ledger,23,0)","v":1031},{"$f":"IFERROR(VLOOKUP(C25,codesub,2,0),\"SUB.CODE IS WRONG\")","v":"ACCOUNTING (TH)"},null,3.75,{"$f":"VLOOKUP(H14,ledger,24,0)","v":"B+"},{"$f":"VLOOKUP(H14,ledger,25,0)","v":3.2},{"$f":"VLOOKUP(H14,ledger,28,0)","v":"A"}]
[null,null,{"$f":"C25+1","v":1032},"ACCOUNTING (IN)",null,1.25,{"$f":"VLOOKUP(H14,ledger,26,0)","v":"A"},{"$f":"VLOOKUP(H14,ledger,27,0)","v":3.6}]
[null,null,{"$f":"VLOOKUP(H14,ledger,29,0)","v":4251},"SINGING (TH)",null,3.75,{"$f":"VLOOKUP(H14,ledger,30,0)","v":"C"},{"$f":"VLOOKUP(H14,ledger,31,0)","v":2},{"$f":"VLOOKUP(H14,ledger,34,0)","v":"B"}]
[null,null,{"$f":"C27+1","v":4252},"SINGING (IN)",null,1.25,{"$f":"VLOOKUP(H14,ledger,32,0)","v":"A+"},{"$f":"VLOOKUP(H14,ledger,33,0)","v":4}]
[null,null,{"$f":"VLOOKUP(H14,ledger,35,0)","v":4171},{"$f":"IFERROR(VLOOKUP(C29,codesub,2,0),\"SUB.CODE IS WRONG\")","v":"FINANCE (TH)"},null,3.75,{"$f":"VLOOKUP(H14,ledger,36,0)","v":"B+"},{"$f":"VLOOKUP(H14,ledger,37,0)","v":3.2},{"$f":"VLOOKUP(H14,ledger,40,0)","v":"*"}]
[null,null,{"$f":"C29+1","v":4172},"FINANCE (IN)",null,1.25,{"$f":"VLOOKUP(H14,ledger,38,0)","v":"ABS"},{"$f":"VLOOKUP(H14,ledger,39,0)","v":"ABS"}]
[null,null,"GRADE POINT AVERAGE (GPA) :",null,null,null,null,null,{"$f":"VLOOKUP(H14,ledger,41,0)","v":"-"}]
[null,null,"EXTRA CREDIT SUBJECT"]
[null,null,{"$f":"IFERROR(VLOOKUP(H14,ledger,42,0),\"\")","v":0},{"$f":"IFERROR(VLOOKUP(C33,codesub,2,0),\"SUB.CODE IS WRONG\")","v":"SUB.CODE IS WRONG"},null,null,{"$f":"VLOOKUP(H14,ledger,43,0)","v":"ABS"},{"$f":"VLOOKUP(H14,ledger,44,0)","v":"ABS"},{"$f":"VLOOKUP(H14,ledger,47,0)","v":""}]
[null,null,{"$f":"IFERROR(C33+1,\"\")","v":1},{"$f":"IFERROR(VLOOKUP(C34,codesub,2,0),\"SUB.CODE IS WRONG\")","v":"SUB.CODE IS WRONG"},null,null,{"$f":"VLOOKUP(H14,ledger,45,0)","v":"ABS"},{"$f":"VLOOKUP(H14,ledger,46,0)","v":"ABS"}]
[null,null,"PREPARED BY : …………………………"]
[null,null,"CHECKED BY : …………………………"]
[null,null,"DATE OF ISSUE     :",null,"2079.03.15",null,null,"HEAD TEACHER"]
[]
[null,null,"NOTE : ONE CREDIT HOUR EQUALS TO 32 WORKING HOURS"]
[null,null,"INTERNAL (IN) : THIS COVERS THE PARTICIPATION, PRACTICAL/PROJECT WORKS, COMMUNITY \n                                     WORKS, INTERNSHIP, PRESENTATIONS, TERMINAL EXAMINATIONS."]
[null,null,"THEORY (TH) :  THIS COVERS WRITTEN EXTERNAL EXAMINATION"]
[null,null,"ABS = ABSENT",null,null,null,"       ","W= WITHHELD"]

{"sheet":"std13","index":17,"n_rows":42,"n_cols":10,"rows_kept":42,"cut":false,"hidden":false,"merged":[[2,2,6,9],[11,2,11,4],[11,5,11,9],[12,7,12,8],[13,2,13,3],[13,5,13,6],[14,2,14,4],[14,5,14,6],[14,7,14,9],[16,2,17,2],[16,3,17,4],[16,5,17,5],[16,6,17,6],[16,7,17,7],[16,8,17,8],[16,9,17,9],[18,3,18,4],[18,8,19,8],[19,3,19,4],[20,3,20,4],[20,8,21,8],[21,3,21,4],[22,3,22,4],[22,8,23,8],[23,3,23,4],[24,3,24,4],[24,8,25,8],[25,3,25,4],[34,2,34,4],[26,3,26,4],[26,8,27,8],[27,3,27,4],[28,3,28,4],[28,8,29,8],[29,3,29,4],[30,2,30,7],[31,2,31,9],[32,3,32,4],[32,8,33,8],[33,3,33,4],[41,2,41,3],[41,7,41,8],[35,2,35,4],[36,2,36,3],[36,7,36,9],[38,2,38,6],[39,2,39,9],[40,2,40,6]]}
[]
[]
[]
[]
[]
[]
[]
[]
[]
[]
[]
[null,null,"THE GRADE(S) SECURED BY   :",null,null,{"$f":"IFERROR(VLOOKUP(H14,ledger,2,0),\"This Symbol No. is not in Grade Ledger\")","v":"LEPMUHANG RAI "}]
[null,null,"DATE OF BIRTH :",null,{"$f":"VLOOKUP(H14,ledger,3,0)","v":"2062-04-23"},"B.S.","       (",null,null,"A.D.)"]
[null,null,"REGISTRATION NO.",null,{"$f":"VLOOKUP(H14,ledger,4,0)","v":"801130210013"},"SYMBOL NO.",null,11301332,"GRADE","XI"]
[null,null,"IN THE EXAMINATION CONDUCTED IN ",null,null,"2080 B.S. (2022 A.D.)",null,"ARE GIVEN BELOW."]
[]
[null,null,"SUBJECT CODE","SUBJECTS",null,"CREDIT HOUR (CH)","GRADE","GARDE POINT (GP)","FINAL GRADE (FG) ","REMARKS"]
[]
[null,null,{"$f":"VLOOKUP(H14,ledger,5,0)","v":"0011"},{"$f":"IFERROR(VLOOKUP(C19,codesub,2,0),\"SUB.CODE IS WRONG\")","v":"COM. NEPALI (TH)"},null,2.25,{"$f":"VLOOKUP(H14,ledger,6,0)","v":"C"},{"$f":"VLOOKUP(H14,ledger,7,0)","v":2},{"$f":"VLOOKUP(H14,ledger,10,0)","v":"C"}]
[null,null,{"$f":"IF(C19=\"0011\",\"0012\",\"SORRY\")","v":"0012"},{"$f":"IF(C20=\"0012\",\"COM. NEPALI (IN)\",\"SUB.CODE IS WRONG\")","v":"COM. NEPALI (IN)"},null,0.75,{"$f":"VLOOKUP(H14,ledger,8,0)","v":"C"},{"$f":"VLOOKUP(H14,ledger,9,0)","v":2}]
[null,null,{"$f":"VLOOKUP(H14,ledger,11,0)","v":"0031"},{"$f":"IFERROR(VLOOKUP(C21,codesub,2,0),\"SUB.CODE IS WRONG\")","v":"COM. ENGLISH (TH)"},null,3,{"$f":"VLOOKUP(H14,ledger,12,0)","v":"C"},{"$f":"VLOOKUP(H14,ledger,13,0)","v":2},{"$f":"VLOOKUP(H14,ledger,16,0)","v":"C"}]
[null,null,{"$f":"IF(C21=\"0031\",\"0032\",\"SORRY\")","v":"0032"},{"$f":"IF(C22=\"0032\",\"COM. ENGLISH (IN)\",\"SUB.CODE IS WRONG\")","v":"COM. ENGLISH (IN)"},null,1,{"$f":"VLOOKUP(H14,ledger,14,0)","v":"C"},{"$f":"VLOOKUP(H14,ledger,15,0)","v":2}]
[null,null,{"$f":"VLOOKUP(H14,ledger,17,0)","v":"0051"},{"$f":"IF(C23=\"0051\",\"COM. SOCIAL STUDIES & LIFE SKILL (TH)\",IF(C23=\"0071\",\"COM. MATHEMATICS (TH)\",\"SUB.CODE IS WRONG\"))","v":"COM. SOCIAL STUDIES & LIFE SKILL (TH)"},null,3.75,{"$f":"VLOOKUP(H14,ledger,18,0)","v":"B+"},{"$f":"VLOOKUP(H14,ledger,19,0)","v":3.2},{"$f":"VLOOKUP(H14,ledger,22,0)","v":"A"},{"$f":"IF(OR($I$19=\"NG\",$I$21=\"NG\",$I$23=\"NG\",$I$25=\"NG\",$I$27=\"NG\",$I$29=\"NG\"),\"W\",\"\")","v":""}]
[null,null,{"$f":"IF(C23=\"0051\",\"0052\",IF(C23=\"0071\",\"0072\",\"SORRY\"))","v":"0052"},{"$f":"IF(C24=\"0052\",\"COM. SOCIAL STUDIES & LIFE SKILL (IN)\",IF(C24=\"0072\",\"COM. MATHEMATICS (IN)\",\"SUB.CODE IS WRONG\"))","v":"COM. SOCIAL STUDIES & LIFE SKILL (IN)"},null,1.25,{"$f":"VLOOKUP(H14,ledger,20,0)","v":"A"},{"$f":"VLOOKUP(H14,ledger,21,0)","v":3.6},null,{"$f":"IF(OR($I$19=\"ABS\",$I$21=\"ABS\",$I$23=\"ABS\",$I$25=\"ABS\",$I$27=\"ABS\",$I$29=\"ABS\"),\"ABS\",\"\")","v":""}]
[null,null,{"$f":"VLOOKUP(H14,ledger,23,0)","v":1031},{"$f":"IFERROR(VLOOKUP(C25,codesub,2,0),\"SUB.CODE IS WRONG\")","v":"ACCOUNTING (TH)"},null,3.75,{"$f":"VLOOKUP(H14,ledger,24,0)","v":"B+"},{"$f":"VLOOKUP(H14,ledger,25,0)","v":3.2},{"$f":"VLOOKUP(H14,ledger,28,0)","v":"A"}]
[null,null,{"$f":"C25+1","v":1032},"ACCOUNTING (IN)",null,1.25,{"$f":"VLOOKUP(H14,ledger,26,0)","v":"A"},{"$f":"VLOOKUP(H14,ledger,27,0)","v":3.6}]
[null,null,{"$f":"VLOOKUP(H14,ledger,29,0)","v":4251},"SINGING (TH)",null,3.75,{"$f":"VLOOKUP(H14,ledger,30,0)","v":"C+"},{"$f":"VLOOKUP(H14,ledger,31,0)","v":2.4},{"$f":"VLOOKUP(H14,ledger,34,0)","v":"B"}]
[null,null,{"$f":"C27+1","v":4252},"SINGING (IN)",null,1.25,{"$f":"VLOOKUP(H14,ledger,32,0)","v":"A+"},{"$f":"VLOOKUP(H14,ledger,33,0)","v":4}]
[null,null,{"$f":"VLOOKUP(H14,ledger,35,0)","v":4171},{"$f":"IFERROR(VLOOKUP(C29,codesub,2,0),\"SUB.CODE IS WRONG\")","v":"FINANCE (TH)"},null,3.75,{"$f":"VLOOKUP(H14,ledger,36,0)","v":"A"},{"$f":"VLOOKUP(H14,ledger,37,0)","v":3.6},{"$f":"VLOOKUP(H14,ledger,40,0)","v":"*"}]
[null,null,{"$f":"C29+1","v":4172},"FINANCE (IN)",null,1.25,{"$f":"VLOOKUP(H14,ledger,38,0)","v":"ABS"},{"$f":"VLOOKUP(H14,ledger,39,0)","v":"ABS"}]
[null,null,"GRADE POINT AVERAGE (GPA) :",null,null,null,null,null,{"$f":"VLOOKUP(H14,ledger,41,0)","v":"-"}]
[null,null,"EXTRA CREDIT SUBJECT"]
[null,null,{"$f":"IFERROR(VLOOKUP(H14,ledger,42,0),\"\")","v":0},{"$f":"IFERROR(VLOOKUP(C33,codesub,2,0),\"SUB.CODE IS WRONG\")","v":"SUB.CODE IS WRONG"},null,null,{"$f":"VLOOKUP(H14,ledger,43,0)","v":"ABS"},{"$f":"VLOOKUP(H14,ledger,44,0)","v":"ABS"},{"$f":"VLOOKUP(H14,ledger,47,0)","v":""}]
[null,null,{"$f":"IFERROR(C33+1,\"\")","v":1},{"$f":"IFERROR(VLOOKUP(C34,codesub,2,0),\"SUB.CODE IS WRONG\")","v":"SUB.CODE IS WRONG"},null,null,{"$f":"VLOOKUP(H14,ledger,45,0)","v":"ABS"},{"$f":"VLOOKUP(H14,ledger,46,0)","v":"ABS"}]
[null,null,"PREPARED BY : …………………………"]
[null,null,"CHECKED BY : …………………………"]
[null,null,"DATE OF ISSUE     :",null,"2079.03.15",null,null,"HEAD TEACHER"]
[]
[null,null,"NOTE : ONE CREDIT HOUR EQUALS TO 32 WORKING HOURS"]
[null,null,"INTERNAL (IN) : THIS COVERS THE PARTICIPATION, PRACTICAL/PROJECT WORKS, COMMUNITY \n                                     WORKS, INTERNSHIP, PRESENTATIONS, TERMINAL EXAMINATIONS."]
[null,null,"THEORY (TH) :  THIS COVERS WRITTEN EXTERNAL EXAMINATION"]
[null,null,"ABS = ABSENT",null,null,null,"       ","W= WITHHELD"]

{"sheet":"std14","index":18,"n_rows":42,"n_cols":10,"rows_kept":42,"cut":false,"hidden":false,"merged":[[2,2,6,9],[11,2,11,4],[11,5,11,9],[12,7,12,8],[13,2,13,3],[13,5,13,6],[14,2,14,4],[14,5,14,6],[14,7,14,9],[16,2,17,2],[16,3,17,4],[16,5,17,5],[16,6,17,6],[16,7,17,7],[16,8,17,8],[16,9,17,9],[18,3,18,4],[18,8,19,8],[19,3,19,4],[20,3,20,4],[20,8,21,8],[21,3,21,4],[22,3,22,4],[22,8,23,8],[23,3,23,4],[24,3,24,4],[24,8,25,8],[25,3,25,4],[34,2,34,4],[26,3,26,4],[26,8,27,8],[27,3,27,4],[28,3,28,4],[28,8,29,8],[29,3,29,4],[30,2,30,7],[31,2,31,9],[32,3,32,4],[32,8,33,8],[33,3,33,4],[41,2,41,3],[41,7,41,8],[35,2,35,4],[36,2,36,3],[36,7,36,9],[38,2,38,6],[39,2,39,9],[40,2,40,6]]}
[]
[]
[]
[]
[]
[]
[]
[]
[]
[]
[]
[null,null,"THE GRADE(S) SECURED BY   :",null,null,{"$f":"IFERROR(VLOOKUP(H14,ledger,2,0),\"This Symbol No. is not in Grade Ledger\")","v":"MAHESH DAHAL "}]
[null,null,"DATE OF BIRTH :",null,{"$f":"VLOOKUP(H14,ledger,3,0)","v":"2061-04-01"},"B.S.","       (",null,null,"A.D.)"]
[null,null,"REGISTRATION NO.",null,{"$f":"VLOOKUP(H14,ledger,4,0)","v":"801130210014"},"SYMBOL NO.",null,11301333,"GRADE","XI"]
[null,null,"IN THE EXAMINATION CONDUCTED IN ",null,null,"2080 B.S. (2022 A.D.)",null,"ARE GIVEN BELOW."]
[]
[null,null,"SUBJECT CODE","SUBJECTS",null,"CREDIT HOUR (CH)","GRADE","GARDE POINT (GP)","FINAL GRADE (FG) ","REMARKS"]
[]
[null,null,{"$f":"VLOOKUP(H14,ledger,5,0)","v":"0011"},{"$f":"IFERROR(VLOOKUP(C19,codesub,2,0),\"SUB.CODE IS WRONG\")","v":"COM. NEPALI (TH)"},null,2.25,{"$f":"VLOOKUP(H14,ledger,6,0)","v":"C"},{"$f":"VLOOKUP(H14,ledger,7,0)","v":2},{"$f":"VLOOKUP(H14,ledger,10,0)","v":"C"}]
[null,null,{"$f":"IF(C19=\"0011\",\"0012\",\"SORRY\")","v":"0012"},{"$f":"IF(C20=\"0012\",\"COM. NEPALI (IN)\",\"SUB.CODE IS WRONG\")","v":"COM. NEPALI (IN)"},null,0.75,{"$f":"VLOOKUP(H14,ledger,8,0)","v":"C"},{"$f":"VLOOKUP(H14,ledger,9,0)","v":2}]
[null,null,{"$f":"VLOOKUP(H14,ledger,11,0)","v":"0031"},{"$f":"IFERROR(VLOOKUP(C21,codesub,2,0),\"SUB.CODE IS WRONG\")","v":"COM. ENGLISH (TH)"},null,3,{"$f":"VLOOKUP(H14,ledger,12,0)","v":"C"},{"$f":"VLOOKUP(H14,ledger,13,0)","v":2},{"$f":"VLOOKUP(H14,ledger,16,0)","v":"C"}]
[null,null,{"$f":"IF(C21=\"0031\",\"0032\",\"SORRY\")","v":"0032"},{"$f":"IF(C22=\"0032\",\"COM. ENGLISH (IN)\",\"SUB.CODE IS WRONG\")","v":"COM. ENGLISH (IN)"},null,1,{"$f":"VLOOKUP(H14,ledger,14,0)","v":"C"},{"$f":"VLOOKUP(H14,ledger,15,0)","v":2}]
[null,null,{"$f":"VLOOKUP(H14,ledger,17,0)","v":"0051"},{"$f":"IF(C23=\"0051\",\"COM. SOCIAL STUDIES & LIFE SKILL (TH)\",IF(C23=\"0071\",\"COM. MATHEMATICS (TH)\",\"SUB.CODE IS WRONG\"))","v":"COM. SOCIAL STUDIES & LIFE SKILL (TH)"},null,3.75,{"$f":"VLOOKUP(H14,ledger,18,0)","v":"B"},{"$f":"VLOOKUP(H14,ledger,19,0)","v":2.8},{"$f":"VLOOKUP(H14,ledger,22,0)","v":"B+"},{"$f":"IF(OR($I$19=\"NG\",$I$21=\"NG\",$I$23=\"NG\",$I$25=\"NG\",$I$27=\"NG\",$I$29=\"NG\"),\"W\",\"\")","v":""}]
[null,null,{"$f":"IF(C23=\"0051\",\"0052\",IF(C23=\"0071\",\"0072\",\"SORRY\"))","v":"0052"},{"$f":"IF(C24=\"0052\",\"COM. SOCIAL STUDIES & LIFE SKILL (IN)\",IF(C24=\"0072\",\"COM. MATHEMATICS (IN)\",\"SUB.CODE IS WRONG\"))","v":"COM. SOCIAL STUDIES & LIFE SKILL (IN)"},null,1.25,{"$f":"VLOOKUP(H14,ledger,20,0)","v":"A"},{"$f":"VLOOKUP(H14,ledger,21,0)","v":3.6},null,{"$f":"IF(OR($I$19=\"ABS\",$I$21=\"ABS\",$I$23=\"ABS\",$I$25=\"ABS\",$I$27=\"ABS\",$I$29=\"ABS\"),\"ABS\",\"\")","v":""}]
[null,null,{"$f":"VLOOKUP(H14,ledger,23,0)","v":1031},{"$f":"IFERROR(VLOOKUP(C25,codesub,2,0),\"SUB.CODE IS WRONG\")","v":"ACCOUNTING (TH)"},null,3.75,{"$f":"VLOOKUP(H14,ledger,24,0)","v":"B"},{"$f":"VLOOKUP(H14,ledger,25,0)","v":2.8},{"$f":"VLOOKUP(H14,ledger,28,0)","v":"B+"}]
[null,null,{"$f":"C25+1","v":1032},"ACCOUNTING (IN)",null,1.25,{"$f":"VLOOKUP(H14,ledger,26,0)","v":"A"},{"$f":"VLOOKUP(H14,ledger,27,0)","v":3.6}]
[null,null,{"$f":"VLOOKUP(H14,ledger,29,0)","v":4251},"SINGING (TH)",null,3.75,{"$f":"VLOOKUP(H14,ledger,30,0)","v":"C+"},{"$f":"VLOOKUP(H14,ledger,31,0)","v":2.4},{"$f":"VLOOKUP(H14,ledger,34,0)","v":"B"}]
[null,null,{"$f":"C27+1","v":4252},"SINGING (IN)",null,1.25,{"$f":"VLOOKUP(H14,ledger,32,0)","v":"A+"},{"$f":"VLOOKUP(H14,ledger,33,0)","v":4}]
[null,null,{"$f":"VLOOKUP(H14,ledger,35,0)","v":4171},{"$f":"IFERROR(VLOOKUP(C29,codesub,2,0),\"SUB.CODE IS WRONG\")","v":"FINANCE (TH)"},null,3.75,{"$f":"VLOOKUP(H14,ledger,36,0)","v":"A"},{"$f":"VLOOKUP(H14,ledger,37,0)","v":3.6},{"$f":"VLOOKUP(H14,ledger,40,0)","v":"*"}]
[null,null,{"$f":"C29+1","v":4172},"FINANCE (IN)",null,1.25,{"$f":"VLOOKUP(H14,ledger,38,0)","v":"ABS"},{"$f":"VLOOKUP(H14,ledger,39,0)","v":"ABS"}]
[null,null,"GRADE POINT AVERAGE (GPA) :",null,null,null,null,null,{"$f":"VLOOKUP(H14,ledger,41,0)","v":"-"}]
[null,null,"EXTRA CREDIT SUBJECT"]
[null,null,{"$f":"IFERROR(VLOOKUP(H14,ledger,42,0),\"\")","v":0},{"$f":"IFERROR(VLOOKUP(C33,codesub,2,0),\"SUB.CODE IS WRONG\")","v":"SUB.CODE IS WRONG"},null,null,{"$f":"VLOOKUP(H14,ledger,43,0)","v":"ABS"},{"$f":"VLOOKUP(H14,ledger,44,0)","v":"ABS"},{"$f":"VLOOKUP(H14,ledger,47,0)","v":""}]
[null,null,{"$f":"IFERROR(C33+1,\"\")","v":1},{"$f":"IFERROR(VLOOKUP(C34,codesub,2,0),\"SUB.CODE IS WRONG\")","v":"SUB.CODE IS WRONG"},null,null,{"$f":"VLOOKUP(H14,ledger,45,0)","v":"ABS"},{"$f":"VLOOKUP(H14,ledger,46,0)","v":"ABS"}]
[null,null,"PREPARED BY : …………………………"]
[null,null,"CHECKED BY : …………………………"]
[null,null,"DATE OF ISSUE     :",null,"2079.03.15",null,null,"HEAD TEACHER"]
[]
[null,null,"NOTE : ONE CREDIT HOUR EQUALS TO 32 WORKING HOURS"]
[null,null,"INTERNAL (IN) : THIS COVERS THE PARTICIPATION, PRACTICAL/PROJECT WORKS, COMMUNITY \n                                     WORKS, INTERNSHIP, PRESENTATIONS, TERMINAL EXAMINATIONS."]
[null,null,"THEORY (TH) :  THIS COVERS WRITTEN EXTERNAL EXAMINATION"]
[null,null,"ABS = ABSENT",null,null,null,"       ","W= WITHHELD"]

{"sheet":"std15","index":19,"n_rows":42,"n_cols":10,"rows_kept":42,"cut":false,"hidden":false,"merged":[[2,2,6,9],[11,2,11,4],[11,5,11,9],[12,7,12,8],[13,2,13,3],[13,5,13,6],[14,2,14,4],[14,5,14,6],[14,7,14,9],[16,2,17,2],[16,3,17,4],[16,5,17,5],[16,6,17,6],[16,7,17,7],[16,8,17,8],[16,9,17,9],[18,3,18,4],[18,8,19,8],[19,3,19,4],[20,3,20,4],[20,8,21,8],[21,3,21,4],[22,3,22,4],[22,8,23,8],[23,3,23,4],[24,3,24,4],[24,8,25,8],[25,3,25,4],[34,2,34,4],[26,3,26,4],[26,8,27,8],[27,3,27,4],[28,3,28,4],[28,8,29,8],[29,3,29,4],[30,2,30,7],[31,2,31,9],[32,3,32,4],[32,8,33,8],[33,3,33,4],[41,2,41,3],[41,7,41,8],[35,2,35,4],[36,2,36,3],[36,7,36,9],[38,2,38,6],[39,2,39,9],[40,2,40,6]]}
[]
[]
[]
[]
[]
[]
[]
[]
[]
[]
[]
[null,null,"THE GRADE(S) SECURED BY   :",null,null,{"$f":"IFERROR(VLOOKUP(H14,ledger,2,0),\"This Symbol No. is not in Grade Ledger\")","v":"MANISHA RAI "}]
[null,null,"DATE OF BIRTH :",null,{"$f":"VLOOKUP(H14,ledger,3,0)","v":"2064-01-15"},"B.S.","       (",null,null,"A.D.)"]
[null,null,"REGISTRATION NO.",null,{"$f":"VLOOKUP(H14,ledger,4,0)","v":"801130210015"},"SYMBOL NO.",null,11301334,"GRADE","XI"]
[null,null,"IN THE EXAMINATION CONDUCTED IN ",null,null,"2080 B.S. (2022 A.D.)",null,"ARE GIVEN BELOW."]
[]
[null,null,"SUBJECT CODE","SUBJECTS",null,"CREDIT HOUR (CH)","GRADE","GARDE POINT (GP)","FINAL GRADE (FG) ","REMARKS"]
[]
[null,null,{"$f":"VLOOKUP(H14,ledger,5,0)","v":"0011"},{"$f":"IFERROR(VLOOKUP(C19,codesub,2,0),\"SUB.CODE IS WRONG\")","v":"COM. NEPALI (TH)"},null,2.25,{"$f":"VLOOKUP(H14,ledger,6,0)","v":"A"},{"$f":"VLOOKUP(H14,ledger,7,0)","v":3.6},{"$f":"VLOOKUP(H14,ledger,10,0)","v":"A"}]
[null,null,{"$f":"IF(C19=\"0011\",\"0012\",\"SORRY\")","v":"0012"},{"$f":"IF(C20=\"0012\",\"COM. NEPALI (IN)\",\"SUB.CODE IS WRONG\")","v":"COM. NEPALI (IN)"},null,0.75,{"$f":"VLOOKUP(H14,ledger,8,0)","v":"A"},{"$f":"VLOOKUP(H14,ledger,9,0)","v":3.6}]
[null,null,{"$f":"VLOOKUP(H14,ledger,11,0)","v":"0031"},{"$f":"IFERROR(VLOOKUP(C21,codesub,2,0),\"SUB.CODE IS WRONG\")","v":"COM. ENGLISH (TH)"},null,3,{"$f":"VLOOKUP(H14,ledger,12,0)","v":"A"},{"$f":"VLOOKUP(H14,ledger,13,0)","v":3.6},{"$f":"VLOOKUP(H14,ledger,16,0)","v":"A"}]
[null,null,{"$f":"IF(C21=\"0031\",\"0032\",\"SORRY\")","v":"0032"},{"$f":"IF(C22=\"0032\",\"COM. ENGLISH (IN)\",\"SUB.CODE IS WRONG\")","v":"COM. ENGLISH (IN)"},null,1,{"$f":"VLOOKUP(H14,ledger,14,0)","v":"A"},{"$f":"VLOOKUP(H14,ledger,15,0)","v":3.6}]
[null,null,{"$f":"VLOOKUP(H14,ledger,17,0)","v":"0051"},{"$f":"IF(C23=\"0051\",\"COM. SOCIAL STUDIES & LIFE SKILL (TH)\",IF(C23=\"0071\",\"COM. MATHEMATICS (TH)\",\"SUB.CODE IS WRONG\"))","v":"COM. SOCIAL STUDIES & LIFE SKILL (TH)"},null,3.75,{"$f":"VLOOKUP(H14,ledger,18,0)","v":"A+"},{"$f":"VLOOKUP(H14,ledger,19,0)","v":4},{"$f":"VLOOKUP(H14,ledger,22,0)","v":"A+"},{"$f":"IF(OR($I$19=\"NG\",$I$21=\"NG\",$I$23=\"NG\",$I$25=\"NG\",$I$27=\"NG\",$I$29=\"NG\"),\"W\",\"\")","v":""}]
[null,null,{"$f":"IF(C23=\"0051\",\"0052\",IF(C23=\"0071\",\"0072\",\"SORRY\"))","v":"0052"},{"$f":"IF(C24=\"0052\",\"COM. SOCIAL STUDIES & LIFE SKILL (IN)\",IF(C24=\"0072\",\"COM. MATHEMATICS (IN)\",\"SUB.CODE IS WRONG\"))","v":"COM. SOCIAL STUDIES & LIFE SKILL (IN)"},null,1.25,{"$f":"VLOOKUP(H14,ledger,20,0)","v":"A+"},{"$f":"VLOOKUP(H14,ledger,21,0)","v":4},null,{"$f":"IF(OR($I$19=\"ABS\",$I$21=\"ABS\",$I$23=\"ABS\",$I$25=\"ABS\",$I$27=\"ABS\",$I$29=\"ABS\"),\"ABS\",\"\")","v":""}]
[null,null,{"$f":"VLOOKUP(H14,ledger,23,0)","v":1031},{"$f":"IFERROR(VLOOKUP(C25,codesub,2,0),\"SUB.CODE IS WRONG\")","v":"ACCOUNTING (TH)"},null,3.75,{"$f":"VLOOKUP(H14,ledger,24,0)","v":"A+"},{"$f":"VLOOKUP(H14,ledger,25,0)","v":4},{"$f":"VLOOKUP(H14,ledger,28,0)","v":"A+"}]
[null,null,{"$f":"C25+1","v":1032},"ACCOUNTING (IN)",null,1.25,{"$f":"VLOOKUP(H14,ledger,26,0)","v":"A+"},{"$f":"VLOOKUP(H14,ledger,27,0)","v":4}]
[null,null,{"$f":"VLOOKUP(H14,ledger,29,0)","v":4251},"SINGING (TH)",null,3.75,{"$f":"VLOOKUP(H14,ledger,30,0)","v":"C+"},{"$f":"VLOOKUP(H14,ledger,31,0)","v":2.4},{"$f":"VLOOKUP(H14,ledger,34,0)","v":"B"}]
[null,null,{"$f":"C27+1","v":4252},"SINGING (IN)",null,1.25,{"$f":"VLOOKUP(H14,ledger,32,0)","v":"A+"},{"$f":"VLOOKUP(H14,ledger,33,0)","v":4}]
[null,null,{"$f":"VLOOKUP(H14,ledger,35,0)","v":4171},{"$f":"IFERROR(VLOOKUP(C29,codesub,2,0),\"SUB.CODE IS WRONG\")","v":"FINANCE (TH)"},null,3.75,{"$f":"VLOOKUP(H14,ledger,36,0)","v":"A"},{"$f":"VLOOKUP(H14,ledger,37,0)","v":3.6},{"$f":"VLOOKUP(H14,ledger,40,0)","v":"*"}]
[null,null,{"$f":"C29+1","v":4172},"FINANCE (IN)",null,1.25,{"$f":"VLOOKUP(H14,ledger,38,0)","v":"ABS"},{"$f":"VLOOKUP(H14,ledger,39,0)","v":"ABS"}]
[null,null,"GRADE POINT AVERAGE (GPA) :",null,null,null,null,null,{"$f":"VLOOKUP(H14,ledger,41,0)","v":"-"}]
[null,null,"EXTRA CREDIT SUBJECT"]
[null,null,{"$f":"IFERROR(VLOOKUP(H14,ledger,42,0),\"\")","v":0},{"$f":"IFERROR(VLOOKUP(C33,codesub,2,0),\"SUB.CODE IS WRONG\")","v":"SUB.CODE IS WRONG"},null,null,{"$f":"VLOOKUP(H14,ledger,43,0)","v":"ABS"},{"$f":"VLOOKUP(H14,ledger,44,0)","v":"ABS"},{"$f":"VLOOKUP(H14,ledger,47,0)","v":""}]
[null,null,{"$f":"IFERROR(C33+1,\"\")","v":1},{"$f":"IFERROR(VLOOKUP(C34,codesub,2,0),\"SUB.CODE IS WRONG\")","v":"SUB.CODE IS WRONG"},null,null,{"$f":"VLOOKUP(H14,ledger,45,0)","v":"ABS"},{"$f":"VLOOKUP(H14,ledger,46,0)","v":"ABS"}]
[null,null,"PREPARED BY : …………………………"]
[null,null,"CHECKED BY : …………………………"]
[null,null,"DATE OF ISSUE     :",null,"2079.03.15",null,null,"HEAD TEACHER"]
[]
[null,null,"NOTE : ONE CREDIT HOUR EQUALS TO 32 WORKING HOURS"]
[null,null,"INTERNAL (IN) : THIS COVERS THE PARTICIPATION, PRACTICAL/PROJECT WORKS, COMMUNITY \n                                     WORKS, INTERNSHIP, PRESENTATIONS, TERMINAL EXAMINATIONS."]
[null,null,"THEORY (TH) :  THIS COVERS WRITTEN EXTERNAL EXAMINATION"]
[null,null,"ABS = ABSENT",null,null,null,"       ","W= WITHHELD"]

{"sheet":"std16","index":20,"n_rows":42,"n_cols":10,"rows_kept":42,"cut":false,"hidden":false,"merged":[[2,2,6,9],[11,2,11,4],[11,5,11,9],[12,7,12,8],[13,2,13,3],[13,5,13,6],[14,2,14,4],[14,5,14,6],[14,7,14,9],[16,2,17,2],[16,3,17,4],[16,5,17,5],[16,6,17,6],[16,7,17,7],[16,8,17,8],[16,9,17,9],[18,3,18,4],[18,8,19,8],[19,3,19,4],[20,3,20,4],[20,8,21,8],[21,3,21,4],[22,3,22,4],[22,8,23,8],[23,3,23,4],[24,3,24,4],[24,8,25,8],[25,3,25,4],[34,2,34,4],[26,3,26,4],[26,8,27,8],[27,3,27,4],[28,3,28,4],[28,8,29,8],[29,3,29,4],[30,2,30,7],[31,2,31,9],[32,3,32,4],[32,8,33,8],[33,3,33,4],[41,2,41,3],[41,7,41,8],[35,2,35,4],[36,2,36,3],[36,7,36,9],[38,2,38,6],[39,2,39,9],[40,2,40,6]]}
[]
[]
[]
[]
[]
[]
[]
[]
[]
[]
[]
[null,null,"THE GRADE(S) SECURED BY   :",null,null,{"$f":"IFERROR(VLOOKUP(H14,ledger,2,0),\"This Symbol No. is not in Grade Ledger\")","v":"MANISHA THAPA "}]
[null,null,"DATE OF BIRTH :",null,{"$f":"VLOOKUP(H14,ledger,3,0)","v":"2062-06-25"},"B.S.","       (",null,null,"A.D.)"]
[null,null,"REGISTRATION NO.",null,{"$f":"VLOOKUP(H14,ledger,4,0)","v":"801130210016"},"SYMBOL NO.",null,11301335,"GRADE","XI"]
[null,null,"IN THE EXAMINATION CONDUCTED IN ",null,null,"2080 B.S. (2022 A.D.)",null,"ARE GIVEN BELOW."]
[]
[null,null,"SUBJECT CODE","SUBJECTS",null,"CREDIT HOUR (CH)","GRADE","GARDE POINT (GP)","FINAL GRADE (FG) ","REMARKS"]
[]
[null,null,{"$f":"VLOOKUP(H14,ledger,5,0)","v":"0011"},{"$f":"IFERROR(VLOOKUP(C19,codesub,2,0),\"SUB.CODE IS WRONG\")","v":"COM. NEPALI (TH)"},null,2.25,{"$f":"VLOOKUP(H14,ledger,6,0)","v":"A"},{"$f":"VLOOKUP(H14,ledger,7,0)","v":3.6},{"$f":"VLOOKUP(H14,ledger,10,0)","v":"A"}]
[null,null,{"$f":"IF(C19=\"0011\",\"0012\",\"SORRY\")","v":"0012"},{"$f":"IF(C20=\"0012\",\"COM. NEPALI (IN)\",\"SUB.CODE IS WRONG\")","v":"COM. NEPALI (IN)"},null,0.75,{"$f":"VLOOKUP(H14,ledger,8,0)","v":"B+"},{"$f":"VLOOKUP(H14,ledger,9,0)","v":3.2}]
[null,null,{"$f":"VLOOKUP(H14,ledger,11,0)","v":"0031"},{"$f":"IFERROR(VLOOKUP(C21,codesub,2,0),\"SUB.CODE IS WRONG\")","v":"COM. ENGLISH (TH)"},null,3,{"$f":"VLOOKUP(H14,ledger,12,0)","v":"A"},{"$f":"VLOOKUP(H14,ledger,13,0)","v":3.6},{"$f":"VLOOKUP(H14,ledger,16,0)","v":"A"}]
[null,null,{"$f":"IF(C21=\"0031\",\"0032\",\"SORRY\")","v":"0032"},{"$f":"IF(C22=\"0032\",\"COM. ENGLISH (IN)\",\"SUB.CODE IS WRONG\")","v":"COM. ENGLISH (IN)"},null,1,{"$f":"VLOOKUP(H14,ledger,14,0)","v":"B+"},{"$f":"VLOOKUP(H14,ledger,15,0)","v":3.2}]
[null,null,{"$f":"VLOOKUP(H14,ledger,17,0)","v":"0051"},{"$f":"IF(C23=\"0051\",\"COM. SOCIAL STUDIES & LIFE SKILL (TH)\",IF(C23=\"0071\",\"COM. MATHEMATICS (TH)\",\"SUB.CODE IS WRONG\"))","v":"COM. SOCIAL STUDIES & LIFE SKILL (TH)"},null,3.75,{"$f":"VLOOKUP(H14,ledger,18,0)","v":"A"},{"$f":"VLOOKUP(H14,ledger,19,0)","v":3.6},{"$f":"VLOOKUP(H14,ledger,22,0)","v":"A+"},{"$f":"IF(OR($I$19=\"NG\",$I$21=\"NG\",$I$23=\"NG\",$I$25=\"NG\",$I$27=\"NG\",$I$29=\"NG\"),\"W\",\"\")","v":""}]
[null,null,{"$f":"IF(C23=\"0051\",\"0052\",IF(C23=\"0071\",\"0072\",\"SORRY\"))","v":"0052"},{"$f":"IF(C24=\"0052\",\"COM. SOCIAL STUDIES & LIFE SKILL (IN)\",IF(C24=\"0072\",\"COM. MATHEMATICS (IN)\",\"SUB.CODE IS WRONG\"))","v":"COM. SOCIAL STUDIES & LIFE SKILL (IN)"},null,1.25,{"$f":"VLOOKUP(H14,ledger,20,0)","v":"A+"},{"$f":"VLOOKUP(H14,ledger,21,0)","v":4},null,{"$f":"IF(OR($I$19=\"ABS\",$I$21=\"ABS\",$I$23=\"ABS\",$I$25=\"ABS\",$I$27=\"ABS\",$I$29=\"ABS\"),\"ABS\",\"\")","v":""}]
[null,null,{"$f":"VLOOKUP(H14,ledger,23,0)","v":1031},{"$f":"IFERROR(VLOOKUP(C25,codesub,2,0),\"SUB.CODE IS WRONG\")","v":"ACCOUNTING (TH)"},null,3.75,{"$f":"VLOOKUP(H14,ledger,24,0)","v":"A+"},{"$f":"VLOOKUP(H14,ledger,25,0)","v":4},{"$f":"VLOOKUP(H14,ledger,28,0)","v":"A+"}]
[null,null,{"$f":"C25+1","v":1032},"ACCOUNTING (IN)",null,1.25,{"$f":"VLOOKUP(H14,ledger,26,0)","v":"A+"},{"$f":"VLOOKUP(H14,ledger,27,0)","v":4}]
[null,null,{"$f":"VLOOKUP(H14,ledger,29,0)","v":4251},"SINGING (TH)",null,3.75,{"$f":"VLOOKUP(H14,ledger,30,0)","v":"C+"},{"$f":"VLOOKUP(H14,ledger,31,0)","v":2.4},{"$f":"VLOOKUP(H14,ledger,34,0)","v":"B"}]
[null,null,{"$f":"C27+1","v":4252},"SINGING (IN)",null,1.25,{"$f":"VLOOKUP(H14,ledger,32,0)","v":"A+"},{"$f":"VLOOKUP(H14,ledger,33,0)","v":4}]
[null,null,{"$f":"VLOOKUP(H14,ledger,35,0)","v":4171},{"$f":"IFERROR(VLOOKUP(C29,codesub,2,0),\"SUB.CODE IS WRONG\")","v":"FINANCE (TH)"},null,3.75,{"$f":"VLOOKUP(H14,ledger,36,0)","v":"A"},{"$f":"VLOOKUP(H14,ledger,37,0)","v":3.6},{"$f":"VLOOKUP(H14,ledger,40,0)","v":"*"}]
[null,null,{"$f":"C29+1","v":4172},"FINANCE (IN)",null,1.25,{"$f":"VLOOKUP(H14,ledger,38,0)","v":"ABS"},{"$f":"VLOOKUP(H14,ledger,39,0)","v":"ABS"}]
[null,null,"GRADE POINT AVERAGE (GPA) :",null,null,null,null,null,{"$f":"VLOOKUP(H14,ledger,41,0)","v":"-"}]
[null,null,"EXTRA CREDIT SUBJECT"]
[null,null,{"$f":"IFERROR(VLOOKUP(H14,ledger,42,0),\"\")","v":0},{"$f":"IFERROR(VLOOKUP(C33,codesub,2,0),\"SUB.CODE IS WRONG\")","v":"SUB.CODE IS WRONG"},null,null,{"$f":"VLOOKUP(H14,ledger,43,0)","v":"ABS"},{"$f":"VLOOKUP(H14,ledger,44,0)","v":"ABS"},{"$f":"VLOOKUP(H14,ledger,47,0)","v":""}]
[null,null,{"$f":"IFERROR(C33+1,\"\")","v":1},{"$f":"IFERROR(VLOOKUP(C34,codesub,2,0),\"SUB.CODE IS WRONG\")","v":"SUB.CODE IS WRONG"},null,null,{"$f":"VLOOKUP(H14,ledger,45,0)","v":"ABS"},{"$f":"VLOOKUP(H14,ledger,46,0)","v":"ABS"}]
[null,null,"PREPARED BY : …………………………"]
[null,null,"CHECKED BY : …………………………"]
[null,null,"DATE OF ISSUE     :",null,"2079.03.15",null,null,"HEAD TEACHER"]
[]
[null,null,"NOTE : ONE CREDIT HOUR EQUALS TO 32 WORKING HOURS"]
[null,null,"INTERNAL (IN) : THIS COVERS THE PARTICIPATION, PRACTICAL/PROJECT WORKS, COMMUNITY \n                                     WORKS, INTERNSHIP, PRESENTATIONS, TERMINAL EXAMINATIONS."]
[null,null,"THEORY (TH) :  THIS COVERS WRITTEN EXTERNAL EXAMINATION"]
[null,null,"ABS = ABSENT",null,null,null,"       ","W= WITHHELD"]

{"sheet":"std17","index":21,"n_rows":42,"n_cols":10,"rows_kept":42,"cut":false,"hidden":false,"merged":[[2,2,6,9],[11,2,11,4],[11,5,11,9],[12,7,12,8],[13,2,13,3],[13,5,13,6],[14,2,14,4],[14,5,14,6],[14,7,14,9],[16,2,17,2],[16,3,17,4],[16,5,17,5],[16,6,17,6],[16,7,17,7],[16,8,17,8],[16,9,17,9],[18,3,18,4],[18,8,19,8],[19,3,19,4],[20,3,20,4],[20,8,21,8],[21,3,21,4],[22,3,22,4],[22,8,23,8],[23,3,23,4],[24,3,24,4],[24,8,25,8],[25,3,25,4],[34,2,34,4],[26,3,26,4],[26,8,27,8],[27,3,27,4],[28,3,28,4],[28,8,29,8],[29,3,29,4],[30,2,30,7],[31,2,31,9],[32,3,32,4],[32,8,33,8],[33,3,33,4],[41,2,41,3],[41,7,41,8],[35,2,35,4],[36,2,36,3],[36,7,36,9],[38,2,38,6],[39,2,39,9],[40,2,40,6]]}
[]
[]
[]
[]
[]
[]
[]
[]
[]
[]
[]
[null,null,"THE GRADE(S) SECURED BY   :",null,null,{"$f":"IFERROR(VLOOKUP(H14,ledger,2,0),\"This Symbol No. is not in Grade Ledger\")","v":"MOUSAM RAI "}]
[null,null,"DATE OF BIRTH :",null,{"$f":"VLOOKUP(H14,ledger,3,0)","v":"2063-06-29"},"B.S.","       (",null,null,"A.D.)"]
[null,null,"REGISTRATION NO.",null,{"$f":"VLOOKUP(H14,ledger,4,0)","v":"801130210017"},"SYMBOL NO.",null,11301336,"GRADE","XI"]
[null,null,"IN THE EXAMINATION CONDUCTED IN ",null,null,"2080 B.S. (2022 A.D.)",null,"ARE GIVEN BELOW."]
[]
[null,null,"SUBJECT CODE","SUBJECTS",null,"CREDIT HOUR (CH)","GRADE","GARDE POINT (GP)","FINAL GRADE (FG) ","REMARKS"]
[]
[null,null,{"$f":"VLOOKUP(H14,ledger,5,0)","v":"0011"},{"$f":"IFERROR(VLOOKUP(C19,codesub,2,0),\"SUB.CODE IS WRONG\")","v":"COM. NEPALI (TH)"},null,2.25,{"$f":"VLOOKUP(H14,ledger,6,0)","v":"C+"},{"$f":"VLOOKUP(H14,ledger,7,0)","v":2.4},{"$f":"VLOOKUP(H14,ledger,10,0)","v":"C+"}]
[null,null,{"$f":"IF(C19=\"0011\",\"0012\",\"SORRY\")","v":"0012"},{"$f":"IF(C20=\"0012\",\"COM. NEPALI (IN)\",\"SUB.CODE IS WRONG\")","v":"COM. NEPALI (IN)"},null,0.75,{"$f":"VLOOKUP(H14,ledger,8,0)","v":"C+"},{"$f":"VLOOKUP(H14,ledger,9,0)","v":2.4}]
[null,null,{"$f":"VLOOKUP(H14,ledger,11,0)","v":"0031"},{"$f":"IFERROR(VLOOKUP(C21,codesub,2,0),\"SUB.CODE IS WRONG\")","v":"COM. ENGLISH (TH)"},null,3,{"$f":"VLOOKUP(H14,ledger,12,0)","v":"C+"},{"$f":"VLOOKUP(H14,ledger,13,0)","v":2.4},{"$f":"VLOOKUP(H14,ledger,16,0)","v":"C+"}]
[null,null,{"$f":"IF(C21=\"0031\",\"0032\",\"SORRY\")","v":"0032"},{"$f":"IF(C22=\"0032\",\"COM. ENGLISH (IN)\",\"SUB.CODE IS WRONG\")","v":"COM. ENGLISH (IN)"},null,1,{"$f":"VLOOKUP(H14,ledger,14,0)","v":"C+"},{"$f":"VLOOKUP(H14,ledger,15,0)","v":2.4}]
[null,null,{"$f":"VLOOKUP(H14,ledger,17,0)","v":"0051"},{"$f":"IF(C23=\"0051\",\"COM. SOCIAL STUDIES & LIFE SKILL (TH)\",IF(C23=\"0071\",\"COM. MATHEMATICS (TH)\",\"SUB.CODE IS WRONG\"))","v":"COM. SOCIAL STUDIES & LIFE SKILL (TH)"},null,3.75,{"$f":"VLOOKUP(H14,ledger,18,0)","v":"A"},{"$f":"VLOOKUP(H14,ledger,19,0)","v":3.6},{"$f":"VLOOKUP(H14,ledger,22,0)","v":"A+"},{"$f":"IF(OR($I$19=\"NG\",$I$21=\"NG\",$I$23=\"NG\",$I$25=\"NG\",$I$27=\"NG\",$I$29=\"NG\"),\"W\",\"\")","v":""}]
[null,null,{"$f":"IF(C23=\"0051\",\"0052\",IF(C23=\"0071\",\"0072\",\"SORRY\"))","v":"0052"},{"$f":"IF(C24=\"0052\",\"COM. SOCIAL STUDIES & LIFE SKILL (IN)\",IF(C24=\"0072\",\"COM. MATHEMATICS (IN)\",\"SUB.CODE IS WRONG\"))","v":"COM. SOCIAL STUDIES & LIFE SKILL (IN)"},null,1.25,{"$f":"VLOOKUP(H14,ledger,20,0)","v":"A+"},{"$f":"VLOOKUP(H14,ledger,21,0)","v":4},null,{"$f":"IF(OR($I$19=\"ABS\",$I$21=\"ABS\",$I$23=\"ABS\",$I$25=\"ABS\",$I$27=\"ABS\",$I$29=\"ABS\"),\"ABS\",\"\")","v":""}]
[null,null,{"$f":"VLOOKUP(H14,ledger,23,0)","v":1031},{"$f":"IFERROR(VLOOKUP(C25,codesub,2,0),\"SUB.CODE IS WRONG\")","v":"ACCOUNTING (TH)"},null,3.75,{"$f":"VLOOKUP(H14,ledger,24,0)","v":"B"},{"$f":"VLOOKUP(H14,ledger,25,0)","v":2.8},{"$f":"VLOOKUP(H14,ledger,28,0)","v":"B+"}]
[null,null,{"$f":"C25+1","v":1032},"ACCOUNTING (IN)",null,1.25,{"$f":"VLOOKUP(H14,ledger,26,0)","v":"A"},{"$f":"VLOOKUP(H14,ledger,27,0)","v":3.6}]
[null,null,{"$f":"VLOOKUP(H14,ledger,29,0)","v":4251},"SINGING (TH)",null,3.75,{"$f":"VLOOKUP(H14,ledger,30,0)","v":"C"},{"$f":"VLOOKUP(H14,ledger,31,0)","v":2},{"$f":"VLOOKUP(H14,ledger,34,0)","v":"B"}]
[null,null,{"$f":"C27+1","v":4252},"SINGING (IN)",null,1.25,{"$f":"VLOOKUP(H14,ledger,32,0)","v":"A+"},{"$f":"VLOOKUP(H14,ledger,33,0)","v":4}]
[null,null,{"$f":"VLOOKUP(H14,ledger,35,0)","v":4171},{"$f":"IFERROR(VLOOKUP(C29,codesub,2,0),\"SUB.CODE IS WRONG\")","v":"FINANCE (TH)"},null,3.75,{"$f":"VLOOKUP(H14,ledger,36,0)","v":"C+"},{"$f":"VLOOKUP(H14,ledger,37,0)","v":2.4},{"$f":"VLOOKUP(H14,ledger,40,0)","v":"*"}]
[null,null,{"$f":"C29+1","v":4172},"FINANCE (IN)",null,1.25,{"$f":"VLOOKUP(H14,ledger,38,0)","v":"ABS"},{"$f":"VLOOKUP(H14,ledger,39,0)","v":"ABS"}]
[null,null,"GRADE POINT AVERAGE (GPA) :",null,null,null,null,null,{"$f":"VLOOKUP(H14,ledger,41,0)","v":"-"}]
[null,null,"EXTRA CREDIT SUBJECT"]
[null,null,{"$f":"IFERROR(VLOOKUP(H14,ledger,42,0),\"\")","v":0},{"$f":"IFERROR(VLOOKUP(C33,codesub,2,0),\"SUB.CODE IS WRONG\")","v":"SUB.CODE IS WRONG"},null,null,{"$f":"VLOOKUP(H14,ledger,43,0)","v":"ABS"},{"$f":"VLOOKUP(H14,ledger,44,0)","v":"ABS"},{"$f":"VLOOKUP(H14,ledger,47,0)","v":""}]
[null,null,{"$f":"IFERROR(C33+1,\"\")","v":1},{"$f":"IFERROR(VLOOKUP(C34,codesub,2,0),\"SUB.CODE IS WRONG\")","v":"SUB.CODE IS WRONG"},null,null,{"$f":"VLOOKUP(H14,ledger,45,0)","v":"ABS"},{"$f":"VLOOKUP(H14,ledger,46,0)","v":"ABS"}]
[null,null,"PREPARED BY : …………………………"]
[null,null,"CHECKED BY : …………………………"]
[null,null,"DATE OF ISSUE     :",null,"2079.03.15",null,null,"HEAD TEACHER"]
[]
[null,null,"NOTE : ONE CREDIT HOUR EQUALS TO 32 WORKING HOURS"]
[null,null,"INTERNAL (IN) : THIS COVERS THE PARTICIPATION, PRACTICAL/PROJECT WORKS, COMMUNITY \n                                     WORKS, INTERNSHIP, PRESENTATIONS, TERMINAL EXAMINATIONS."]
[null,null,"THEORY (TH) :  THIS COVERS WRITTEN EXTERNAL EXAMINATION"]
[null,null,"ABS = ABSENT",null,null,null,"       ","W= WITHHELD"]

{"sheet":"std18","index":22,"n_rows":42,"n_cols":10,"rows_kept":42,"cut":false,"hidden":false,"merged":[[2,2,6,9],[11,2,11,4],[11,5,11,9],[12,7,12,8],[13,2,13,3],[13,5,13,6],[14,2,14,4],[14,5,14,6],[14,7,14,9],[16,2,17,2],[16,3,17,4],[16,5,17,5],[16,6,17,6],[16,7,17,7],[16,8,17,8],[16,9,17,9],[18,3,18,4],[18,8,19,8],[19,3,19,4],[20,3,20,4],[20,8,21,8],[21,3,21,4],[22,3,22,4],[22,8,23,8],[23,3,23,4],[24,3,24,4],[24,8,25,8],[25,3,25,4],[34,2,34,4],[26,3,26,4],[26,8,27,8],[27,3,27,4],[28,3,28,4],[28,8,29,8],[29,3,29,4],[30,2,30,7],[31,2,31,9],[32,3,32,4],[32,8,33,8],[33,3,33,4],[41,2,41,3],[41,7,41,8],[35,2,35,4],[36,2,36,3],[36,7,36,9],[38,2,38,6],[39,2,39,9],[40,2,40,6]]}
[]
[]
[]
[]
[]
[]
[]
[]
[]
[]
[]
[null,null,"THE GRADE(S) SECURED BY   :",null,null,{"$f":"IFERROR(VLOOKUP(H14,ledger,2,0),\"This Symbol No. is not in Grade Ledger\")","v":"NANIMA SHRESTHA "}]
[null,null,"DATE OF BIRTH :",null,{"$f":"VLOOKUP(H14,ledger,3,0)","v":"2064-11-16"},"B.S.","       (",null,null,"A.D.)"]
[null,null,"REGISTRATION NO.",null,{"$f":"VLOOKUP(H14,ledger,4,0)","v":"801130210018"},"SYMBOL NO.",null,11301337,"GRADE","XI"]
[null,null,"IN THE EXAMINATION CONDUCTED IN ",null,null,"2080 B.S. (2022 A.D.)",null,"ARE GIVEN BELOW."]
[]
[null,null,"SUBJECT CODE","SUBJECTS",null,"CREDIT HOUR (CH)","GRADE","GARDE POINT (GP)","FINAL GRADE (FG) ","REMARKS"]
[]
[null,null,{"$f":"VLOOKUP(H14,ledger,5,0)","v":"0011"},{"$f":"IFERROR(VLOOKUP(C19,codesub,2,0),\"SUB.CODE IS WRONG\")","v":"COM. NEPALI (TH)"},null,2.25,{"$f":"VLOOKUP(H14,ledger,6,0)","v":"C+"},{"$f":"VLOOKUP(H14,ledger,7,0)","v":2.4},{"$f":"VLOOKUP(H14,ledger,10,0)","v":"C+"}]
[null,null,{"$f":"IF(C19=\"0011\",\"0012\",\"SORRY\")","v":"0012"},{"$f":"IF(C20=\"0012\",\"COM. NEPALI (IN)\",\"SUB.CODE IS WRONG\")","v":"COM. NEPALI (IN)"},null,0.75,{"$f":"VLOOKUP(H14,ledger,8,0)","v":"C"},{"$f":"VLOOKUP(H14,ledger,9,0)","v":2}]
[null,null,{"$f":"VLOOKUP(H14,ledger,11,0)","v":"0031"},{"$f":"IFERROR(VLOOKUP(C21,codesub,2,0),\"SUB.CODE IS WRONG\")","v":"COM. ENGLISH (TH)"},null,3,{"$f":"VLOOKUP(H14,ledger,12,0)","v":"C+"},{"$f":"VLOOKUP(H14,ledger,13,0)","v":2.4},{"$f":"VLOOKUP(H14,ledger,16,0)","v":"C+"}]
[null,null,{"$f":"IF(C21=\"0031\",\"0032\",\"SORRY\")","v":"0032"},{"$f":"IF(C22=\"0032\",\"COM. ENGLISH (IN)\",\"SUB.CODE IS WRONG\")","v":"COM. ENGLISH (IN)"},null,1,{"$f":"VLOOKUP(H14,ledger,14,0)","v":"C"},{"$f":"VLOOKUP(H14,ledger,15,0)","v":2}]
[null,null,{"$f":"VLOOKUP(H14,ledger,17,0)","v":"0051"},{"$f":"IF(C23=\"0051\",\"COM. SOCIAL STUDIES & LIFE SKILL (TH)\",IF(C23=\"0071\",\"COM. MATHEMATICS (TH)\",\"SUB.CODE IS WRONG\"))","v":"COM. SOCIAL STUDIES & LIFE SKILL (TH)"},null,3.75,{"$f":"VLOOKUP(H14,ledger,18,0)","v":"A"},{"$f":"VLOOKUP(H14,ledger,19,0)","v":3.6},{"$f":"VLOOKUP(H14,ledger,22,0)","v":"A+"},{"$f":"IF(OR($I$19=\"NG\",$I$21=\"NG\",$I$23=\"NG\",$I$25=\"NG\",$I$27=\"NG\",$I$29=\"NG\"),\"W\",\"\")","v":""}]
[null,null,{"$f":"IF(C23=\"0051\",\"0052\",IF(C23=\"0071\",\"0072\",\"SORRY\"))","v":"0052"},{"$f":"IF(C24=\"0052\",\"COM. SOCIAL STUDIES & LIFE SKILL (IN)\",IF(C24=\"0072\",\"COM. MATHEMATICS (IN)\",\"SUB.CODE IS WRONG\"))","v":"COM. SOCIAL STUDIES & LIFE SKILL (IN)"},null,1.25,{"$f":"VLOOKUP(H14,ledger,20,0)","v":"A+"},{"$f":"VLOOKUP(H14,ledger,21,0)","v":4},null,{"$f":"IF(OR($I$19=\"ABS\",$I$21=\"ABS\",$I$23=\"ABS\",$I$25=\"ABS\",$I$27=\"ABS\",$I$29=\"ABS\"),\"ABS\",\"\")","v":""}]
[null,null,{"$f":"VLOOKUP(H14,ledger,23,0)","v":1031},{"$f":"IFERROR(VLOOKUP(C25,codesub,2,0),\"SUB.CODE IS WRONG\")","v":"ACCOUNTING (TH)"},null,3.75,{"$f":"VLOOKUP(H14,ledger,24,0)","v":"B+"},{"$f":"VLOOKUP(H14,ledger,25,0)","v":3.2},{"$f":"VLOOKUP(H14,ledger,28,0)","v":"A"}]
[null,null,{"$f":"C25+1","v":1032},"ACCOUNTING (IN)",null,1.25,{"$f":"VLOOKUP(H14,ledger,26,0)","v":"A"},{"$f":"VLOOKUP(H14,ledger,27,0)","v":3.6}]
[null,null,{"$f":"VLOOKUP(H14,ledger,29,0)","v":4251},"SINGING (TH)",null,3.75,{"$f":"VLOOKUP(H14,ledger,30,0)","v":"C"},{"$f":"VLOOKUP(H14,ledger,31,0)","v":2},{"$f":"VLOOKUP(H14,ledger,34,0)","v":"B"}]
[null,null,{"$f":"C27+1","v":4252},"SINGING (IN)",null,1.25,{"$f":"VLOOKUP(H14,ledger,32,0)","v":"A+"},{"$f":"VLOOKUP(H14,ledger,33,0)","v":4}]
[null,null,{"$f":"VLOOKUP(H14,ledger,35,0)","v":4171},{"$f":"IFERROR(VLOOKUP(C29,codesub,2,0),\"SUB.CODE IS WRONG\")","v":"FINANCE (TH)"},null,3.75,{"$f":"VLOOKUP(H14,ledger,36,0)","v":"B"},{"$f":"VLOOKUP(H14,ledger,37,0)","v":2.8},{"$f":"VLOOKUP(H14,ledger,40,0)","v":"*"}]
[null,null,{"$f":"C29+1","v":4172},"FINANCE (IN)",null,1.25,{"$f":"VLOOKUP(H14,ledger,38,0)","v":"ABS"},{"$f":"VLOOKUP(H14,ledger,39,0)","v":"ABS"}]
[null,null,"GRADE POINT AVERAGE (GPA) :",null,null,null,null,null,{"$f":"VLOOKUP(H14,ledger,41,0)","v":"-"}]
[null,null,"EXTRA CREDIT SUBJECT"]
[null,null,{"$f":"IFERROR(VLOOKUP(H14,ledger,42,0),\"\")","v":0},{"$f":"IFERROR(VLOOKUP(C33,codesub,2,0),\"SUB.CODE IS WRONG\")","v":"SUB.CODE IS WRONG"},null,null,{"$f":"VLOOKUP(H14,ledger,43,0)","v":"ABS"},{"$f":"VLOOKUP(H14,ledger,44,0)","v":"ABS"},{"$f":"VLOOKUP(H14,ledger,47,0)","v":""}]
[null,null,{"$f":"IFERROR(C33+1,\"\")","v":1},{"$f":"IFERROR(VLOOKUP(C34,codesub,2,0),\"SUB.CODE IS WRONG\")","v":"SUB.CODE IS WRONG"},null,null,{"$f":"VLOOKUP(H14,ledger,45,0)","v":"ABS"},{"$f":"VLOOKUP(H14,ledger,46,0)","v":"ABS"}]
[null,null,"PREPARED BY : …………………………"]
[null,null,"CHECKED BY : …………………………"]
[null,null,"DATE OF ISSUE     :",null,"2079.03.15",null,null,"HEAD TEACHER"]
[]
[null,null,"NOTE : ONE CREDIT HOUR EQUALS TO 32 WORKING HOURS"]
[null,null,"INTERNAL (IN) : THIS COVERS THE PARTICIPATION, PRACTICAL/PROJECT WORKS, COMMUNITY \n                                     WORKS, INTERNSHIP, PRESENTATIONS, TERMINAL EXAMINATIONS."]
[null,null,"THEORY (TH) :  THIS COVERS WRITTEN EXTERNAL EXAMINATION"]
[null,null,"ABS = ABSENT",null,null,null,"       ","W= WITHHELD"]

{"sheet":"std19","index":23,"n_rows":42,"n_cols":10,"rows_kept":42,"cut":false,"hidden":false,"merged":[[2,2,6,9],[11,2,11,4],[11,5,11,9],[12,7,12,8],[13,2,13,3],[13,5,13,6],[14,2,14,4],[14,5,14,6],[14,7,14,9],[16,2,17,2],[16,3,17,4],[16,5,17,5],[16,6,17,6],[16,7,17,7],[16,8,17,8],[16,9,17,9],[18,3,18,4],[18,8,19,8],[19,3,19,4],[20,3,20,4],[20,8,21,8],[21,3,21,4],[22,3,22,4],[22,8,23,8],[23,3,23,4],[24,3,24,4],[24,8,25,8],[25,3,25,4],[34,2,34,4],[26,3,26,4],[26,8,27,8],[27,3,27,4],[28,3,28,4],[28,8,29,8],[29,3,29,4],[30,2,30,7],[31,2,31,9],[32,3,32,4],[32,8,33,8],[33,3,33,4],[41,2,41,3],[41,7,41,8],[35,2,35,4],[36,2,36,3],[36,7,36,9],[38,2,38,6],[39,2,39,9],[40,2,40,6]]}
[]
[]
[]
[]
[]
[]
[]
[]
[]
[]
[]
[null,null,"THE GRADE(S) SECURED BY   :",null,null,{"$f":"IFERROR(VLOOKUP(H14,ledger,2,0),\"This Symbol No. is not in Grade Ledger\")","v":"PRABIN TAMANG "}]
[null,null,"DATE OF BIRTH :",null,{"$f":"VLOOKUP(H14,ledger,3,0)","v":"2062-02-27"},"B.S.","       (",null,null,"A.D.)"]
[null,null,"REGISTRATION NO.",null,{"$f":"VLOOKUP(H14,ledger,4,0)","v":"801130210019"},"SYMBOL NO.",null,11301338,"GRADE","XI"]
[null,null,"IN THE EXAMINATION CONDUCTED IN ",null,null,"2080 B.S. (2022 A.D.)",null,"ARE GIVEN BELOW."]
[]
[null,null,"SUBJECT CODE","SUBJECTS",null,"CREDIT HOUR (CH)","GRADE","GARDE POINT (GP)","FINAL GRADE (FG) ","REMARKS"]
[]
[null,null,{"$f":"VLOOKUP(H14,ledger,5,0)","v":"0011"},{"$f":"IFERROR(VLOOKUP(C19,codesub,2,0),\"SUB.CODE IS WRONG\")","v":"COM. NEPALI (TH)"},null,2.25,{"$f":"VLOOKUP(H14,ledger,6,0)","v":"C+"},{"$f":"VLOOKUP(H14,ledger,7,0)","v":2.4},{"$f":"VLOOKUP(H14,ledger,10,0)","v":"C+"}]
[null,null,{"$f":"IF(C19=\"0011\",\"0012\",\"SORRY\")","v":"0012"},{"$f":"IF(C20=\"0012\",\"COM. NEPALI (IN)\",\"SUB.CODE IS WRONG\")","v":"COM. NEPALI (IN)"},null,0.75,{"$f":"VLOOKUP(H14,ledger,8,0)","v":"C+"},{"$f":"VLOOKUP(H14,ledger,9,0)","v":2.4}]
[null,null,{"$f":"VLOOKUP(H14,ledger,11,0)","v":"0031"},{"$f":"IFERROR(VLOOKUP(C21,codesub,2,0),\"SUB.CODE IS WRONG\")","v":"COM. ENGLISH (TH)"},null,3,{"$f":"VLOOKUP(H14,ledger,12,0)","v":"C+"},{"$f":"VLOOKUP(H14,ledger,13,0)","v":2.4},{"$f":"VLOOKUP(H14,ledger,16,0)","v":"C+"}]
[null,null,{"$f":"IF(C21=\"0031\",\"0032\",\"SORRY\")","v":"0032"},{"$f":"IF(C22=\"0032\",\"COM. ENGLISH (IN)\",\"SUB.CODE IS WRONG\")","v":"COM. ENGLISH (IN)"},null,1,{"$f":"VLOOKUP(H14,ledger,14,0)","v":"C+"},{"$f":"VLOOKUP(H14,ledger,15,0)","v":2.4}]
[null,null,{"$f":"VLOOKUP(H14,ledger,17,0)","v":"0051"},{"$f":"IF(C23=\"0051\",\"COM. SOCIAL STUDIES & LIFE SKILL (TH)\",IF(C23=\"0071\",\"COM. MATHEMATICS (TH)\",\"SUB.CODE IS WRONG\"))","v":"COM. SOCIAL STUDIES & LIFE SKILL (TH)"},null,3.75,{"$f":"VLOOKUP(H14,ledger,18,0)","v":"A"},{"$f":"VLOOKUP(H14,ledger,19,0)","v":3.6},{"$f":"VLOOKUP(H14,ledger,22,0)","v":"A+"},{"$f":"IF(OR($I$19=\"NG\",$I$21=\"NG\",$I$23=\"NG\",$I$25=\"NG\",$I$27=\"NG\",$I$29=\"NG\"),\"W\",\"\")","v":""}]
[null,null,{"$f":"IF(C23=\"0051\",\"0052\",IF(C23=\"0071\",\"0072\",\"SORRY\"))","v":"0052"},{"$f":"IF(C24=\"0052\",\"COM. SOCIAL STUDIES & LIFE SKILL (IN)\",IF(C24=\"0072\",\"COM. MATHEMATICS (IN)\",\"SUB.CODE IS WRONG\"))","v":"COM. SOCIAL STUDIES & LIFE SKILL (IN)"},null,1.25,{"$f":"VLOOKUP(H14,ledger,20,0)","v":"A+"},{"$f":"VLOOKUP(H14,ledger,21,0)","v":4},null,{"$f":"IF(OR($I$19=\"ABS\",$I$21=\"ABS\",$I$23=\"ABS\",$I$25=\"ABS\",$I$27=\"ABS\",$I$29=\"ABS\"),\"ABS\",\"\")","v":""}]
[null,null,{"$f":"VLOOKUP(H14,ledger,23,0)","v":1031},{"$f":"IFERROR(VLOOKUP(C25,codesub,2,0),\"SUB.CODE IS WRONG\")","v":"ACCOUNTING (TH)"},null,3.75,{"$f":"VLOOKUP(H14,ledger,24,0)","v":"B"},{"$f":"VLOOKUP(H14,ledger,25,0)","v":2.8},{"$f":"VLOOKUP(H14,ledger,28,0)","v":"B+"}]
[null,null,{"$f":"C25+1","v":1032},"ACCOUNTING (IN)",null,1.25,{"$f":"VLOOKUP(H14,ledger,26,0)","v":"A"},{"$f":"VLOOKUP(H14,ledger,27,0)","v":3.6}]
[null,null,{"$f":"VLOOKUP(H14,ledger,29,0)","v":4251},"SINGING (TH)",null,3.75,{"$f":"VLOOKUP(H14,ledger,30,0)","v":"C"},{"$f":"VLOOKUP(H14,ledger,31,0)","v":2},{"$f":"VLOOKUP(H14,ledger,34,0)","v":"B"}]
[null,null,{"$f":"C27+1","v":4252},"SINGING (IN)",null,1.25,{"$f":"VLOOKUP(H14,ledger,32,0)","v":"A+"},{"$f":"VLOOKUP(H14,ledger,33,0)","v":4}]
[null,null,{"$f":"VLOOKUP(H14,ledger,35,0)","v":4171},{"$f":"IFERROR(VLOOKUP(C29,codesub,2,0),\"SUB.CODE IS WRONG\")","v":"FINANCE (TH)"},null,3.75,{"$f":"VLOOKUP(H14,ledger,36,0)","v":"B"},{"$f":"VLOOKUP(H14,ledger,37,0)","v":2.8},{"$f":"VLOOKUP(H14,ledger,40,0)","v":"*"}]
[null,null,{"$f":"C29+1","v":4172},"FINANCE (IN)",null,1.25,{"$f":"VLOOKUP(H14,ledger,38,0)","v":"ABS"},{"$f":"VLOOKUP(H14,ledger,39,0)","v":"ABS"}]
[null,null,"GRADE POINT AVERAGE (GPA) :",null,null,null,null,null,{"$f":"VLOOKUP(H14,ledger,41,0)","v":"-"}]
[null,null,"EXTRA CREDIT SUBJECT"]
[null,null,{"$f":"IFERROR(VLOOKUP(H14,ledger,42,0),\"\")","v":0},{"$f":"IFERROR(VLOOKUP(C33,codesub,2,0),\"SUB.CODE IS WRONG\")","v":"SUB.CODE IS WRONG"},null,null,{"$f":"VLOOKUP(H14,ledger,43,0)","v":"ABS"},{"$f":"VLOOKUP(H14,ledger,44,0)","v":"ABS"},{"$f":"VLOOKUP(H14,ledger,47,0)","v":""}]
[null,null,{"$f":"IFERROR(C33+1,\"\")","v":1},{"$f":"IFERROR(VLOOKUP(C34,codesub,2,0),\"SUB.CODE IS WRONG\")","v":"SUB.CODE IS WRONG"},null,null,{"$f":"VLOOKUP(H14,ledger,45,0)","v":"ABS"},{"$f":"VLOOKUP(H14,ledger,46,0)","v":"ABS"}]
[null,null,"PREPARED BY : …………………………"]
[null,null,"CHECKED BY : …………………………"]
[null,null,"DATE OF ISSUE     :",null,"2079.03.15",null,null,"HEAD TEACHER"]
[]
[null,null,"NOTE : ONE CREDIT HOUR EQUALS TO 32 WORKING HOURS"]
[null,null,"INTERNAL (IN) : THIS COVERS THE PARTICIPATION, PRACTICAL/PROJECT WORKS, COMMUNITY \n                                     WORKS, INTERNSHIP, PRESENTATIONS, TERMINAL EXAMINATIONS."]
[null,null,"THEORY (TH) :  THIS COVERS WRITTEN EXTERNAL EXAMINATION"]
[null,null,"ABS = ABSENT",null,null,null,"       ","W= WITHHELD"]

{"sheet":"std20","index":24,"n_rows":42,"n_cols":10,"rows_kept":42,"cut":false,"hidden":false,"merged":[[2,2,6,9],[11,2,11,4],[11,5,11,9],[12,7,12,8],[13,2,13,3],[13,5,13,6],[14,2,14,4],[14,5,14,6],[14,7,14,9],[16,2,17,2],[16,3,17,4],[16,5,17,5],[16,6,17,6],[16,7,17,7],[16,8,17,8],[16,9,17,9],[18,3,18,4],[18,8,19,8],[19,3,19,4],[20,3,20,4],[20,8,21,8],[21,3,21,4],[22,3,22,4],[22,8,23,8],[23,3,23,4],[24,3,24,4],[24,8,25,8],[25,3,25,4],[34,2,34,4],[26,3,26,4],[26,8,27,8],[27,3,27,4],[28,3,28,4],[28,8,29,8],[29,3,29,4],[30,2,30,7],[31,2,31,9],[32,3,32,4],[32,8,33,8],[33,3,33,4],[41,2,41,3],[41,7,41,8],[35,2,35,4],[36,2,36,3],[36,7,36,9],[38,2,38,6],[39,2,39,9],[40,2,40,6]]}
[]
[]
[]
[]
[]
[]
[]
[]
[]
[]
[]
[null,null,"THE GRADE(S) SECURED BY   :",null,null,{"$f":"IFERROR(VLOOKUP(H14,ledger,2,0),\"This Symbol No. is not in Grade Ledger\")","v":"PRAMISAN RAI "}]
[null,null,"DATE OF BIRTH :",null,{"$f":"VLOOKUP(H14,ledger,3,0)","v":"2063-05-27"},"B.S.","       (",null,null,"A.D.)"]
[null,null,"REGISTRATION NO.",null,{"$f":"VLOOKUP(H14,ledger,4,0)","v":"801130210020"},"SYMBOL NO.",null,11301339,"GRADE","XI"]
[null,null,"IN THE EXAMINATION CONDUCTED IN ",null,null,"2080 B.S. (2022 A.D.)",null,"ARE GIVEN BELOW."]
[]
[null,null,"SUBJECT CODE","SUBJECTS",null,"CREDIT HOUR (CH)","GRADE","GARDE POINT (GP)","FINAL GRADE (FG) ","REMARKS"]
[]
[null,null,{"$f":"VLOOKUP(H14,ledger,5,0)","v":"0011"},{"$f":"IFERROR(VLOOKUP(C19,codesub,2,0),\"SUB.CODE IS WRONG\")","v":"COM. NEPALI (TH)"},null,2.25,{"$f":"VLOOKUP(H14,ledger,6,0)","v":"C+"},{"$f":"VLOOKUP(H14,ledger,7,0)","v":2.4},{"$f":"VLOOKUP(H14,ledger,10,0)","v":"C+"}]
[null,null,{"$f":"IF(C19=\"0011\",\"0012\",\"SORRY\")","v":"0012"},{"$f":"IF(C20=\"0012\",\"COM. NEPALI (IN)\",\"SUB.CODE IS WRONG\")","v":"COM. NEPALI (IN)"},null,0.75,{"$f":"VLOOKUP(H14,ledger,8,0)","v":"C+"},{"$f":"VLOOKUP(H14,ledger,9,0)","v":2.4}]
[null,null,{"$f":"VLOOKUP(H14,ledger,11,0)","v":"0031"},{"$f":"IFERROR(VLOOKUP(C21,codesub,2,0),\"SUB.CODE IS WRONG\")","v":"COM. ENGLISH (TH)"},null,3,{"$f":"VLOOKUP(H14,ledger,12,0)","v":"C+"},{"$f":"VLOOKUP(H14,ledger,13,0)","v":2.4},{"$f":"VLOOKUP(H14,ledger,16,0)","v":"C+"}]
[null,null,{"$f":"IF(C21=\"0031\",\"0032\",\"SORRY\")","v":"0032"},{"$f":"IF(C22=\"0032\",\"COM. ENGLISH (IN)\",\"SUB.CODE IS WRONG\")","v":"COM. ENGLISH (IN)"},null,1,{"$f":"VLOOKUP(H14,ledger,14,0)","v":"C+"},{"$f":"VLOOKUP(H14,ledger,15,0)","v":2.4}]
[null,null,{"$f":"VLOOKUP(H14,ledger,17,0)","v":"0051"},{"$f":"IF(C23=\"0051\",\"COM. SOCIAL STUDIES & LIFE SKILL (TH)\",IF(C23=\"0071\",\"COM. MATHEMATICS (TH)\",\"SUB.CODE IS WRONG\"))","v":"COM. SOCIAL STUDIES & LIFE SKILL (TH)"},null,3.75,{"$f":"VLOOKUP(H14,ledger,18,0)","v":"A"},{"$f":"VLOOKUP(H14,ledger,19,0)","v":3.6},{"$f":"VLOOKUP(H14,ledger,22,0)","v":"A+"},{"$f":"IF(OR($I$19=\"NG\",$I$21=\"NG\",$I$23=\"NG\",$I$25=\"NG\",$I$27=\"NG\",$I$29=\"NG\"),\"W\",\"\")","v":""}]
[null,null,{"$f":"IF(C23=\"0051\",\"0052\",IF(C23=\"0071\",\"0072\",\"SORRY\"))","v":"0052"},{"$f":"IF(C24=\"0052\",\"COM. SOCIAL STUDIES & LIFE SKILL (IN)\",IF(C24=\"0072\",\"COM. MATHEMATICS (IN)\",\"SUB.CODE IS WRONG\"))","v":"COM. SOCIAL STUDIES & LIFE SKILL (IN)"},null,1.25,{"$f":"VLOOKUP(H14,ledger,20,0)","v":"A+"},{"$f":"VLOOKUP(H14,ledger,21,0)","v":4},null,{"$f":"IF(OR($I$19=\"ABS\",$I$21=\"ABS\",$I$23=\"ABS\",$I$25=\"ABS\",$I$27=\"ABS\",$I$29=\"ABS\"),\"ABS\",\"\")","v":""}]
[null,null,{"$f":"VLOOKUP(H14,ledger,23,0)","v":1031},{"$f":"IFERROR(VLOOKUP(C25,codesub,2,0),\"SUB.CODE IS WRONG\")","v":"ACCOUNTING (TH)"},null,3.75,{"$f":"VLOOKUP(H14,ledger,24,0)","v":"B"},{"$f":"VLOOKUP(H14,ledger,25,0)","v":2.8},{"$f":"VLOOKUP(H14,ledger,28,0)","v":"B+"}]
[null,null,{"$f":"C25+1","v":1032},"ACCOUNTING (IN)",null,1.25,{"$f":"VLOOKUP(H14,ledger,26,0)","v":"A"},{"$f":"VLOOKUP(H14,ledger,27,0)","v":3.6}]
[null,null,{"$f":"VLOOKUP(H14,ledger,29,0)","v":4251},"SINGING (TH)",null,3.75,{"$f":"VLOOKUP(H14,ledger,30,0)","v":"C+"},{"$f":"VLOOKUP(H14,ledger,31,0)","v":2.4},{"$f":"VLOOKUP(H14,ledger,34,0)","v":"B"}]
[null,null,{"$f":"C27+1","v":4252},"SINGING (IN)",null,1.25,{"$f":"VLOOKUP(H14,ledger,32,0)","v":"A+"},{"$f":"VLOOKUP(H14,ledger,33,0)","v":4}]
[null,null,{"$f":"VLOOKUP(H14,ledger,35,0)","v":4171},{"$f":"IFERROR(VLOOKUP(C29,codesub,2,0),\"SUB.CODE IS WRONG\")","v":"FINANCE (TH)"},null,3.75,{"$f":"VLOOKUP(H14,ledger,36,0)","v":"C+"},{"$f":"VLOOKUP(H14,ledger,37,0)","v":2.4},{"$f":"VLOOKUP(H14,ledger,40,0)","v":"*"}]
[null,null,{"$f":"C29+1","v":4172},"FINANCE (IN)",null,1.25,{"$f":"VLOOKUP(H14,ledger,38,0)","v":"ABS"},{"$f":"VLOOKUP(H14,ledger,39,0)","v":"ABS"}]
[null,null,"GRADE POINT AVERAGE (GPA) :",null,null,null,null,null,{"$f":"VLOOKUP(H14,ledger,41,0)","v":"-"}]
[null,null,"EXTRA CREDIT SUBJECT"]
[null,null,{"$f":"IFERROR(VLOOKUP(H14,ledger,42,0),\"\")","v":0},{"$f":"IFERROR(VLOOKUP(C33,codesub,2,0),\"SUB.CODE IS WRONG\")","v":"SUB.CODE IS WRONG"},null,null,{"$f":"VLOOKUP(H14,ledger,43,0)","v":"ABS"},{"$f":"VLOOKUP(H14,ledger,44,0)","v":"ABS"},{"$f":"VLOOKUP(H14,ledger,47,0)","v":""}]
[null,null,{"$f":"IFERROR(C33+1,\"\")","v":1},{"$f":"IFERROR(VLOOKUP(C34,codesub,2,0),\"SUB.CODE IS WRONG\")","v":"SUB.CODE IS WRONG"},null,null,{"$f":"VLOOKUP(H14,ledger,45,0)","v":"ABS"},{"$f":"VLOOKUP(H14,ledger,46,0)","v":"ABS"}]
[null,null,"PREPARED BY : …………………………"]
[null,null,"CHECKED BY : …………………………"]
[null,null,"DATE OF ISSUE     :",null,"2079.03.15",null,null,"HEAD TEACHER"]
[]
[null,null,"NOTE : ONE CREDIT HOUR EQUALS TO 32 WORKING HOURS"]
[null,null,"INTERNAL (IN) : THIS COVERS THE PARTICIPATION, PRACTICAL/PROJECT WORKS, COMMUNITY \n                                     WORKS, INTERNSHIP, PRESENTATIONS, TERMINAL EXAMINATIONS."]
[null,null,"THEORY (TH) :  THIS COVERS WRITTEN EXTERNAL EXAMINATION"]
[null,null,"ABS = ABSENT",null,null,null,"       ","W= WITHHELD"]

{"sheet":"std21","index":25,"n_rows":42,"n_cols":10,"rows_kept":42,"cut":false,"hidden":false,"merged":[[2,2,6,9],[11,2,11,4],[11,5,11,9],[12,7,12,8],[13,2,13,3],[13,5,13,6],[14,2,14,4],[14,5,14,6],[14,7,14,9],[16,2,17,2],[16,3,17,4],[16,5,17,5],[16,6,17,6],[16,7,17,7],[16,8,17,8],[16,9,17,9],[18,3,18,4],[18,8,19,8],[19,3,19,4],[20,3,20,4],[20,8,21,8],[21,3,21,4],[22,3,22,4],[22,8,23,8],[23,3,23,4],[24,3,24,4],[24,8,25,8],[25,3,25,4],[34,2,34,4],[26,3,26,4],[26,8,27,8],[27,3,27,4],[28,3,28,4],[28,8,29,8],[29,3,29,4],[30,2,30,7],[31,2,31,9],[32,3,32,4],[32,8,33,8],[33,3,33,4],[41,2,41,3],[41,7,41,8],[35,2,35,4],[36,2,36,3],[36,7,36,9],[38,2,38,6],[39,2,39,9],[40,2,40,6]]}
[]
[]
[]
[]
[]
[]
[]
[]
[]
[]
[]
[null,null,"THE GRADE(S) SECURED BY   :",null,null,{"$f":"IFERROR(VLOOKUP(H14,ledger,2,0),\"This Symbol No. is not in Grade Ledger\")","v":"REJINA RAI "}]
[null,null,"DATE OF BIRTH :",null,{"$f":"VLOOKUP(H14,ledger,3,0)","v":"2062-02-27"},"B.S.","       (",null,null,"A.D.)"]
[null,null,"REGISTRATION NO.",null,{"$f":"VLOOKUP(H14,ledger,4,0)","v":"801130210021"},"SYMBOL NO.",null,11301340,"GRADE","XI"]
[null,null,"IN THE EXAMINATION CONDUCTED IN ",null,null,"2080 B.S. (2022 A.D.)",null,"ARE GIVEN BELOW."]
[]
[null,null,"SUBJECT CODE","SUBJECTS",null,"CREDIT HOUR (CH)","GRADE","GARDE POINT (GP)","FINAL GRADE (FG) ","REMARKS"]
[]
[null,null,{"$f":"VLOOKUP(H14,ledger,5,0)","v":"0011"},{"$f":"IFERROR(VLOOKUP(C19,codesub,2,0),\"SUB.CODE IS WRONG\")","v":"COM. NEPALI (TH)"},null,2.25,{"$f":"VLOOKUP(H14,ledger,6,0)","v":"A+"},{"$f":"VLOOKUP(H14,ledger,7,0)","v":4},{"$f":"VLOOKUP(H14,ledger,10,0)","v":"A+"}]
[null,null,{"$f":"IF(C19=\"0011\",\"0012\",\"SORRY\")","v":"0012"},{"$f":"IF(C20=\"0012\",\"COM. NEPALI (IN)\",\"SUB.CODE IS WRONG\")","v":"COM. NEPALI (IN)"},null,0.75,{"$f":"VLOOKUP(H14,ledger,8,0)","v":"A"},{"$f":"VLOOKUP(H14,ledger,9,0)","v":3.6}]
[null,null,{"$f":"VLOOKUP(H14,ledger,11,0)","v":"0031"},{"$f":"IFERROR(VLOOKUP(C21,codesub,2,0),\"SUB.CODE IS WRONG\")","v":"COM. ENGLISH (TH)"},null,3,{"$f":"VLOOKUP(H14,ledger,12,0)","v":"A+"},{"$f":"VLOOKUP(H14,ledger,13,0)","v":4},{"$f":"VLOOKUP(H14,ledger,16,0)","v":"A+"}]
[null,null,{"$f":"IF(C21=\"0031\",\"0032\",\"SORRY\")","v":"0032"},{"$f":"IF(C22=\"0032\",\"COM. ENGLISH (IN)\",\"SUB.CODE IS WRONG\")","v":"COM. ENGLISH (IN)"},null,1,{"$f":"VLOOKUP(H14,ledger,14,0)","v":"A"},{"$f":"VLOOKUP(H14,ledger,15,0)","v":3.6}]
[null,null,{"$f":"VLOOKUP(H14,ledger,17,0)","v":"0051"},{"$f":"IF(C23=\"0051\",\"COM. SOCIAL STUDIES & LIFE SKILL (TH)\",IF(C23=\"0071\",\"COM. MATHEMATICS (TH)\",\"SUB.CODE IS WRONG\"))","v":"COM. SOCIAL STUDIES & LIFE SKILL (TH)"},null,3.75,{"$f":"VLOOKUP(H14,ledger,18,0)","v":"A+"},{"$f":"VLOOKUP(H14,ledger,19,0)","v":4},{"$f":"VLOOKUP(H14,ledger,22,0)","v":"A+"},{"$f":"IF(OR($I$19=\"NG\",$I$21=\"NG\",$I$23=\"NG\",$I$25=\"NG\",$I$27=\"NG\",$I$29=\"NG\"),\"W\",\"\")","v":""}]
[null,null,{"$f":"IF(C23=\"0051\",\"0052\",IF(C23=\"0071\",\"0072\",\"SORRY\"))","v":"0052"},{"$f":"IF(C24=\"0052\",\"COM. SOCIAL STUDIES & LIFE SKILL (IN)\",IF(C24=\"0072\",\"COM. MATHEMATICS (IN)\",\"SUB.CODE IS WRONG\"))","v":"COM. SOCIAL STUDIES & LIFE SKILL (IN)"},null,1.25,{"$f":"VLOOKUP(H14,ledger,20,0)","v":"A+"},{"$f":"VLOOKUP(H14,ledger,21,0)","v":4},null,{"$f":"IF(OR($I$19=\"ABS\",$I$21=\"ABS\",$I$23=\"ABS\",$I$25=\"ABS\",$I$27=\"ABS\",$I$29=\"ABS\"),\"ABS\",\"\")","v":""}]
[null,null,{"$f":"VLOOKUP(H14,ledger,23,0)","v":1031},{"$f":"IFERROR(VLOOKUP(C25,codesub,2,0),\"SUB.CODE IS WRONG\")","v":"ACCOUNTING (TH)"},null,3.75,{"$f":"VLOOKUP(H14,ledger,24,0)","v":"A+"},{"$f":"VLOOKUP(H14,ledger,25,0)","v":4},{"$f":"VLOOKUP(H14,ledger,28,0)","v":"A+"}]
[null,null,{"$f":"C25+1","v":1032},"ACCOUNTING (IN)",null,1.25,{"$f":"VLOOKUP(H14,ledger,26,0)","v":"A+"},{"$f":"VLOOKUP(H14,ledger,27,0)","v":4}]
[null,null,{"$f":"VLOOKUP(H14,ledger,29,0)","v":4251},"SINGING (TH)",null,3.75,{"$f":"VLOOKUP(H14,ledger,30,0)","v":"B"},{"$f":"VLOOKUP(H14,ledger,31,0)","v":2.8},{"$f":"VLOOKUP(H14,ledger,34,0)","v":"B+"}]
[null,null,{"$f":"C27+1","v":4252},"SINGING (IN)",null,1.25,{"$f":"VLOOKUP(H14,ledger,32,0)","v":"A+"},{"$f":"VLOOKUP(H14,ledger,33,0)","v":4}]
[null,null,{"$f":"VLOOKUP(H14,ledger,35,0)","v":4051},{"$f":"IFERROR(VLOOKUP(C29,codesub,2,0),\"SUB.CODE IS WRONG\")","v":"BUSINESS MATHEMATICS (TH)"},null,3.75,{"$f":"VLOOKUP(H14,ledger,36,0)","v":"A+"},{"$f":"VLOOKUP(H14,ledger,37,0)","v":4},{"$f":"VLOOKUP(H14,ledger,40,0)","v":"*"}]
[null,null,{"$f":"C29+1","v":4052},"BUSINESS MATHEMATICS (IN)",null,1.25,{"$f":"VLOOKUP(H14,ledger,38,0)","v":"ABS"},{"$f":"VLOOKUP(H14,ledger,39,0)","v":"ABS"}]
[null,null,"GRADE POINT AVERAGE (GPA) :",null,null,null,null,null,{"$f":"VLOOKUP(H14,ledger,41,0)","v":"-"}]
[null,null,"EXTRA CREDIT SUBJECT"]
[null,null,{"$f":"IFERROR(VLOOKUP(H14,ledger,42,0),\"\")","v":0},{"$f":"IFERROR(VLOOKUP(C33,codesub,2,0),\"SUB.CODE IS WRONG\")","v":"SUB.CODE IS WRONG"},null,null,{"$f":"VLOOKUP(H14,ledger,43,0)","v":"ABS"},{"$f":"VLOOKUP(H14,ledger,44,0)","v":"ABS"},{"$f":"VLOOKUP(H14,ledger,47,0)","v":""}]
[null,null,{"$f":"IFERROR(C33+1,\"\")","v":1},{"$f":"IFERROR(VLOOKUP(C34,codesub,2,0),\"SUB.CODE IS WRONG\")","v":"SUB.CODE IS WRONG"},null,null,{"$f":"VLOOKUP(H14,ledger,45,0)","v":"ABS"},{"$f":"VLOOKUP(H14,ledger,46,0)","v":"ABS"}]
[null,null,"PREPARED BY : …………………………"]
[null,null,"CHECKED BY : …………………………"]
[null,null,"DATE OF ISSUE     :",null,"2079.03.15",null,null,"HEAD TEACHER"]
[]
[null,null,"NOTE : ONE CREDIT HOUR EQUALS TO 32 WORKING HOURS"]
[null,null,"INTERNAL (IN) : THIS COVERS THE PARTICIPATION, PRACTICAL/PROJECT WORKS, COMMUNITY \n                                     WORKS, INTERNSHIP, PRESENTATIONS, TERMINAL EXAMINATIONS."]
[null,null,"THEORY (TH) :  THIS COVERS WRITTEN EXTERNAL EXAMINATION"]
[null,null,"ABS = ABSENT",null,null,null,"       ","W= WITHHELD"]

{"sheet":"std22","index":26,"n_rows":42,"n_cols":10,"rows_kept":42,"cut":false,"hidden":false,"merged":[[2,2,6,9],[11,2,11,4],[11,5,11,9],[12,7,12,8],[13,2,13,3],[13,5,13,6],[14,2,14,4],[14,5,14,6],[14,7,14,9],[16,2,17,2],[16,3,17,4],[16,5,17,5],[16,6,17,6],[16,7,17,7],[16,8,17,8],[16,9,17,9],[18,3,18,4],[18,8,19,8],[19,3,19,4],[20,3,20,4],[20,8,21,8],[21,3,21,4],[22,3,22,4],[22,8,23,8],[23,3,23,4],[24,3,24,4],[24,8,25,8],[25,3,25,4],[34,2,34,4],[26,3,26,4],[26,8,27,8],[27,3,27,4],[28,3,28,4],[28,8,29,8],[29,3,29,4],[30,2,30,7],[31,2,31,9],[32,3,32,4],[32,8,33,8],[33,3,33,4],[41,2,41,3],[41,7,41,8],[35,2,35,4],[36,2,36,3],[36,7,36,9],[38,2,38,6],[39,2,39,9],[40,2,40,6]]}
[]
[]
[]
[]
[]
[]
[]
[]
[]
[]
[]
[null,null,"THE GRADE(S) SECURED BY   :",null,null,{"$f":"IFERROR(VLOOKUP(H14,ledger,2,0),\"This Symbol No. is not in Grade Ledger\")","v":"ROHAN JOSHI "}]
[null,null,"DATE OF BIRTH :",null,{"$f":"VLOOKUP(H14,ledger,3,0)","v":"2062-04-08"},"B.S.","       (",null,null,"A.D.)"]
[null,null,"REGISTRATION NO.",null,{"$f":"VLOOKUP(H14,ledger,4,0)","v":"801130210022"},"SYMBOL NO.",null,11301341,"GRADE","XI"]
[null,null,"IN THE EXAMINATION CONDUCTED IN ",null,null,"2080 B.S. (2022 A.D.)",null,"ARE GIVEN BELOW."]
[]
[null,null,"SUBJECT CODE","SUBJECTS",null,"CREDIT HOUR (CH)","GRADE","GARDE POINT (GP)","FINAL GRADE (FG) ","REMARKS"]
[]
[null,null,{"$f":"VLOOKUP(H14,ledger,5,0)","v":"0011"},{"$f":"IFERROR(VLOOKUP(C19,codesub,2,0),\"SUB.CODE IS WRONG\")","v":"COM. NEPALI (TH)"},null,2.25,{"$f":"VLOOKUP(H14,ledger,6,0)","v":"B+"},{"$f":"VLOOKUP(H14,ledger,7,0)","v":3.2},{"$f":"VLOOKUP(H14,ledger,10,0)","v":"B+"}]
[null,null,{"$f":"IF(C19=\"0011\",\"0012\",\"SORRY\")","v":"0012"},{"$f":"IF(C20=\"0012\",\"COM. NEPALI (IN)\",\"SUB.CODE IS WRONG\")","v":"COM. NEPALI (IN)"},null,0.75,{"$f":"VLOOKUP(H14,ledger,8,0)","v":"B+"},{"$f":"VLOOKUP(H14,ledger,9,0)","v":3.2}]
[null,null,{"$f":"VLOOKUP(H14,ledger,11,0)","v":"0031"},{"$f":"IFERROR(VLOOKUP(C21,codesub,2,0),\"SUB.CODE IS WRONG\")","v":"COM. ENGLISH (TH)"},null,3,{"$f":"VLOOKUP(H14,ledger,12,0)","v":"B+"},{"$f":"VLOOKUP(H14,ledger,13,0)","v":3.2},{"$f":"VLOOKUP(H14,ledger,16,0)","v":"B+"}]
[null,null,{"$f":"IF(C21=\"0031\",\"0032\",\"SORRY\")","v":"0032"},{"$f":"IF(C22=\"0032\",\"COM. ENGLISH (IN)\",\"SUB.CODE IS WRONG\")","v":"COM. ENGLISH (IN)"},null,1,{"$f":"VLOOKUP(H14,ledger,14,0)","v":"B+"},{"$f":"VLOOKUP(H14,ledger,15,0)","v":3.2}]
[null,null,{"$f":"VLOOKUP(H14,ledger,17,0)","v":"0051"},{"$f":"IF(C23=\"0051\",\"COM. SOCIAL STUDIES & LIFE SKILL (TH)\",IF(C23=\"0071\",\"COM. MATHEMATICS (TH)\",\"SUB.CODE IS WRONG\"))","v":"COM. SOCIAL STUDIES & LIFE SKILL (TH)"},null,3.75,{"$f":"VLOOKUP(H14,ledger,18,0)","v":"B"},{"$f":"VLOOKUP(H14,ledger,19,0)","v":2.8},{"$f":"VLOOKUP(H14,ledger,22,0)","v":"B+"},{"$f":"IF(OR($I$19=\"NG\",$I$21=\"NG\",$I$23=\"NG\",$I$25=\"NG\",$I$27=\"NG\",$I$29=\"NG\"),\"W\",\"\")","v":""}]
[null,null,{"$f":"IF(C23=\"0051\",\"0052\",IF(C23=\"0071\",\"0072\",\"SORRY\"))","v":"0052"},{"$f":"IF(C24=\"0052\",\"COM. SOCIAL STUDIES & LIFE SKILL (IN)\",IF(C24=\"0072\",\"COM. MATHEMATICS (IN)\",\"SUB.CODE IS WRONG\"))","v":"COM. SOCIAL STUDIES & LIFE SKILL (IN)"},null,1.25,{"$f":"VLOOKUP(H14,ledger,20,0)","v":"A"},{"$f":"VLOOKUP(H14,ledger,21,0)","v":3.6},null,{"$f":"IF(OR($I$19=\"ABS\",$I$21=\"ABS\",$I$23=\"ABS\",$I$25=\"ABS\",$I$27=\"ABS\",$I$29=\"ABS\"),\"ABS\",\"\")","v":""}]
[null,null,{"$f":"VLOOKUP(H14,ledger,23,0)","v":1031},{"$f":"IFERROR(VLOOKUP(C25,codesub,2,0),\"SUB.CODE IS WRONG\")","v":"ACCOUNTING (TH)"},null,3.75,{"$f":"VLOOKUP(H14,ledger,24,0)","v":"A"},{"$f":"VLOOKUP(H14,ledger,25,0)","v":3.6},{"$f":"VLOOKUP(H14,ledger,28,0)","v":"A+"}]
[null,null,{"$f":"C25+1","v":1032},"ACCOUNTING (IN)",null,1.25,{"$f":"VLOOKUP(H14,ledger,26,0)","v":"A+"},{"$f":"VLOOKUP(H14,ledger,27,0)","v":4}]
[null,null,{"$f":"VLOOKUP(H14,ledger,29,0)","v":4251},"SINGING (TH)",null,3.75,{"$f":"VLOOKUP(H14,ledger,30,0)","v":"C+"},{"$f":"VLOOKUP(H14,ledger,31,0)","v":2.4},{"$f":"VLOOKUP(H14,ledger,34,0)","v":"B"}]
[null,null,{"$f":"C27+1","v":4252},"SINGING (IN)",null,1.25,{"$f":"VLOOKUP(H14,ledger,32,0)","v":"A+"},{"$f":"VLOOKUP(H14,ledger,33,0)","v":4}]
[null,null,{"$f":"VLOOKUP(H14,ledger,35,0)","v":4051},{"$f":"IFERROR(VLOOKUP(C29,codesub,2,0),\"SUB.CODE IS WRONG\")","v":"BUSINESS MATHEMATICS (TH)"},null,3.75,{"$f":"VLOOKUP(H14,ledger,36,0)","v":"A"},{"$f":"VLOOKUP(H14,ledger,37,0)","v":3.6},{"$f":"VLOOKUP(H14,ledger,40,0)","v":"*"}]
[null,null,{"$f":"C29+1","v":4052},"BUSINESS MATHEMATICS (IN)",null,1.25,{"$f":"VLOOKUP(H14,ledger,38,0)","v":"ABS"},{"$f":"VLOOKUP(H14,ledger,39,0)","v":"ABS"}]
[null,null,"GRADE POINT AVERAGE (GPA) :",null,null,null,null,null,{"$f":"VLOOKUP(H14,ledger,41,0)","v":"-"}]
[null,null,"EXTRA CREDIT SUBJECT"]
[null,null,{"$f":"IFERROR(VLOOKUP(H14,ledger,42,0),\"\")","v":0},{"$f":"IFERROR(VLOOKUP(C33,codesub,2,0),\"SUB.CODE IS WRONG\")","v":"SUB.CODE IS WRONG"},null,null,{"$f":"VLOOKUP(H14,ledger,43,0)","v":"ABS"},{"$f":"VLOOKUP(H14,ledger,44,0)","v":"ABS"},{"$f":"VLOOKUP(H14,ledger,47,0)","v":""}]
[null,null,{"$f":"IFERROR(C33+1,\"\")","v":1},{"$f":"IFERROR(VLOOKUP(C34,codesub,2,0),\"SUB.CODE IS WRONG\")","v":"SUB.CODE IS WRONG"},null,null,{"$f":"VLOOKUP(H14,ledger,45,0)","v":"ABS"},{"$f":"VLOOKUP(H14,ledger,46,0)","v":"ABS"}]
[null,null,"PREPARED BY : …………………………"]
[null,null,"CHECKED BY : …………………………"]
[null,null,"DATE OF ISSUE     :",null,"2079.03.15",null,null,"HEAD TEACHER"]
[]
[null,null,"NOTE : ONE CREDIT HOUR EQUALS TO 32 WORKING HOURS"]
[null,null,"INTERNAL (IN) : THIS COVERS THE PARTICIPATION, PRACTICAL/PROJECT WORKS, COMMUNITY \n                                     WORKS, INTERNSHIP, PRESENTATIONS, TERMINAL EXAMINATIONS."]
[null,null,"THEORY (TH) :  THIS COVERS WRITTEN EXTERNAL EXAMINATION"]
[null,null,"ABS = ABSENT",null,null,null,"       ","W= WITHHELD"]

{"sheet":"std23","index":27,"n_rows":42,"n_cols":10,"rows_kept":42,"cut":false,"hidden":false,"merged":[[2,2,6,9],[11,2,11,4],[11,5,11,9],[12,7,12,8],[13,2,13,3],[13,5,13,6],[14,2,14,4],[14,5,14,6],[14,7,14,9],[16,2,17,2],[16,3,17,4],[16,5,17,5],[16,6,17,6],[16,7,17,7],[16,8,17,8],[16,9,17,9],[18,3,18,4],[18,8,19,8],[19,3,19,4],[20,3,20,4],[20,8,21,8],[21,3,21,4],[22,3,22,4],[22,8,23,8],[23,3,23,4],[24,3,24,4],[24,8,25,8],[25,3,25,4],[34,2,34,4],[26,3,26,4],[26,8,27,8],[27,3,27,4],[28,3,28,4],[28,8,29,8],[29,3,29,4],[30,2,30,7],[31,2,31,9],[32,3,32,4],[32,8,33,8],[33,3,33,4],[41,2,41,3],[41,7,41,8],[35,2,35,4],[36,2,36,3],[36,7,36,9],[38,2,38,6],[39,2,39,9],[40,2,40,6]]}
[]
[]
[]
[]
[]
[]
[]
[]
[]
[]
[]
[null,null,"THE GRADE(S) SECURED BY   :",null,null,{"$f":"IFERROR(VLOOKUP(H14,ledger,2,0),\"This Symbol No. is not in Grade Ledger\")","v":"SALINA GAJMER "}]
[null,null,"DATE OF BIRTH :",null,{"$f":"VLOOKUP(H14,ledger,3,0)","v":"2063-04-25"},"B.S.","       (",null,null,"A.D.)"]
[null,null,"REGISTRATION NO.",null,{"$f":"VLOOKUP(H14,ledger,4,0)","v":"801130210023"},"SYMBOL NO.",null,11301342,"GRADE","XI"]
[null,null,"IN THE EXAMINATION CONDUCTED IN ",null,null,"2080 B.S. (2022 A.D.)",null,"ARE GIVEN BELOW."]
[]
[null,null,"SUBJECT CODE","SUBJECTS",null,"CREDIT HOUR (CH)","GRADE","GARDE POINT (GP)","FINAL GRADE (FG) ","REMARKS"]
[]
[null,null,{"$f":"VLOOKUP(H14,ledger,5,0)","v":"0011"},{"$f":"IFERROR(VLOOKUP(C19,codesub,2,0),\"SUB.CODE IS WRONG\")","v":"COM. NEPALI (TH)"},null,2.25,{"$f":"VLOOKUP(H14,ledger,6,0)","v":"C"},{"$f":"VLOOKUP(H14,ledger,7,0)","v":2},{"$f":"VLOOKUP(H14,ledger,10,0)","v":"C"}]
[null,null,{"$f":"IF(C19=\"0011\",\"0012\",\"SORRY\")","v":"0012"},{"$f":"IF(C20=\"0012\",\"COM. NEPALI (IN)\",\"SUB.CODE IS WRONG\")","v":"COM. NEPALI (IN)"},null,0.75,{"$f":"VLOOKUP(H14,ledger,8,0)","v":"C"},{"$f":"VLOOKUP(H14,ledger,9,0)","v":2}]
[null,null,{"$f":"VLOOKUP(H14,ledger,11,0)","v":"0031"},{"$f":"IFERROR(VLOOKUP(C21,codesub,2,0),\"SUB.CODE IS WRONG\")","v":"COM. ENGLISH (TH)"},null,3,{"$f":"VLOOKUP(H14,ledger,12,0)","v":"C"},{"$f":"VLOOKUP(H14,ledger,13,0)","v":2},{"$f":"VLOOKUP(H14,ledger,16,0)","v":"C"}]
[null,null,{"$f":"IF(C21=\"0031\",\"0032\",\"SORRY\")","v":"0032"},{"$f":"IF(C22=\"0032\",\"COM. ENGLISH (IN)\",\"SUB.CODE IS WRONG\")","v":"COM. ENGLISH (IN)"},null,1,{"$f":"VLOOKUP(H14,ledger,14,0)","v":"C"},{"$f":"VLOOKUP(H14,ledger,15,0)","v":2}]
[null,null,{"$f":"VLOOKUP(H14,ledger,17,0)","v":"0051"},{"$f":"IF(C23=\"0051\",\"COM. SOCIAL STUDIES & LIFE SKILL (TH)\",IF(C23=\"0071\",\"COM. MATHEMATICS (TH)\",\"SUB.CODE IS WRONG\"))","v":"COM. SOCIAL STUDIES & LIFE SKILL (TH)"},null,3.75,{"$f":"VLOOKUP(H14,ledger,18,0)","v":"B"},{"$f":"VLOOKUP(H14,ledger,19,0)","v":2.8},{"$f":"VLOOKUP(H14,ledger,22,0)","v":"B+"},{"$f":"IF(OR($I$19=\"NG\",$I$21=\"NG\",$I$23=\"NG\",$I$25=\"NG\",$I$27=\"NG\",$I$29=\"NG\"),\"W\",\"\")","v":""}]
[null,null,{"$f":"IF(C23=\"0051\",\"0052\",IF(C23=\"0071\",\"0072\",\"SORRY\"))","v":"0052"},{"$f":"IF(C24=\"0052\",\"COM. SOCIAL STUDIES & LIFE SKILL (IN)\",IF(C24=\"0072\",\"COM. MATHEMATICS (IN)\",\"SUB.CODE IS WRONG\"))","v":"COM. SOCIAL STUDIES & LIFE SKILL (IN)"},null,1.25,{"$f":"VLOOKUP(H14,ledger,20,0)","v":"A"},{"$f":"VLOOKUP(H14,ledger,21,0)","v":3.6},null,{"$f":"IF(OR($I$19=\"ABS\",$I$21=\"ABS\",$I$23=\"ABS\",$I$25=\"ABS\",$I$27=\"ABS\",$I$29=\"ABS\"),\"ABS\",\"\")","v":""}]
[null,null,{"$f":"VLOOKUP(H14,ledger,23,0)","v":1031},{"$f":"IFERROR(VLOOKUP(C25,codesub,2,0),\"SUB.CODE IS WRONG\")","v":"ACCOUNTING (TH)"},null,3.75,{"$f":"VLOOKUP(H14,ledger,24,0)","v":"B+"},{"$f":"VLOOKUP(H14,ledger,25,0)","v":3.2},{"$f":"VLOOKUP(H14,ledger,28,0)","v":"A"}]
[null,null,{"$f":"C25+1","v":1032},"ACCOUNTING (IN)",null,1.25,{"$f":"VLOOKUP(H14,ledger,26,0)","v":"A"},{"$f":"VLOOKUP(H14,ledger,27,0)","v":3.6}]
[null,null,{"$f":"VLOOKUP(H14,ledger,29,0)","v":4251},"SINGING (TH)",null,3.75,{"$f":"VLOOKUP(H14,ledger,30,0)","v":"C+"},{"$f":"VLOOKUP(H14,ledger,31,0)","v":2.4},{"$f":"VLOOKUP(H14,ledger,34,0)","v":"B"}]
[null,null,{"$f":"C27+1","v":4252},"SINGING (IN)",null,1.25,{"$f":"VLOOKUP(H14,ledger,32,0)","v":"A+"},{"$f":"VLOOKUP(H14,ledger,33,0)","v":4}]
[null,null,{"$f":"VLOOKUP(H14,ledger,35,0)","v":4171},{"$f":"IFERROR(VLOOKUP(C29,codesub,2,0),\"SUB.CODE IS WRONG\")","v":"FINANCE (TH)"},null,3.75,{"$f":"VLOOKUP(H14,ledger,36,0)","v":"B+"},{"$f":"VLOOKUP(H14,ledger,37,0)","v":3.2},{"$f":"VLOOKUP(H14,ledger,40,0)","v":"*"}]
[null,null,{"$f":"C29+1","v":4172},"FINANCE (IN)",null,1.25,{"$f":"VLOOKUP(H14,ledger,38,0)","v":"ABS"},{"$f":"VLOOKUP(H14,ledger,39,0)","v":"ABS"}]
[null,null,"GRADE POINT AVERAGE (GPA) :",null,null,null,null,null,{"$f":"VLOOKUP(H14,ledger,41,0)","v":"-"}]
[null,null,"EXTRA CREDIT SUBJECT"]
[null,null,{"$f":"IFERROR(VLOOKUP(H14,ledger,42,0),\"\")","v":0},{"$f":"IFERROR(VLOOKUP(C33,codesub,2,0),\"SUB.CODE IS WRONG\")","v":"SUB.CODE IS WRONG"},null,null,{"$f":"VLOOKUP(H14,ledger,43,0)","v":"ABS"},{"$f":"VLOOKUP(H14,ledger,44,0)","v":"ABS"},{"$f":"VLOOKUP(H14,ledger,47,0)","v":""}]
[null,null,{"$f":"IFERROR(C33+1,\"\")","v":1},{"$f":"IFERROR(VLOOKUP(C34,codesub,2,0),\"SUB.CODE IS WRONG\")","v":"SUB.CODE IS WRONG"},null,null,{"$f":"VLOOKUP(H14,ledger,45,0)","v":"ABS"},{"$f":"VLOOKUP(H14,ledger,46,0)","v":"ABS"}]
[null,null,"PREPARED BY : …………………………"]
[null,null,"CHECKED BY : …………………………"]
[null,null,"DATE OF ISSUE     :",null,"2079.03.15",null,null,"HEAD TEACHER"]
[]
[null,null,"NOTE : ONE CREDIT HOUR EQUALS TO 32 WORKING HOURS"]
[null,null,"INTERNAL (IN) : THIS COVERS THE PARTICIPATION, PRACTICAL/PROJECT WORKS, COMMUNITY \n                                     WORKS, INTERNSHIP, PRESENTATIONS, TERMINAL EXAMINATIONS."]
[null,null,"THEORY (TH) :  THIS COVERS WRITTEN EXTERNAL EXAMINATION"]
[null,null,"ABS = ABSENT",null,null,null,"       ","W= WITHHELD"]

{"sheet":"std24","index":28,"n_rows":42,"n_cols":10,"rows_kept":42,"cut":false,"hidden":false,"merged":[[2,2,6,9],[11,2,11,4],[11,5,11,9],[12,7,12,8],[13,2,13,3],[13,5,13,6],[14,2,14,4],[14,5,14,6],[14,7,14,9],[16,2,17,2],[16,3,17,4],[16,5,17,5],[16,6,17,6],[16,7,17,7],[16,8,17,8],[16,9,17,9],[18,3,18,4],[18,8,19,8],[19,3,19,4],[20,3,20,4],[20,8,21,8],[21,3,21,4],[22,3,22,4],[22,8,23,8],[23,3,23,4],[24,3,24,4],[24,8,25,8],[25,3,25,4],[34,2,34,4],[26,3,26,4],[26,8,27,8],[27,3,27,4],[28,3,28,4],[28,8,29,8],[29,3,29,4],[30,2,30,7],[31,2,31,9],[32,3,32,4],[32,8,33,8],[33,3,33,4],[41,2,41,3],[41,7,41,8],[35,2,35,4],[36,2,36,3],[36,7,36,9],[38,2,38,6],[39,2,39,9],[40,2,40,6]]}
[]
[]
[]
[]
[]
[]
[]
[]
[]
[]
[]
[null,null,"THE GRADE(S) SECURED BY   :",null,null,{"$f":"IFERROR(VLOOKUP(H14,ledger,2,0),\"This Symbol No. is not in Grade Ledger\")","v":"SAPHAL SHRESTHA "}]
[null,null,"DATE OF BIRTH :",null,{"$f":"VLOOKUP(H14,ledger,3,0)","v":"2062-08-06"},"B.S.","       (",null,null,"A.D.)"]
[null,null,"REGISTRATION NO.",null,{"$f":"VLOOKUP(H14,ledger,4,0)","v":"801130210024"},"SYMBOL NO.",null,11301343,"GRADE","XI"]
[null,null,"IN THE EXAMINATION CONDUCTED IN ",null,null,"2080 B.S. (2022 A.D.)",null,"ARE GIVEN BELOW."]
[]
[null,null,"SUBJECT CODE","SUBJECTS",null,"CREDIT HOUR (CH)","GRADE","GARDE POINT (GP)","FINAL GRADE (FG) ","REMARKS"]
[]
[null,null,{"$f":"VLOOKUP(H14,ledger,5,0)","v":"0011"},{"$f":"IFERROR(VLOOKUP(C19,codesub,2,0),\"SUB.CODE IS WRONG\")","v":"COM. NEPALI (TH)"},null,2.25,{"$f":"VLOOKUP(H14,ledger,6,0)","v":"B+"},{"$f":"VLOOKUP(H14,ledger,7,0)","v":3.2},{"$f":"VLOOKUP(H14,ledger,10,0)","v":"B+"}]
[null,null,{"$f":"IF(C19=\"0011\",\"0012\",\"SORRY\")","v":"0012"},{"$f":"IF(C20=\"0012\",\"COM. NEPALI (IN)\",\"SUB.CODE IS WRONG\")","v":"COM. NEPALI (IN)"},null,0.75,{"$f":"VLOOKUP(H14,ledger,8,0)","v":"B+"},{"$f":"VLOOKUP(H14,ledger,9,0)","v":3.2}]
[null,null,{"$f":"VLOOKUP(H14,ledger,11,0)","v":"0031"},{"$f":"IFERROR(VLOOKUP(C21,codesub,2,0),\"SUB.CODE IS WRONG\")","v":"COM. ENGLISH (TH)"},null,3,{"$f":"VLOOKUP(H14,ledger,12,0)","v":"B+"},{"$f":"VLOOKUP(H14,ledger,13,0)","v":3.2},{"$f":"VLOOKUP(H14,ledger,16,0)","v":"B+"}]
[null,null,{"$f":"IF(C21=\"0031\",\"0032\",\"SORRY\")","v":"0032"},{"$f":"IF(C22=\"0032\",\"COM. ENGLISH (IN)\",\"SUB.CODE IS WRONG\")","v":"COM. ENGLISH (IN)"},null,1,{"$f":"VLOOKUP(H14,ledger,14,0)","v":"B+"},{"$f":"VLOOKUP(H14,ledger,15,0)","v":3.2}]
[null,null,{"$f":"VLOOKUP(H14,ledger,17,0)","v":"0051"},{"$f":"IF(C23=\"0051\",\"COM. SOCIAL STUDIES & LIFE SKILL (TH)\",IF(C23=\"0071\",\"COM. MATHEMATICS (TH)\",\"SUB.CODE IS WRONG\"))","v":"COM. SOCIAL STUDIES & LIFE SKILL (TH)"},null,3.75,{"$f":"VLOOKUP(H14,ledger,18,0)","v":"B+"},{"$f":"VLOOKUP(H14,ledger,19,0)","v":3.2},{"$f":"VLOOKUP(H14,ledger,22,0)","v":"A"},{"$f":"IF(OR($I$19=\"NG\",$I$21=\"NG\",$I$23=\"NG\",$I$25=\"NG\",$I$27=\"NG\",$I$29=\"NG\"),\"W\",\"\")","v":""}]
[null,null,{"$f":"IF(C23=\"0051\",\"0052\",IF(C23=\"0071\",\"0072\",\"SORRY\"))","v":"0052"},{"$f":"IF(C24=\"0052\",\"COM. SOCIAL STUDIES & LIFE SKILL (IN)\",IF(C24=\"0072\",\"COM. MATHEMATICS (IN)\",\"SUB.CODE IS WRONG\"))","v":"COM. SOCIAL STUDIES & LIFE SKILL (IN)"},null,1.25,{"$f":"VLOOKUP(H14,ledger,20,0)","v":"A"},{"$f":"VLOOKUP(H14,ledger,21,0)","v":3.6},null,{"$f":"IF(OR($I$19=\"ABS\",$I$21=\"ABS\",$I$23=\"ABS\",$I$25=\"ABS\",$I$27=\"ABS\",$I$29=\"ABS\"),\"ABS\",\"\")","v":""}]
[null,null,{"$f":"VLOOKUP(H14,ledger,23,0)","v":1031},{"$f":"IFERROR(VLOOKUP(C25,codesub,2,0),\"SUB.CODE IS WRONG\")","v":"ACCOUNTING (TH)"},null,3.75,{"$f":"VLOOKUP(H14,ledger,24,0)","v":"A+"},{"$f":"VLOOKUP(H14,ledger,25,0)","v":4},{"$f":"VLOOKUP(H14,ledger,28,0)","v":"A+"}]
[null,null,{"$f":"C25+1","v":1032},"ACCOUNTING (IN)",null,1.25,{"$f":"VLOOKUP(H14,ledger,26,0)","v":"A+"},{"$f":"VLOOKUP(H14,ledger,27,0)","v":4}]
[null,null,{"$f":"VLOOKUP(H14,ledger,29,0)","v":4251},"SINGING (TH)",null,3.75,{"$f":"VLOOKUP(H14,ledger,30,0)","v":"C+"},{"$f":"VLOOKUP(H14,ledger,31,0)","v":2.4},{"$f":"VLOOKUP(H14,ledger,34,0)","v":"B"}]
[null,null,{"$f":"C27+1","v":4252},"SINGING (IN)",null,1.25,{"$f":"VLOOKUP(H14,ledger,32,0)","v":"A+"},{"$f":"VLOOKUP(H14,ledger,33,0)","v":4}]
[null,null,{"$f":"VLOOKUP(H14,ledger,35,0)","v":4171},{"$f":"IFERROR(VLOOKUP(C29,codesub,2,0),\"SUB.CODE IS WRONG\")","v":"FINANCE (TH)"},null,3.75,{"$f":"VLOOKUP(H14,ledger,36,0)","v":"B+"},{"$f":"VLOOKUP(H14,ledger,37,0)","v":3.2},{"$f":"VLOOKUP(H14,ledger,40,0)","v":"*"}]
[null,null,{"$f":"C29+1","v":4172},"FINANCE (IN)",null,1.25,{"$f":"VLOOKUP(H14,ledger,38,0)","v":"ABS"},{"$f":"VLOOKUP(H14,ledger,39,0)","v":"ABS"}]
[null,null,"GRADE POINT AVERAGE (GPA) :",null,null,null,null,null,{"$f":"VLOOKUP(H14,ledger,41,0)","v":"-"}]
[null,null,"EXTRA CREDIT SUBJECT"]
[null,null,{"$f":"IFERROR(VLOOKUP(H14,ledger,42,0),\"\")","v":0},{"$f":"IFERROR(VLOOKUP(C33,codesub,2,0),\"SUB.CODE IS WRONG\")","v":"SUB.CODE IS WRONG"},null,null,{"$f":"VLOOKUP(H14,ledger,43,0)","v":"ABS"},{"$f":"VLOOKUP(H14,ledger,44,0)","v":"ABS"},{"$f":"VLOOKUP(H14,ledger,47,0)","v":""}]
[null,null,{"$f":"IFERROR(C33+1,\"\")","v":1},{"$f":"IFERROR(VLOOKUP(C34,codesub,2,0),\"SUB.CODE IS WRONG\")","v":"SUB.CODE IS WRONG"},null,null,{"$f":"VLOOKUP(H14,ledger,45,0)","v":"ABS"},{"$f":"VLOOKUP(H14,ledger,46,0)","v":"ABS"}]
[null,null,"PREPARED BY : …………………………"]
[null,null,"CHECKED BY : …………………………"]
[null,null,"DATE OF ISSUE     :",null,"2079.03.15",null,null,"HEAD TEACHER"]
[]
[null,null,"NOTE : ONE CREDIT HOUR EQUALS TO 32 WORKING HOURS"]
[null,null,"INTERNAL (IN) : THIS COVERS THE PARTICIPATION, PRACTICAL/PROJECT WORKS, COMMUNITY \n                                     WORKS, INTERNSHIP, PRESENTATIONS, TERMINAL EXAMINATIONS."]
[null,null,"THEORY (TH) :  THIS COVERS WRITTEN EXTERNAL EXAMINATION"]
[null,null,"ABS = ABSENT",null,null,null,"       ","W= WITHHELD"]

{"sheet":"std25","index":29,"n_rows":42,"n_cols":10,"rows_kept":42,"cut":false,"hidden":false,"merged":[[2,2,6,9],[11,2,11,4],[11,5,11,9],[12,7,12,8],[13,2,13,3],[13,5,13,6],[14,2,14,4],[14,5,14,6],[14,7,14,9],[16,2,17,2],[16,3,17,4],[16,5,17,5],[16,6,17,6],[16,7,17,7],[16,8,17,8],[16,9,17,9],[18,3,18,4],[18,8,19,8],[19,3,19,4],[20,3,20,4],[20,8,21,8],[21,3,21,4],[22,3,22,4],[22,8,23,8],[23,3,23,4],[24,3,24,4],[24,8,25,8],[25,3,25,4],[34,2,34,4],[26,3,26,4],[26,8,27,8],[27,3,27,4],[28,3,28,4],[28,8,29,8],[29,3,29,4],[30,2,30,7],[31,2,31,9],[32,3,32,4],[32,8,33,8],[33,3,33,4],[41,2,41,3],[41,7,41,8],[35,2,35,4],[36,2,36,3],[36,7,36,9],[38,2,38,6],[39,2,39,9],[40,2,40,6]]}
[]
[]
[]
[]
[]
[]
[]
[]
[]
[]
[]
[null,null,"THE GRADE(S) SECURED BY   :",null,null,{"$f":"IFERROR(VLOOKUP(H14,ledger,2,0),\"This Symbol No. is not in Grade Ledger\")","v":"SAUGAT SHRESTHA "}]
[null,null,"DATE OF BIRTH :",null,{"$f":"VLOOKUP(H14,ledger,3,0)","v":"2062-01-05"},"B.S.","       (",null,null,"A.D.)"]
[null,null,"REGISTRATION NO.",null,{"$f":"VLOOKUP(H14,ledger,4,0)","v":"801130210025"},"SYMBOL NO.",null,11301344,"GRADE","XI"]
[null,null,"IN THE EXAMINATION CONDUCTED IN ",null,null,"2080 B.S. (2022 A.D.)",null,"ARE GIVEN BELOW."]
[]
[null,null,"SUBJECT CODE","SUBJECTS",null,"CREDIT HOUR (CH)","GRADE","GARDE POINT (GP)","FINAL GRADE (FG) ","REMARKS"]
[]
[null,null,{"$f":"VLOOKUP(H14,ledger,5,0)","v":"0011"},{"$f":"IFERROR(VLOOKUP(C19,codesub,2,0),\"SUB.CODE IS WRONG\")","v":"COM. NEPALI (TH)"},null,2.25,{"$f":"VLOOKUP(H14,ledger,6,0)","v":"C+"},{"$f":"VLOOKUP(H14,ledger,7,0)","v":2.4},{"$f":"VLOOKUP(H14,ledger,10,0)","v":"C+"}]
[null,null,{"$f":"IF(C19=\"0011\",\"0012\",\"SORRY\")","v":"0012"},{"$f":"IF(C20=\"0012\",\"COM. NEPALI (IN)\",\"SUB.CODE IS WRONG\")","v":"COM. NEPALI (IN)"},null,0.75,{"$f":"VLOOKUP(H14,ledger,8,0)","v":"C"},{"$f":"VLOOKUP(H14,ledger,9,0)","v":2}]
[null,null,{"$f":"VLOOKUP(H14,ledger,11,0)","v":"0031"},{"$f":"IFERROR(VLOOKUP(C21,codesub,2,0),\"SUB.CODE IS WRONG\")","v":"COM. ENGLISH (TH)"},null,3,{"$f":"VLOOKUP(H14,ledger,12,0)","v":"C+"},{"$f":"VLOOKUP(H14,ledger,13,0)","v":2.4},{"$f":"VLOOKUP(H14,ledger,16,0)","v":"C+"}]
[null,null,{"$f":"IF(C21=\"0031\",\"0032\",\"SORRY\")","v":"0032"},{"$f":"IF(C22=\"0032\",\"COM. ENGLISH (IN)\",\"SUB.CODE IS WRONG\")","v":"COM. ENGLISH (IN)"},null,1,{"$f":"VLOOKUP(H14,ledger,14,0)","v":"C"},{"$f":"VLOOKUP(H14,ledger,15,0)","v":2}]
[null,null,{"$f":"VLOOKUP(H14,ledger,17,0)","v":"0051"},{"$f":"IF(C23=\"0051\",\"COM. SOCIAL STUDIES & LIFE SKILL (TH)\",IF(C23=\"0071\",\"COM. MATHEMATICS (TH)\",\"SUB.CODE IS WRONG\"))","v":"COM. SOCIAL STUDIES & LIFE SKILL (TH)"},null,3.75,{"$f":"VLOOKUP(H14,ledger,18,0)","v":"B+"},{"$f":"VLOOKUP(H14,ledger,19,0)","v":3.2},{"$f":"VLOOKUP(H14,ledger,22,0)","v":"A"},{"$f":"IF(OR($I$19=\"NG\",$I$21=\"NG\",$I$23=\"NG\",$I$25=\"NG\",$I$27=\"NG\",$I$29=\"NG\"),\"W\",\"\")","v":""}]
[null,null,{"$f":"IF(C23=\"0051\",\"0052\",IF(C23=\"0071\",\"0072\",\"SORRY\"))","v":"0052"},{"$f":"IF(C24=\"0052\",\"COM. SOCIAL STUDIES & LIFE SKILL (IN)\",IF(C24=\"0072\",\"COM. MATHEMATICS (IN)\",\"SUB.CODE IS WRONG\"))","v":"COM. SOCIAL STUDIES & LIFE SKILL (IN)"},null,1.25,{"$f":"VLOOKUP(H14,ledger,20,0)","v":"A"},{"$f":"VLOOKUP(H14,ledger,21,0)","v":3.6},null,{"$f":"IF(OR($I$19=\"ABS\",$I$21=\"ABS\",$I$23=\"ABS\",$I$25=\"ABS\",$I$27=\"ABS\",$I$29=\"ABS\"),\"ABS\",\"\")","v":""}]
[null,null,{"$f":"VLOOKUP(H14,ledger,23,0)","v":1031},{"$f":"IFERROR(VLOOKUP(C25,codesub,2,0),\"SUB.CODE IS WRONG\")","v":"ACCOUNTING (TH)"},null,3.75,{"$f":"VLOOKUP(H14,ledger,24,0)","v":"B"},{"$f":"VLOOKUP(H14,ledger,25,0)","v":2.8},{"$f":"VLOOKUP(H14,ledger,28,0)","v":"B+"}]
[null,null,{"$f":"C25+1","v":1032},"ACCOUNTING (IN)",null,1.25,{"$f":"VLOOKUP(H14,ledger,26,0)","v":"A"},{"$f":"VLOOKUP(H14,ledger,27,0)","v":3.6}]
[null,null,{"$f":"VLOOKUP(H14,ledger,29,0)","v":4251},"SINGING (TH)",null,3.75,{"$f":"VLOOKUP(H14,ledger,30,0)","v":"C"},{"$f":"VLOOKUP(H14,ledger,31,0)","v":2},{"$f":"VLOOKUP(H14,ledger,34,0)","v":"B"}]
[null,null,{"$f":"C27+1","v":4252},"SINGING (IN)",null,1.25,{"$f":"VLOOKUP(H14,ledger,32,0)","v":"A+"},{"$f":"VLOOKUP(H14,ledger,33,0)","v":4}]
[null,null,{"$f":"VLOOKUP(H14,ledger,35,0)","v":4171},{"$f":"IFERROR(VLOOKUP(C29,codesub,2,0),\"SUB.CODE IS WRONG\")","v":"FINANCE (TH)"},null,3.75,{"$f":"VLOOKUP(H14,ledger,36,0)","v":"C+"},{"$f":"VLOOKUP(H14,ledger,37,0)","v":2.4},{"$f":"VLOOKUP(H14,ledger,40,0)","v":"*"}]
[null,null,{"$f":"C29+1","v":4172},"FINANCE (IN)",null,1.25,{"$f":"VLOOKUP(H14,ledger,38,0)","v":"ABS"},{"$f":"VLOOKUP(H14,ledger,39,0)","v":"ABS"}]
[null,null,"GRADE POINT AVERAGE (GPA) :",null,null,null,null,null,{"$f":"VLOOKUP(H14,ledger,41,0)","v":"-"}]
[null,null,"EXTRA CREDIT SUBJECT"]
[null,null,{"$f":"IFERROR(VLOOKUP(H14,ledger,42,0),\"\")","v":0},{"$f":"IFERROR(VLOOKUP(C33,codesub,2,0),\"SUB.CODE IS WRONG\")","v":"SUB.CODE IS WRONG"},null,null,{"$f":"VLOOKUP(H14,ledger,43,0)","v":"ABS"},{"$f":"VLOOKUP(H14,ledger,44,0)","v":"ABS"},{"$f":"VLOOKUP(H14,ledger,47,0)","v":""}]
[null,null,{"$f":"IFERROR(C33+1,\"\")","v":1},{"$f":"IFERROR(VLOOKUP(C34,codesub,2,0),\"SUB.CODE IS WRONG\")","v":"SUB.CODE IS WRONG"},null,null,{"$f":"VLOOKUP(H14,ledger,45,0)","v":"ABS"},{"$f":"VLOOKUP(H14,ledger,46,0)","v":"ABS"}]
[null,null,"PREPARED BY : …………………………"]
[null,null,"CHECKED BY : …………………………"]
[null,null,"DATE OF ISSUE     :",null,"2079.03.15",null,null,"HEAD TEACHER"]
[]
[null,null,"NOTE : ONE CREDIT HOUR EQUALS TO 32 WORKING HOURS"]
[null,null,"INTERNAL (IN) : THIS COVERS THE PARTICIPATION, PRACTICAL/PROJECT WORKS, COMMUNITY \n                                     WORKS, INTERNSHIP, PRESENTATIONS, TERMINAL EXAMINATIONS."]
[null,null,"THEORY (TH) :  THIS COVERS WRITTEN EXTERNAL EXAMINATION"]
[null,null,"ABS = ABSENT",null,null,null,"       ","W= WITHHELD"]

{"sheet":"std26","index":30,"n_rows":42,"n_cols":10,"rows_kept":42,"cut":false,"hidden":false,"merged":[[2,2,6,9],[11,2,11,4],[11,5,11,9],[12,7,12,8],[13,2,13,3],[13,5,13,6],[14,2,14,4],[14,5,14,6],[14,7,14,9],[16,2,17,2],[16,3,17,4],[16,5,17,5],[16,6,17,6],[16,7,17,7],[16,8,17,8],[16,9,17,9],[18,3,18,4],[18,8,19,8],[19,3,19,4],[20,3,20,4],[20,8,21,8],[21,3,21,4],[22,3,22,4],[22,8,23,8],[23,3,23,4],[24,3,24,4],[24,8,25,8],[25,3,25,4],[34,2,34,4],[26,3,26,4],[26,8,27,8],[27,3,27,4],[28,3,28,4],[28,8,29,8],[29,3,29,4],[30,2,30,7],[31,2,31,9],[32,3,32,4],[32,8,33,8],[33,3,33,4],[41,2,41,3],[41,7,41,8],[35,2,35,4],[36,2,36,3],[36,7,36,9],[38,2,38,6],[39,2,39,9],[40,2,40,6]]}
[]
[]
[]
[]
[]
[]
[]
[]
[]
[]
[]
[null,null,"THE GRADE(S) SECURED BY   :",null,null,{"$f":"IFERROR(VLOOKUP(H14,ledger,2,0),\"This Symbol No. is not in Grade Ledger\")","v":"SIKSHA RAI "}]
[null,null,"DATE OF BIRTH :",null,{"$f":"VLOOKUP(H14,ledger,3,0)","v":"2064-03-21"},"B.S.","       (",null,null,"A.D.)"]
[null,null,"REGISTRATION NO.",null,{"$f":"VLOOKUP(H14,ledger,4,0)","v":"801130210026"},"SYMBOL NO.",null,11301345,"GRADE","XI"]
[null,null,"IN THE EXAMINATION CONDUCTED IN ",null,null,"2080 B.S. (2022 A.D.)",null,"ARE GIVEN BELOW."]
[]
[null,null,"SUBJECT CODE","SUBJECTS",null,"CREDIT HOUR (CH)","GRADE","GARDE POINT (GP)","FINAL GRADE (FG) ","REMARKS"]
[]
[null,null,{"$f":"VLOOKUP(H14,ledger,5,0)","v":"0011"},{"$f":"IFERROR(VLOOKUP(C19,codesub,2,0),\"SUB.CODE IS WRONG\")","v":"COM. NEPALI (TH)"},null,2.25,{"$f":"VLOOKUP(H14,ledger,6,0)","v":"B"},{"$f":"VLOOKUP(H14,ledger,7,0)","v":2.8},{"$f":"VLOOKUP(H14,ledger,10,0)","v":"B"}]
[null,null,{"$f":"IF(C19=\"0011\",\"0012\",\"SORRY\")","v":"0012"},{"$f":"IF(C20=\"0012\",\"COM. NEPALI (IN)\",\"SUB.CODE IS WRONG\")","v":"COM. NEPALI (IN)"},null,0.75,{"$f":"VLOOKUP(H14,ledger,8,0)","v":"C+"},{"$f":"VLOOKUP(H14,ledger,9,0)","v":2.4}]
[null,null,{"$f":"VLOOKUP(H14,ledger,11,0)","v":"0031"},{"$f":"IFERROR(VLOOKUP(C21,codesub,2,0),\"SUB.CODE IS WRONG\")","v":"COM. ENGLISH (TH)"},null,3,{"$f":"VLOOKUP(H14,ledger,12,0)","v":"B"},{"$f":"VLOOKUP(H14,ledger,13,0)","v":2.8},{"$f":"VLOOKUP(H14,ledger,16,0)","v":"B"}]
[null,null,{"$f":"IF(C21=\"0031\",\"0032\",\"SORRY\")","v":"0032"},{"$f":"IF(C22=\"0032\",\"COM. ENGLISH (IN)\",\"SUB.CODE IS WRONG\")","v":"COM. ENGLISH (IN)"},null,1,{"$f":"VLOOKUP(H14,ledger,14,0)","v":"C+"},{"$f":"VLOOKUP(H14,ledger,15,0)","v":2.4}]
[null,null,{"$f":"VLOOKUP(H14,ledger,17,0)","v":"0051"},{"$f":"IF(C23=\"0051\",\"COM. SOCIAL STUDIES & LIFE SKILL (TH)\",IF(C23=\"0071\",\"COM. MATHEMATICS (TH)\",\"SUB.CODE IS WRONG\"))","v":"COM. SOCIAL STUDIES & LIFE SKILL (TH)"},null,3.75,{"$f":"VLOOKUP(H14,ledger,18,0)","v":"A+"},{"$f":"VLOOKUP(H14,ledger,19,0)","v":4},{"$f":"VLOOKUP(H14,ledger,22,0)","v":"A+"},{"$f":"IF(OR($I$19=\"NG\",$I$21=\"NG\",$I$23=\"NG\",$I$25=\"NG\",$I$27=\"NG\",$I$29=\"NG\"),\"W\",\"\")","v":""}]
[null,null,{"$f":"IF(C23=\"0051\",\"0052\",IF(C23=\"0071\",\"0072\",\"SORRY\"))","v":"0052"},{"$f":"IF(C24=\"0052\",\"COM. SOCIAL STUDIES & LIFE SKILL (IN)\",IF(C24=\"0072\",\"COM. MATHEMATICS (IN)\",\"SUB.CODE IS WRONG\"))","v":"COM. SOCIAL STUDIES & LIFE SKILL (IN)"},null,1.25,{"$f":"VLOOKUP(H14,ledger,20,0)","v":"A+"},{"$f":"VLOOKUP(H14,ledger,21,0)","v":4},null,{"$f":"IF(OR($I$19=\"ABS\",$I$21=\"ABS\",$I$23=\"ABS\",$I$25=\"ABS\",$I$27=\"ABS\",$I$29=\"ABS\"),\"ABS\",\"\")","v":""}]
[null,null,{"$f":"VLOOKUP(H14,ledger,23,0)","v":1031},{"$f":"IFERROR(VLOOKUP(C25,codesub,2,0),\"SUB.CODE IS WRONG\")","v":"ACCOUNTING (TH)"},null,3.75,{"$f":"VLOOKUP(H14,ledger,24,0)","v":"A+"},{"$f":"VLOOKUP(H14,ledger,25,0)","v":4},{"$f":"VLOOKUP(H14,ledger,28,0)","v":"A+"}]
[null,null,{"$f":"C25+1","v":1032},"ACCOUNTING (IN)",null,1.25,{"$f":"VLOOKUP(H14,ledger,26,0)","v":"A+"},{"$f":"VLOOKUP(H14,ledger,27,0)","v":4}]
[null,null,{"$f":"VLOOKUP(H14,ledger,29,0)","v":4251},"SINGING (TH)",null,3.75,{"$f":"VLOOKUP(H14,ledger,30,0)","v":"C+"},{"$f":"VLOOKUP(H14,ledger,31,0)","v":2.4},{"$f":"VLOOKUP(H14,ledger,34,0)","v":"B"}]
[null,null,{"$f":"C27+1","v":4252},"SINGING (IN)",null,1.25,{"$f":"VLOOKUP(H14,ledger,32,0)","v":"A+"},{"$f":"VLOOKUP(H14,ledger,33,0)","v":4}]
[null,null,{"$f":"VLOOKUP(H14,ledger,35,0)","v":4051},{"$f":"IFERROR(VLOOKUP(C29,codesub,2,0),\"SUB.CODE IS WRONG\")","v":"BUSINESS MATHEMATICS (TH)"},null,3.75,{"$f":"VLOOKUP(H14,ledger,36,0)","v":"A+"},{"$f":"VLOOKUP(H14,ledger,37,0)","v":4},{"$f":"VLOOKUP(H14,ledger,40,0)","v":"*"}]
[null,null,{"$f":"C29+1","v":4052},"BUSINESS MATHEMATICS (IN)",null,1.25,{"$f":"VLOOKUP(H14,ledger,38,0)","v":"ABS"},{"$f":"VLOOKUP(H14,ledger,39,0)","v":"ABS"}]
[null,null,"GRADE POINT AVERAGE (GPA) :",null,null,null,null,null,{"$f":"VLOOKUP(H14,ledger,41,0)","v":"-"}]
[null,null,"EXTRA CREDIT SUBJECT"]
[null,null,{"$f":"IFERROR(VLOOKUP(H14,ledger,42,0),\"\")","v":0},{"$f":"IFERROR(VLOOKUP(C33,codesub,2,0),\"SUB.CODE IS WRONG\")","v":"SUB.CODE IS WRONG"},null,null,{"$f":"VLOOKUP(H14,ledger,43,0)","v":"ABS"},{"$f":"VLOOKUP(H14,ledger,44,0)","v":"ABS"},{"$f":"VLOOKUP(H14,ledger,47,0)","v":""}]
[null,null,{"$f":"IFERROR(C33+1,\"\")","v":1},{"$f":"IFERROR(VLOOKUP(C34,codesub,2,0),\"SUB.CODE IS WRONG\")","v":"SUB.CODE IS WRONG"},null,null,{"$f":"VLOOKUP(H14,ledger,45,0)","v":"ABS"},{"$f":"VLOOKUP(H14,ledger,46,0)","v":"ABS"}]
[null,null,"PREPARED BY : …………………………"]
[null,null,"CHECKED BY : …………………………"]
[null,null,"DATE OF ISSUE     :",null,"2079.03.15",null,null,"HEAD TEACHER"]
[]
[null,null,"NOTE : ONE CREDIT HOUR EQUALS TO 32 WORKING HOURS"]
[null,null,"INTERNAL (IN) : THIS COVERS THE PARTICIPATION, PRACTICAL/PROJECT WORKS, COMMUNITY \n                                     WORKS, INTERNSHIP, PRESENTATIONS, TERMINAL EXAMINATIONS."]
[null,null,"THEORY (TH) :  THIS COVERS WRITTEN EXTERNAL EXAMINATION"]
[null,null,"ABS = ABSENT",null,null,null,"       ","W= WITHHELD"]

{"sheet":"OUTPUT_1 (2)","index":31,"n_rows":42,"n_cols":10,"rows_kept":42,"cut":false,"hidden":false,"merged":[[2,2,6,9],[11,2,11,4],[11,5,11,9],[12,7,12,8],[13,2,13,3],[13,5,13,6],[14,2,14,4],[14,5,14,6],[14,7,14,9],[16,2,17,2],[16,3,17,4],[16,5,17,5],[16,6,17,6],[16,7,17,7],[16,8,17,8],[16,9,17,9],[18,3,18,4],[18,8,19,8],[19,3,19,4],[20,3,20,4],[20,8,21,8],[21,3,21,4],[22,3,22,4],[22,8,23,8],[23,3,23,4],[24,3,24,4],[24,8,25,8],[25,3,25,4],[34,2,34,4],[26,3,26,4],[26,8,27,8],[27,3,27,4],[28,3,28,4],[28,8,29,8],[29,3,29,4],[30,2,30,7],[31,2,31,9],[32,3,32,4],[32,8,33,8],[33,3,33,4],[41,2,41,3],[41,7,41,8],[35,2,35,4],[36,2,36,3],[36,7,36,9],[38,2,38,6],[39,2,39,9],[40,2,40,6]]}
[]
[]
[]
[]
[]
[]
[]
[]
[]
[]
[]
[null,null,"THE GRADE(S) SECURED BY   :",null,null,{"$f":"IFERROR(VLOOKUP(H14,ledger,2,0),\"This Symbol No. is not in Grade Ledger\")","v":"ALISHA KARKI "}]
[null,null,"DATE OF BIRTH :",null,{"$f":"VLOOKUP(H14,ledger,3,0)","v":"4/31/2063"},"B.S.","       (",null,null,"A.D.)"]
[null,null,"REGISTRATION NO.",null,{"$f":"VLOOKUP(H14,ledger,4,0)","v":"801130210001"},"SYMBOL NO.",null,11301320,"GRADE","XI"]
[null,null,"IN THE EXAMINATION CONDUCTED IN ",null,null,"2080 B.S. (2022 A.D.)",null,"ARE GIVEN BELOW."]
[]
[null,null,"SUBJECT CODE","SUBJECTS",null,"CREDIT HOUR (CH)","GRADE","GARDE POINT (GP)","FINAL GRADE (FG) ","REMARKS"]
[]
[null,null,{"$f":"VLOOKUP(H14,ledger,5,0)","v":"0011"},{"$f":"IFERROR(VLOOKUP(C19,codesub,2,0),\"SUB.CODE IS WRONG\")","v":"COM. NEPALI (TH)"},null,2.25,{"$f":"VLOOKUP(H14,ledger,6,0)","v":"C+"},{"$f":"VLOOKUP(H14,ledger,7,0)","v":2.4},{"$f":"VLOOKUP(H14,ledger,10,0)","v":"C+"}]
[null,null,{"$f":"IF(C19=\"0011\",\"0012\",\"SORRY\")","v":"0012"},{"$f":"IF(C20=\"0012\",\"COM. NEPALI (IN)\",\"SUB.CODE IS WRONG\")","v":"COM. NEPALI (IN)"},null,0.75,{"$f":"VLOOKUP(H14,ledger,8,0)","v":"C"},{"$f":"VLOOKUP(H14,ledger,9,0)","v":2}]
[null,null,{"$f":"VLOOKUP(H14,ledger,11,0)","v":"0031"},{"$f":"IFERROR(VLOOKUP(C21,codesub,2,0),\"SUB.CODE IS WRONG\")","v":"COM. ENGLISH (TH)"},null,3,{"$f":"VLOOKUP(H14,ledger,12,0)","v":"C+"},{"$f":"VLOOKUP(H14,ledger,13,0)","v":2.4},{"$f":"VLOOKUP(H14,ledger,16,0)","v":"C+"}]
[null,null,{"$f":"IF(C21=\"0031\",\"0032\",\"SORRY\")","v":"0032"},{"$f":"IF(C22=\"0032\",\"COM. ENGLISH (IN)\",\"SUB.CODE IS WRONG\")","v":"COM. ENGLISH (IN)"},null,1,{"$f":"VLOOKUP(H14,ledger,14,0)","v":"C"},{"$f":"VLOOKUP(H14,ledger,15,0)","v":2}]
[null,null,{"$f":"VLOOKUP(H14,ledger,17,0)","v":"0051"},{"$f":"IF(C23=\"0051\",\"COM. SOCIAL STUDIES & LIFE SKILL (TH)\",IF(C23=\"0071\",\"COM. MATHEMATICS (TH)\",\"SUB.CODE IS WRONG\"))","v":"COM. SOCIAL STUDIES & LIFE SKILL (TH)"},null,3.75,{"$f":"VLOOKUP(H14,ledger,18,0)","v":"C+"},{"$f":"VLOOKUP(H14,ledger,19,0)","v":2.4},{"$f":"VLOOKUP(H14,ledger,22,0)","v":"B"},{"$f":"IF(OR($I$19=\"NG\",$I$21=\"NG\",$I$23=\"NG\",$I$25=\"NG\",$I$27=\"NG\",$I$29=\"NG\"),\"W\",\"\")","v":""}]
[null,null,{"$f":"IF(C23=\"0051\",\"0052\",IF(C23=\"0071\",\"0072\",\"SORRY\"))","v":"0052"},{"$f":"IF(C24=\"0052\",\"COM. SOCIAL STUDIES & LIFE SKILL (IN)\",IF(C24=\"0072\",\"COM. MATHEMATICS (IN)\",\"SUB.CODE IS WRONG\"))","v":"COM. SOCIAL STUDIES & LIFE SKILL (IN)"},null,1.25,{"$f":"VLOOKUP(H14,ledger,20,0)","v":"A"},{"$f":"VLOOKUP(H14,ledger,21,0)","v":3.6},null,{"$f":"IF(OR($I$19=\"ABS\",$I$21=\"ABS\",$I$23=\"ABS\",$I$25=\"ABS\",$I$27=\"ABS\",$I$29=\"ABS\"),\"ABS\",\"\")","v":""}]
[null,null,{"$f":"VLOOKUP(H14,ledger,23,0)","v":1031},{"$f":"IFERROR(VLOOKUP(C25,codesub,2,0),\"SUB.CODE IS WRONG\")","v":"ACCOUNTING (TH)"},null,3.75,{"$f":"VLOOKUP(H14,ledger,24,0)","v":"A"},{"$f":"VLOOKUP(H14,ledger,25,0)","v":3.6},{"$f":"VLOOKUP(H14,ledger,28,0)","v":"A+"}]
[null,null,{"$f":"C25+1","v":1032},"ACCOUNTING (IN)",null,1.25,{"$f":"VLOOKUP(H14,ledger,26,0)","v":"A+"},{"$f":"VLOOKUP(H14,ledger,27,0)","v":4}]
[null,null,{"$f":"VLOOKUP(H14,ledger,29,0)","v":4251},"SINGING (TH)",null,3.75,{"$f":"VLOOKUP(H14,ledger,30,0)","v":"C"},{"$f":"VLOOKUP(H14,ledger,31,0)","v":2},{"$f":"VLOOKUP(H14,ledger,34,0)","v":"B"}]
[null,null,{"$f":"C27+1","v":4252},"SINGING (IN)",null,1.25,{"$f":"VLOOKUP(H14,ledger,32,0)","v":"A+"},{"$f":"VLOOKUP(H14,ledger,33,0)","v":4}]
[null,null,{"$f":"VLOOKUP(H14,ledger,35,0)","v":4171},{"$f":"IFERROR(VLOOKUP(C29,codesub,2,0),\"SUB.CODE IS WRONG\")","v":"FINANCE (TH)"},null,3.75,{"$f":"VLOOKUP(H14,ledger,36,0)","v":"B"},{"$f":"VLOOKUP(H14,ledger,37,0)","v":2.8},{"$f":"VLOOKUP(H14,ledger,40,0)","v":"B+"}]
[null,null,{"$f":"C29+1","v":4172},"FINANCE (IN)",null,1.25,{"$f":"VLOOKUP(H14,ledger,38,0)","v":"A"},{"$f":"VLOOKUP(H14,ledger,39,0)","v":3.6}]
[null,null,"GRADE POINT AVERAGE (GPA) :",null,null,null,null,null,{"$f":"VLOOKUP(H14,ledger,41,0)","v":2.8}]
[null,null,"EXTRA CREDIT SUBJECT"]
[null,null,{"$f":"IFERROR(VLOOKUP(H14,ledger,42,0),\"\")","v":0},{"$f":"IFERROR(VLOOKUP(C33,codesub,2,0),\"SUB.CODE IS WRONG\")","v":"SUB.CODE IS WRONG"},null,null,{"$f":"VLOOKUP(H14,ledger,43,0)","v":"ABS"},{"$f":"VLOOKUP(H14,ledger,44,0)","v":"ABS"},{"$f":"VLOOKUP(H14,ledger,47,0)","v":""}]
[null,null,{"$f":"IFERROR(C33+1,\"\")","v":1},{"$f":"IFERROR(VLOOKUP(C34,codesub,2,0),\"SUB.CODE IS WRONG\")","v":"SUB.CODE IS WRONG"},null,null,{"$f":"VLOOKUP(H14,ledger,45,0)","v":"ABS"},{"$f":"VLOOKUP(H14,ledger,46,0)","v":"ABS"}]
[null,null,"PREPARED BY : …………………………"]
[null,null,"CHECKED BY : …………………………"]
[null,null,"DATE OF ISSUE     :",null,"2079.03.15",null,null,"HEAD TEACHER"]
[]
[null,null,"NOTE : ONE CREDIT HOUR EQUALS TO 32 WORKING HOURS"]
[null,null,"INTERNAL (IN) : THIS COVERS THE PARTICIPATION, PRACTICAL/PROJECT WORKS, COMMUNITY \n                                     WORKS, INTERNSHIP, PRESENTATIONS, TERMINAL EXAMINATIONS."]
[null,null,"THEORY (TH) :  THIS COVERS WRITTEN EXTERNAL EXAMINATION"]
[null,null,"ABS = ABSENT",null,null,null,"       ","W= WITHHELD"]

{"sheet":"OUTPUT_1 (3)","index":32,"n_rows":42,"n_cols":10,"rows_kept":42,"cut":false,"hidden":false,"merged":[[2,2,6,9],[11,2,11,4],[11,5,11,9],[12,7,12,8],[13,2,13,3],[13,5,13,6],[14,2,14,4],[14,5,14,6],[14,7,14,9],[16,2,17,2],[16,3,17,4],[16,5,17,5],[16,6,17,6],[16,7,17,7],[16,8,17,8],[16,9,17,9],[18,3,18,4],[18,8,19,8],[19,3,19,4],[20,3,20,4],[20,8,21,8],[21,3,21,4],[22,3,22,4],[22,8,23,8],[23,3,23,4],[24,3,24,4],[24,8,25,8],[25,3,25,4],[34,2,34,4],[26,3,26,4],[26,8,27,8],[27,3,27,4],[28,3,28,4],[28,8,29,8],[29,3,29,4],[30,2,30,7],[31,2,31,9],[32,3,32,4],[32,8,33,8],[33,3,33,4],[41,2,41,3],[41,7,41,8],[35,2,35,4],[36,2,36,3],[36,7,36,9],[38,2,38,6],[39,2,39,9],[40,2,40,6]]}
[]
[]
[]
[]
[]
[]
[]
[]
[]
[]
[]
[null,null,"THE GRADE(S) SECURED BY   :",null,null,{"$f":"IFERROR(VLOOKUP(H14,ledger,2,0),\"This Symbol No. is not in Grade Ledger\")","v":"ALISHA KARKI "}]
[null,null,"DATE OF BIRTH :",null,{"$f":"VLOOKUP(H14,ledger,3,0)","v":"4/31/2063"},"B.S.","       (",null,null,"A.D.)"]
[null,null,"REGISTRATION NO.",null,{"$f":"VLOOKUP(H14,ledger,4,0)","v":"801130210001"},"SYMBOL NO.",null,11301320,"GRADE","XI"]
[null,null,"IN THE EXAMINATION CONDUCTED IN ",null,null,"2080 B.S. (2022 A.D.)",null,"ARE GIVEN BELOW."]
[]
[null,null,"SUBJECT CODE","SUBJECTS",null,"CREDIT HOUR (CH)","GRADE","GARDE POINT (GP)","FINAL GRADE (FG) ","REMARKS"]
[]
[null,null,{"$f":"VLOOKUP(H14,ledger,5,0)","v":"0011"},{"$f":"IFERROR(VLOOKUP(C19,codesub,2,0),\"SUB.CODE IS WRONG\")","v":"COM. NEPALI (TH)"},null,2.25,{"$f":"VLOOKUP(H14,ledger,6,0)","v":"C+"},{"$f":"VLOOKUP(H14,ledger,7,0)","v":2.4},{"$f":"VLOOKUP(H14,ledger,10,0)","v":"C+"}]
[null,null,{"$f":"IF(C19=\"0011\",\"0012\",\"SORRY\")","v":"0012"},{"$f":"IF(C20=\"0012\",\"COM. NEPALI (IN)\",\"SUB.CODE IS WRONG\")","v":"COM. NEPALI (IN)"},null,0.75,{"$f":"VLOOKUP(H14,ledger,8,0)","v":"C"},{"$f":"VLOOKUP(H14,ledger,9,0)","v":2}]
[null,null,{"$f":"VLOOKUP(H14,ledger,11,0)","v":"0031"},{"$f":"IFERROR(VLOOKUP(C21,codesub,2,0),\"SUB.CODE IS WRONG\")","v":"COM. ENGLISH (TH)"},null,3,{"$f":"VLOOKUP(H14,ledger,12,0)","v":"C+"},{"$f":"VLOOKUP(H14,ledger,13,0)","v":2.4},{"$f":"VLOOKUP(H14,ledger,16,0)","v":"C+"}]
[null,null,{"$f":"IF(C21=\"0031\",\"0032\",\"SORRY\")","v":"0032"},{"$f":"IF(C22=\"0032\",\"COM. ENGLISH (IN)\",\"SUB.CODE IS WRONG\")","v":"COM. ENGLISH (IN)"},null,1,{"$f":"VLOOKUP(H14,ledger,14,0)","v":"C"},{"$f":"VLOOKUP(H14,ledger,15,0)","v":2}]
[null,null,{"$f":"VLOOKUP(H14,ledger,17,0)","v":"0051"},{"$f":"IF(C23=\"0051\",\"COM. SOCIAL STUDIES & LIFE SKILL (TH)\",IF(C23=\"0071\",\"COM. MATHEMATICS (TH)\",\"SUB.CODE IS WRONG\"))","v":"COM. SOCIAL STUDIES & LIFE SKILL (TH)"},null,3.75,{"$f":"VLOOKUP(H14,ledger,18,0)","v":"C+"},{"$f":"VLOOKUP(H14,ledger,19,0)","v":2.4},{"$f":"VLOOKUP(H14,ledger,22,0)","v":"B"},{"$f":"IF(OR($I$19=\"NG\",$I$21=\"NG\",$I$23=\"NG\",$I$25=\"NG\",$I$27=\"NG\",$I$29=\"NG\"),\"W\",\"\")","v":""}]
[null,null,{"$f":"IF(C23=\"0051\",\"0052\",IF(C23=\"0071\",\"0072\",\"SORRY\"))","v":"0052"},{"$f":"IF(C24=\"0052\",\"COM. SOCIAL STUDIES & LIFE SKILL (IN)\",IF(C24=\"0072\",\"COM. MATHEMATICS (IN)\",\"SUB.CODE IS WRONG\"))","v":"COM. SOCIAL STUDIES & LIFE SKILL (IN)"},null,1.25,{"$f":"VLOOKUP(H14,ledger,20,0)","v":"A"},{"$f":"VLOOKUP(H14,ledger,21,0)","v":3.6},null,{"$f":"IF(OR($I$19=\"ABS\",$I$21=\"ABS\",$I$23=\"ABS\",$I$25=\"ABS\",$I$27=\"ABS\",$I$29=\"ABS\"),\"ABS\",\"\")","v":""}]
[null,null,{"$f":"VLOOKUP(H14,ledger,23,0)","v":1031},{"$f":"IFERROR(VLOOKUP(C25,codesub,2,0),\"SUB.CODE IS WRONG\")","v":"ACCOUNTING (TH)"},null,3.75,{"$f":"VLOOKUP(H14,ledger,24,0)","v":"A"},{"$f":"VLOOKUP(H14,ledger,25,0)","v":3.6},{"$f":"VLOOKUP(H14,ledger,28,0)","v":"A+"}]
[null,null,{"$f":"C25+1","v":1032},"ACCOUNTING (IN)",null,1.25,{"$f":"VLOOKUP(H14,ledger,26,0)","v":"A+"},{"$f":"VLOOKUP(H14,ledger,27,0)","v":4}]
[null,null,{"$f":"VLOOKUP(H14,ledger,29,0)","v":4251},"SINGING (TH)",null,3.75,{"$f":"VLOOKUP(H14,ledger,30,0)","v":"C"},{"$f":"VLOOKUP(H14,ledger,31,0)","v":2},{"$f":"VLOOKUP(H14,ledger,34,0)","v":"B"}]
[null,null,{"$f":"C27+1","v":4252},"SINGING (IN)",null,1.25,{"$f":"VLOOKUP(H14,ledger,32,0)","v":"A+"},{"$f":"VLOOKUP(H14,ledger,33,0)","v":4}]
[null,null,{"$f":"VLOOKUP(H14,ledger,35,0)","v":4171},{"$f":"IFERROR(VLOOKUP(C29,codesub,2,0),\"SUB.CODE IS WRONG\")","v":"FINANCE (TH)"},null,3.75,{"$f":"VLOOKUP(H14,ledger,36,0)","v":"B"},{"$f":"VLOOKUP(H14,ledger,37,0)","v":2.8},{"$f":"VLOOKUP(H14,ledger,40,0)","v":"B+"}]
[null,null,{"$f":"C29+1","v":4172},"FINANCE (IN)",null,1.25,{"$f":"VLOOKUP(H14,ledger,38,0)","v":"A"},{"$f":"VLOOKUP(H14,ledger,39,0)","v":3.6}]
[null,null,"GRADE POINT AVERAGE (GPA) :",null,null,null,null,null,{"$f":"VLOOKUP(H14,ledger,41,0)","v":2.8}]
[null,null,"EXTRA CREDIT SUBJECT"]
[null,null,{"$f":"IFERROR(VLOOKUP(H14,ledger,42,0),\"\")","v":0},{"$f":"IFERROR(VLOOKUP(C33,codesub,2,0),\"SUB.CODE IS WRONG\")","v":"SUB.CODE IS WRONG"},null,null,{"$f":"VLOOKUP(H14,ledger,43,0)","v":"ABS"},{"$f":"VLOOKUP(H14,ledger,44,0)","v":"ABS"},{"$f":"VLOOKUP(H14,ledger,47,0)","v":""}]
[null,null,{"$f":"IFERROR(C33+1,\"\")","v":1},{"$f":"IFERROR(VLOOKUP(C34,codesub,2,0),\"SUB.CODE IS WRONG\")","v":"SUB.CODE IS WRONG"},null,null,{"$f":"VLOOKUP(H14,ledger,45,0)","v":"ABS"},{"$f":"VLOOKUP(H14,ledger,46,0)","v":"ABS"}]
[null,null,"PREPARED BY : …………………………"]
[null,null,"CHECKED BY : …………………………"]
[null,null,"DATE OF ISSUE     :",null,"2079.03.15",null,null,"HEAD TEACHER"]
[]
[null,null,"NOTE : ONE CREDIT HOUR EQUALS TO 32 WORKING HOURS"]
[null,null,"INTERNAL (IN) : THIS COVERS THE PARTICIPATION, PRACTICAL/PROJECT WORKS, COMMUNITY \n                                     WORKS, INTERNSHIP, PRESENTATIONS, TERMINAL EXAMINATIONS."]
[null,null,"THEORY (TH) :  THIS COVERS WRITTEN EXTERNAL EXAMINATION"]
[null,null,"ABS = ABSENT",null,null,null,"       ","W= WITHHELD"]

{"sheet":"OUTPUT_1 (4)","index":33,"n_rows":42,"n_cols":10,"rows_kept":42,"cut":false,"hidden":false,"merged":[[2,2,6,9],[11,2,11,4],[11,5,11,9],[12,7,12,8],[13,2,13,3],[13,5,13,6],[14,2,14,4],[14,5,14,6],[14,7,14,9],[16,2,17,2],[16,3,17,4],[16,5,17,5],[16,6,17,6],[16,7,17,7],[16,8,17,8],[16,9,17,9],[18,3,18,4],[18,8,19,8],[19,3,19,4],[20,3,20,4],[20,8,21,8],[21,3,21,4],[22,3,22,4],[22,8,23,8],[23,3,23,4],[24,3,24,4],[24,8,25,8],[25,3,25,4],[34,2,34,4],[26,3,26,4],[26,8,27,8],[27,3,27,4],[28,3,28,4],[28,8,29,8],[29,3,29,4],[30,2,30,7],[31,2,31,9],[32,3,32,4],[32,8,33,8],[33,3,33,4],[41,2,41,3],[41,7,41,8],[35,2,35,4],[36,2,36,3],[36,7,36,9],[38,2,38,6],[39,2,39,9],[40,2,40,6]]}
[]
[]
[]
[]
[]
[]
[]
[]
[]
[]
[]
[null,null,"THE GRADE(S) SECURED BY   :",null,null,{"$f":"IFERROR(VLOOKUP(H14,ledger,2,0),\"This Symbol No. is not in Grade Ledger\")","v":"ALISHA KARKI "}]
[null,null,"DATE OF BIRTH :",null,{"$f":"VLOOKUP(H14,ledger,3,0)","v":"4/31/2063"},"B.S.","       (",null,null,"A.D.)"]
[null,null,"REGISTRATION NO.",null,{"$f":"VLOOKUP(H14,ledger,4,0)","v":"801130210001"},"SYMBOL NO.",null,11301320,"GRADE","XI"]
[null,null,"IN THE EXAMINATION CONDUCTED IN ",null,null,"2080 B.S. (2022 A.D.)",null,"ARE GIVEN BELOW."]
[]
[null,null,"SUBJECT CODE","SUBJECTS",null,"CREDIT HOUR (CH)","GRADE","GARDE POINT (GP)","FINAL GRADE (FG) ","REMARKS"]
[]
[null,null,{"$f":"VLOOKUP(H14,ledger,5,0)","v":"0011"},{"$f":"IFERROR(VLOOKUP(C19,codesub,2,0),\"SUB.CODE IS WRONG\")","v":"COM. NEPALI (TH)"},null,2.25,{"$f":"VLOOKUP(H14,ledger,6,0)","v":"C+"},{"$f":"VLOOKUP(H14,ledger,7,0)","v":2.4},{"$f":"VLOOKUP(H14,ledger,10,0)","v":"C+"}]
[null,null,{"$f":"IF(C19=\"0011\",\"0012\",\"SORRY\")","v":"0012"},{"$f":"IF(C20=\"0012\",\"COM. NEPALI (IN)\",\"SUB.CODE IS WRONG\")","v":"COM. NEPALI (IN)"},null,0.75,{"$f":"VLOOKUP(H14,ledger,8,0)","v":"C"},{"$f":"VLOOKUP(H14,ledger,9,0)","v":2}]
[null,null,{"$f":"VLOOKUP(H14,ledger,11,0)","v":"0031"},{"$f":"IFERROR(VLOOKUP(C21,codesub,2,0),\"SUB.CODE IS WRONG\")","v":"COM. ENGLISH (TH)"},null,3,{"$f":"VLOOKUP(H14,ledger,12,0)","v":"C+"},{"$f":"VLOOKUP(H14,ledger,13,0)","v":2.4},{"$f":"VLOOKUP(H14,ledger,16,0)","v":"C+"}]
[null,null,{"$f":"IF(C21=\"0031\",\"0032\",\"SORRY\")","v":"0032"},{"$f":"IF(C22=\"0032\",\"COM. ENGLISH (IN)\",\"SUB.CODE IS WRONG\")","v":"COM. ENGLISH (IN)"},null,1,{"$f":"VLOOKUP(H14,ledger,14,0)","v":"C"},{"$f":"VLOOKUP(H14,ledger,15,0)","v":2}]
[null,null,{"$f":"VLOOKUP(H14,ledger,17,0)","v":"0051"},{"$f":"IF(C23=\"0051\",\"COM. SOCIAL STUDIES & LIFE SKILL (TH)\",IF(C23=\"0071\",\"COM. MATHEMATICS (TH)\",\"SUB.CODE IS WRONG\"))","v":"COM. SOCIAL STUDIES & LIFE SKILL (TH)"},null,3.75,{"$f":"VLOOKUP(H14,ledger,18,0)","v":"C+"},{"$f":"VLOOKUP(H14,ledger,19,0)","v":2.4},{"$f":"VLOOKUP(H14,ledger,22,0)","v":"B"},{"$f":"IF(OR($I$19=\"NG\",$I$21=\"NG\",$I$23=\"NG\",$I$25=\"NG\",$I$27=\"NG\",$I$29=\"NG\"),\"W\",\"\")","v":""}]
[null,null,{"$f":"IF(C23=\"0051\",\"0052\",IF(C23=\"0071\",\"0072\",\"SORRY\"))","v":"0052"},{"$f":"IF(C24=\"0052\",\"COM. SOCIAL STUDIES & LIFE SKILL (IN)\",IF(C24=\"0072\",\"COM. MATHEMATICS (IN)\",\"SUB.CODE IS WRONG\"))","v":"COM. SOCIAL STUDIES & LIFE SKILL (IN)"},null,1.25,{"$f":"VLOOKUP(H14,ledger,20,0)","v":"A"},{"$f":"VLOOKUP(H14,ledger,21,0)","v":3.6},null,{"$f":"IF(OR($I$19=\"ABS\",$I$21=\"ABS\",$I$23=\"ABS\",$I$25=\"ABS\",$I$27=\"ABS\",$I$29=\"ABS\"),\"ABS\",\"\")","v":""}]
[null,null,{"$f":"VLOOKUP(H14,ledger,23,0)","v":1031},{"$f":"IFERROR(VLOOKUP(C25,codesub,2,0),\"SUB.CODE IS WRONG\")","v":"ACCOUNTING (TH)"},null,3.75,{"$f":"VLOOKUP(H14,ledger,24,0)","v":"A"},{"$f":"VLOOKUP(H14,ledger,25,0)","v":3.6},{"$f":"VLOOKUP(H14,ledger,28,0)","v":"A+"}]
[null,null,{"$f":"C25+1","v":1032},"ACCOUNTING (IN)",null,1.25,{"$f":"VLOOKUP(H14,ledger,26,0)","v":"A+"},{"$f":"VLOOKUP(H14,ledger,27,0)","v":4}]
[null,null,{"$f":"VLOOKUP(H14,ledger,29,0)","v":4251},"SINGING (TH)",null,3.75,{"$f":"VLOOKUP(H14,ledger,30,0)","v":"C"},{"$f":"VLOOKUP(H14,ledger,31,0)","v":2},{"$f":"VLOOKUP(H14,ledger,34,0)","v":"B"}]
[null,null,{"$f":"C27+1","v":4252},"SINGING (IN)",null,1.25,{"$f":"VLOOKUP(H14,ledger,32,0)","v":"A+"},{"$f":"VLOOKUP(H14,ledger,33,0)","v":4}]
[null,null,{"$f":"VLOOKUP(H14,ledger,35,0)","v":4171},{"$f":"IFERROR(VLOOKUP(C29,codesub,2,0),\"SUB.CODE IS WRONG\")","v":"FINANCE (TH)"},null,3.75,{"$f":"VLOOKUP(H14,ledger,36,0)","v":"B"},{"$f":"VLOOKUP(H14,ledger,37,0)","v":2.8},{"$f":"VLOOKUP(H14,ledger,40,0)","v":"B+"}]
[null,null,{"$f":"C29+1","v":4172},"FINANCE (IN)",null,1.25,{"$f":"VLOOKUP(H14,ledger,38,0)","v":"A"},{"$f":"VLOOKUP(H14,ledger,39,0)","v":3.6}]
[null,null,"GRADE POINT AVERAGE (GPA) :",null,null,null,null,null,{"$f":"VLOOKUP(H14,ledger,41,0)","v":2.8}]
[null,null,"EXTRA CREDIT SUBJECT"]
[null,null,{"$f":"IFERROR(VLOOKUP(H14,ledger,42,0),\"\")","v":0},{"$f":"IFERROR(VLOOKUP(C33,codesub,2,0),\"SUB.CODE IS WRONG\")","v":"SUB.CODE IS WRONG"},null,null,{"$f":"VLOOKUP(H14,ledger,43,0)","v":"ABS"},{"$f":"VLOOKUP(H14,ledger,44,0)","v":"ABS"},{"$f":"VLOOKUP(H14,ledger,47,0)","v":""}]
[null,null,{"$f":"IFERROR(C33+1,\"\")","v":1},{"$f":"IFERROR(VLOOKUP(C34,codesub,2,0),\"SUB.CODE IS WRONG\")","v":"SUB.CODE IS WRONG"},null,null,{"$f":"VLOOKUP(H14,ledger,45,0)","v":"ABS"},{"$f":"VLOOKUP(H14,ledger,46,0)","v":"ABS"}]
[null,null,"PREPARED BY : …………………………"]
[null,null,"CHECKED BY : …………………………"]
[null,null,"DATE OF ISSUE     :",null,"2079.03.15",null,null,"HEAD TEACHER"]
[]
[null,null,"NOTE : ONE CREDIT HOUR EQUALS TO 32 WORKING HOURS"]
[null,null,"INTERNAL (IN) : THIS COVERS THE PARTICIPATION, PRACTICAL/PROJECT WORKS, COMMUNITY \n                                     WORKS, INTERNSHIP, PRESENTATIONS, TERMINAL EXAMINATIONS."]
[null,null,"THEORY (TH) :  THIS COVERS WRITTEN EXTERNAL EXAMINATION"]
[null,null,"ABS = ABSENT",null,null,null,"       ","W= WITHHELD"]

{"sheet":"OUTPUT_1 (5)","index":34,"n_rows":42,"n_cols":10,"rows_kept":42,"cut":false,"hidden":false,"merged":[[41,2,41,3],[41,7,41,8],[35,2,35,4],[36,2,36,3],[36,7,36,9],[38,2,38,6],[39,2,39,9],[40,2,40,6],[30,2,30,7],[31,2,31,9],[32,3,32,4],[32,8,33,8],[33,3,33,4],[34,2,34,4],[26,3,26,4],[26,8,27,8],[27,3,27,4],[28,3,28,4],[28,8,29,8],[29,3,29,4],[22,3,22,4],[22,8,23,8],[23,3,23,4],[24,3,24,4],[24,8,25,8],[25,3,25,4],[18,3,18,4],[18,8,19,8],[19,3,19,4],[20,3,20,4],[20,8,21,8],[21,3,21,4],[14,2,14,4],[14,5,14,6],[14,7,14,9],[16,2,17,2],[16,3,17,4],[16,5,17,5],[16,6,17,6],[16,7,17,7],[16,8,17,8],[16,9,17,9],[2,2,6,9],[11,2,11,4],[11,5,11,9],[12,7,12,8],[13,2,13,3],[13,5,13,6]]}
[]
[]
[]
[]
[]
[]
[]
[]
[]
[]
[]
[null,null,"THE GRADE(S) SECURED BY   :",null,null,{"$f":"IFERROR(VLOOKUP(H14,ledger,2,0),\"This Symbol No. is not in Grade Ledger\")","v":"ALISHA KARKI "}]
[null,null,"DATE OF BIRTH :",null,{"$f":"VLOOKUP(H14,ledger,3,0)","v":"4/31/2063"},"B.S.","       (",null,null,"A.D.)"]
[null,null,"REGISTRATION NO.",null,{"$f":"VLOOKUP(H14,ledger,4,0)","v":"801130210001"},"SYMBOL NO.",null,11301320,"GRADE","XI"]
[null,null,"IN THE EXAMINATION CONDUCTED IN ",null,null,"2080 B.S. (2022 A.D.)",null,"ARE GIVEN BELOW."]
[]
[null,null,"SUBJECT CODE","SUBJECTS",null,"CREDIT HOUR (CH)","GRADE","GARDE POINT (GP)","FINAL GRADE (FG) ","REMARKS"]
[]
[null,null,{"$f":"VLOOKUP(H14,ledger,5,0)","v":"0011"},{"$f":"IFERROR(VLOOKUP(C19,codesub,2,0),\"SUB.CODE IS WRONG\")","v":"COM. NEPALI (TH)"},null,2.25,{"$f":"VLOOKUP(H14,ledger,6,0)","v":"C+"},{"$f":"VLOOKUP(H14,ledger,7,0)","v":2.4},{"$f":"VLOOKUP(H14,ledger,10,0)","v":"C+"}]
[null,null,{"$f":"IF(C19=\"0011\",\"0012\",\"SORRY\")","v":"0012"},{"$f":"IF(C20=\"0012\",\"COM. NEPALI (IN)\",\"SUB.CODE IS WRONG\")","v":"COM. NEPALI (IN)"},null,0.75,{"$f":"VLOOKUP(H14,ledger,8,0)","v":"C"},{"$f":"VLOOKUP(H14,ledger,9,0)","v":2}]
[null,null,{"$f":"VLOOKUP(H14,ledger,11,0)","v":"0031"},{"$f":"IFERROR(VLOOKUP(C21,codesub,2,0),\"SUB.CODE IS WRONG\")","v":"COM. ENGLISH (TH)"},null,3,{"$f":"VLOOKUP(H14,ledger,12,0)","v":"C+"},{"$f":"VLOOKUP(H14,ledger,13,0)","v":2.4},{"$f":"VLOOKUP(H14,ledger,16,0)","v":"C+"}]
[null,null,{"$f":"IF(C21=\"0031\",\"0032\",\"SORRY\")","v":"0032"},{"$f":"IF(C22=\"0032\",\"COM. ENGLISH (IN)\",\"SUB.CODE IS WRONG\")","v":"COM. ENGLISH (IN)"},null,1,{"$f":"VLOOKUP(H14,ledger,14,0)","v":"C"},{"$f":"VLOOKUP(H14,ledger,15,0)","v":2}]
[null,null,{"$f":"VLOOKUP(H14,ledger,17,0)","v":"0051"},{"$f":"IF(C23=\"0051\",\"COM. SOCIAL STUDIES & LIFE SKILL (TH)\",IF(C23=\"0071\",\"COM. MATHEMATICS (TH)\",\"SUB.CODE IS WRONG\"))","v":"COM. SOCIAL STUDIES & LIFE SKILL (TH)"},null,3.75,{"$f":"VLOOKUP(H14,ledger,18,0)","v":"C+"},{"$f":"VLOOKUP(H14,ledger,19,0)","v":2.4},{"$f":"VLOOKUP(H14,ledger,22,0)","v":"B"},{"$f":"IF(OR($I$19=\"NG\",$I$21=\"NG\",$I$23=\"NG\",$I$25=\"NG\",$I$27=\"NG\",$I$29=\"NG\"),\"W\",\"\")","v":""}]
[null,null,{"$f":"IF(C23=\"0051\",\"0052\",IF(C23=\"0071\",\"0072\",\"SORRY\"))","v":"0052"},{"$f":"IF(C24=\"0052\",\"COM. SOCIAL STUDIES & LIFE SKILL (IN)\",IF(C24=\"0072\",\"COM. MATHEMATICS (IN)\",\"SUB.CODE IS WRONG\"))","v":"COM. SOCIAL STUDIES & LIFE SKILL (IN)"},null,1.25,{"$f":"VLOOKUP(H14,ledger,20,0)","v":"A"},{"$f":"VLOOKUP(H14,ledger,21,0)","v":3.6},null,{"$f":"IF(OR($I$19=\"ABS\",$I$21=\"ABS\",$I$23=\"ABS\",$I$25=\"ABS\",$I$27=\"ABS\",$I$29=\"ABS\"),\"ABS\",\"\")","v":""}]
[null,null,{"$f":"VLOOKUP(H14,ledger,23,0)","v":1031},{"$f":"IFERROR(VLOOKUP(C25,codesub,2,0),\"SUB.CODE IS WRONG\")","v":"ACCOUNTING (TH)"},null,3.75,{"$f":"VLOOKUP(H14,ledger,24,0)","v":"A"},{"$f":"VLOOKUP(H14,ledger,25,0)","v":3.6},{"$f":"VLOOKUP(H14,ledger,28,0)","v":"A+"}]
[null,null,{"$f":"C25+1","v":1032},"ACCOUNTING (IN)",null,1.25,{"$f":"VLOOKUP(H14,ledger,26,0)","v":"A+"},{"$f":"VLOOKUP(H14,ledger,27,0)","v":4}]
[null,null,{"$f":"VLOOKUP(H14,ledger,29,0)","v":4251},"SINGING (TH)",null,3.75,{"$f":"VLOOKUP(H14,ledger,30,0)","v":"C"},{"$f":"VLOOKUP(H14,ledger,31,0)","v":2},{"$f":"VLOOKUP(H14,ledger,34,0)","v":"B"}]
[null,null,{"$f":"C27+1","v":4252},"SINGING (IN)",null,1.25,{"$f":"VLOOKUP(H14,ledger,32,0)","v":"A+"},{"$f":"VLOOKUP(H14,ledger,33,0)","v":4}]
[null,null,{"$f":"VLOOKUP(H14,ledger,35,0)","v":4171},{"$f":"IFERROR(VLOOKUP(C29,codesub,2,0),\"SUB.CODE IS WRONG\")","v":"FINANCE (TH)"},null,3.75,{"$f":"VLOOKUP(H14,ledger,36,0)","v":"B"},{"$f":"VLOOKUP(H14,ledger,37,0)","v":2.8},{"$f":"VLOOKUP(H14,ledger,40,0)","v":"B+"}]
[null,null,{"$f":"C29+1","v":4172},"FINANCE (IN)",null,1.25,{"$f":"VLOOKUP(H14,ledger,38,0)","v":"A"},{"$f":"VLOOKUP(H14,ledger,39,0)","v":3.6}]
[null,null,"GRADE POINT AVERAGE (GPA) :",null,null,null,null,null,{"$f":"VLOOKUP(H14,ledger,41,0)","v":2.8}]
[null,null,"EXTRA CREDIT SUBJECT"]
[null,null,{"$f":"IFERROR(VLOOKUP(H14,ledger,42,0),\"\")","v":0},{"$f":"IFERROR(VLOOKUP(C33,codesub,2,0),\"SUB.CODE IS WRONG\")","v":"SUB.CODE IS WRONG"},null,null,{"$f":"VLOOKUP(H14,ledger,43,0)","v":"ABS"},{"$f":"VLOOKUP(H14,ledger,44,0)","v":"ABS"},{"$f":"VLOOKUP(H14,ledger,47,0)","v":""}]
[null,null,{"$f":"IFERROR(C33+1,\"\")","v":1},{"$f":"IFERROR(VLOOKUP(C34,codesub,2,0),\"SUB.CODE IS WRONG\")","v":"SUB.CODE IS WRONG"},null,null,{"$f":"VLOOKUP(H14,ledger,45,0)","v":"ABS"},{"$f":"VLOOKUP(H14,ledger,46,0)","v":"ABS"}]
[null,null,"PREPARED BY : …………………………"]
[null,null,"CHECKED BY : …………………………"]
[null,null,"DATE OF ISSUE     :",null,"2079.03.15",null,null,"HEAD TEACHER"]
[]
[null,null,"NOTE : ONE CREDIT HOUR EQUALS TO 32 WORKING HOURS"]
[null,null,"INTERNAL (IN) : THIS COVERS THE PARTICIPATION, PRACTICAL/PROJECT WORKS, COMMUNITY \n                                     WORKS, INTERNSHIP, PRESENTATIONS, TERMINAL EXAMINATIONS."]
[null,null,"THEORY (TH) :  THIS COVERS WRITTEN EXTERNAL EXAMINATION"]
[null,null,"ABS = ABSENT",null,null,null,"       ","W= WITHHELD"]

{"sheet":"Subjects","index":35,"n_rows":268,"n_cols":5,"rows_kept":268,"cut":false,"hidden":true,"merged":[]}
[]
[null,"CODE","SUBJECT","CODE","SUBJECT"]
[null,"0011","COM. NEPALI (TH)","0012","COM. NEPALI (IN)"]
[null,"0031","COM. ENGLISH (TH)","0032","COM. ENGLISH (IN)"]
[null,"0051","COM. SOCIAL STUDIES AND LIFE SKILLS EDUCATION (TH)","0052","COM. SOCIAL STUDIES AND LIFE SKILLS EDUCATION (IN)"]
[null,"0071","COM. MATHEMATICS (TH)","0072","COM. MATHEMATICS (IN)"]
[null,1011,"PHYSICS (TH)",1012,"PHYSICS (IN)"]
[null,1031,"ACCOUNTING (TH)",1032,"ACCOUNTING (IN)"]
[null,1051,"RURAL DEVELOPMENT (TH)",1052,"RURAL DEVELOPMENT (IN)"]
[null,1071,"JURISPRUDENCE AND LEGAL THEORIES (TH)",1072,"JURISPRUDENCE AND LEGAL THEORIES (PR)"]
[null,1111,"PAINTING (TH)",1112,"PAINTING (IN)"]
[null,1151,"CHILD DEVELOPMENT AND LEARNING (TH)",1152,"CHILD DEVELOPMENT AND LEARNING (IN)"]
[null,1191,"PSYCHOLOGY (TH)",1192,"PSYCHOLOGY (IN)"]
[null,1211,"HISTORY (TH)",1212,"HISTORY (IN)"]
[null,1231,"GENDER STUDIES (TH)",1232,"GENDER STUDIES (IN)"]
[null,1251,"HOSPITALITY MANAGEMENT (TH)",1252,"HOSPITALITY MANAGEMENT (IN)"]
[null,1271,"AGRONOMY (TH)",1272,"AGRONOMY (IN)"]
[null,1291,"NATUROPATHY (TH)",1292,"NATUROPATHY (IN)"]
[null,1311,"HUMAN VALUE EDUCATION (TH)",1312,"HUMAN VALUE EDUCATION (IN)"]
[null,2011,"BIOLOGY (TH)",2012,"BIOLOGY (IN)"]
[null,2031,"EDUCATION AND DEVELOPMENT (TH)",2032,"EDUCATION AND DEVELOPMENT (IN)"]
[null,2051,"GEOGRAPHY (TH)",2052,"GEOGRAPHY (IN)"]
[null,2071,"PROCEDURAL LAW (TH)",2072,"PROCEDURAL LAW (IN)"]
[null,2111,"SOCIOLOGY (TH)",2112,"SOCIOLOGY (IN)"]
[null,2131,"AYURVED (TH)",2132,"AYURVED (IN)"]
[null,2151,"BUSINESS STUDIES (TH)",2152,"BUSINESS STUDIES (IN)"]
[null,2171,"LINGUISTICS (TH)",2172,"LINGUISTICS (IN)"]
[null,2191,"POLITICAL SCIENCE (TH)",2192,"POLITICAL SCIENCE (IN)"]
[null,2211,"PHILOSOPHY (TH)",2212,"PHILOSOPHY (IN)"]
[null,2231,"POPULATION STUDIES (TH)",2232,"POPULATION STUDIES (IN)"]
[null,2251,"HORTICULTURE (FRUITS, VEGETABLE, FLORICULTURE, AND MUSHROOM FARMING) (TH)",2252,"HORTICULTURE (FRUITS, VEGETABLE, FLORICULTURE, AND MUSHROOM FARMING) (IN)"]
[null,2271,"FOOD AND NUTRITION (TH)",2272,"FOOD AND NUTRITION (IN)"]
[null,2291,"DANCE (TH)",2292,"DANCE (IN)"]
[null,2311,"HISTORY OF ARTS (TH)",2312,"HISTORY OF ARTS (IN)"]
[null,2011,"BIOLOGY (TH)",2012,"BIOLOGY (IN)"]
[null,2031,"EDUCATION AND DEVELOPMENT (TH)",2032,"EDUCATION AND DEVELOPMENT (IN)"]
[null,2051,"GEOGRAPHY (TH)",2052,"GEOGRAPHY (IN)"]
[null,2071,"PROCEDURAL LAW (TH)",2072,"PROCEDURAL LAW (IN)"]
[null,2111,"SOCIOLOGY (TH)",2112,"SOCIOLOGY (IN)"]
[null,2131,"AYURVED (TH)",2132,"AYURVED (IN)"]
[null,2151,"BUSINESS STUDIES (TH)",2152,"BUSINESS STUDIES (IN)"]
[null,2171,"LINGUISTICS (TH)",2172,"LINGUISTICS (IN)"]
[null,2191,"POLITICAL SCIENCE (TH)",2192,"POLITICAL SCIENCE (IN)"]
[null,2211,"PHILOSOPHY (TH)",2212,"PHILOSOPHY (IN)"]
[null,2231,"POPULATION STUDIES (TH)",2232,"POPULATION STUDIES (IN)"]
[null,2251,"HORTICULTURE (FRUITS, VEGETABLE, FLORICULTURE, AND MUSHROOM FARMING) (TH)",2252,"HORTICULTURE (FRUITS, VEGETABLE, FLORICULTURE, AND MUSHROOM FARMING) (IN)"]
[null,2271,"FOOD AND NUTRITION (TH)",2272,"FOOD AND NUTRITION (IN)"]
[null,2291,"DANCE (TH)",2292,"DANCE (IN)"]
[null,2311,"HISTORY OF ARTS (TH)",2312,"HISTORY OF ARTS (IN)"]
[null,3011,"CHEMISTRY (TH)",3012,"CHEMISTRY (IN)"]
[null,3031,"ECONOMICS (TH)",3032,"ECONOMICS (IN)"]
[null,3051,"TOURISM AND MOUNTAINEERING STUDIES (TH)",3052,"TOURISM AND MOUNTAINEERING STUDIES (IN)"]
[null,3071,"MARKETING (TH)",3072,"MARKETING (IN)"]
[null,3091,"GERONTOLOGY AND CARETAKING EDUCATION (TH)",3092,"GERONTOLOGY AND CARETAKING EDUCATION (IN)"]
[null,3111,"YOG (TH)",3112,"YOG (IN)"]
[null,3131,"VOCAL / INSTRUMENTAL (TH)",3132,"VOCAL / INSTRUMENTAL (IN)"]
[null,3151,"SWEING AND KNITTING (TH)",3152,"SWEING AND KNITTING (IN)"]
[null,3171,"CONSTITUTION LAW (TH)",3172,"CONSTITUTION LAW (IN)"]
[null,3211,"CULINARY ARTS (TH)",3212,"CULINARY ARTS (IN)"]
[null,3231,"CULTURE (TH)",3232,"CULTURE (IN)"]
[null,3251,"FASHION DESIGNING (TH)",3252,"FASHION DESIGNING (IN)"]
[null,3271,"FILM AND DOCUMENTARY (TH)",3272,"FILM AND DOCUMENTARY (IN)"]
[null,3291,"ANIMAL HUSBANDRY, POULTRY, AND FISHERIES (TH)",3292,"ANIMAL HUSBANDRY, POULTRY, AND FISHERIES (IN)"]
[null,3311,"NEPALI (TH)",3312,"NEPALI (IN)"]
[null,3331,"ENGLISH (TH)",3332,"ENGLISH (IN)"]
[null,3351,"MAITHALI (TH)",3352,"MAITHALI (IN)"]
[null,3371,"NEWARI (TH)",3372,"NEWARI (IN)"]
[null,3391,"HINDI (TH)",3392,"HINDI (IN)"]
[null,3411,"CHINESE (TH)",3412,"CHINESE (IN)"]
[null,3431,"GERMAN (TH)",3432,"GERMAN (IN)"]
[null,3451,"JAPANESE (TH)",3452,"JAPANESE (IN)"]
[null,3471,"KOREAN (TH)",3472,"KOREAN (IN)"]
[null,3491,"URDU (TH)",3492,"URDU (IN)"]
[null,3511,"BHOJPURI (TH)",3512,"BHOJPURI (IN)"]
[null,3531,"FRENCH (TH)",3532,"FRENCH (IN)"]
[null,3551,"HEBREW (TH)",3552,"HEBREW (IN)"]
[null,3571,"ARABIC (TH)",3572,"ARABIC (IN)"]
[null,3591,"SANSKRIT (TH)",3592,"SANSKRIT (IN)"]
[null,3611,"APPLIED ARTS (TH)",3612,"APPLIED ARTS (IN)"]
[null,3011,"CHEMISTRY (TH)",3012,"CHEMISTRY (IN)"]
[null,3031,"ECONOMICS (TH)",3032,"ECONOMICS (IN)"]
[null,3051,"TOURISM AND MOUNTAINEERING STUDIES (TH)",3052,"TOURISM AND MOUNTAINEERING STUDIES (IN)"]
[null,3071,"MARKETING (TH)",3072,"MARKETING (IN)"]
[null,3091,"GERONTOLOGY AND CARETAKING EDUCATION (TH)",3092,"GERONTOLOGY AND CARETAKING EDUCATION (IN)"]
[null,3111,"YOG (TH)",3112,"YOG (IN)"]
[null,3131,"VOCAL / INSTRUMENTAL (TH)",3132,"VOCAL / INSTRUMENTAL (IN)"]
[null,3151,"SWEING AND KNITTING (TH)",3152,"SWEING AND KNITTING (IN)"]
[null,3171,"CONSTITUTION LAW (TH)",3172,"CONSTITUTION LAW (IN)"]
[null,3211,"CULINARY ARTS (TH)",3212,"CULINARY ARTS (IN)"]
[null,3231,"CULTURE (TH)",3232,"CULTURE (IN)"]
[null,3251,"FASHION DESIGNING (TH)",3252,"FASHION DESIGNING (IN)"]
[null,3271,"FILM AND DOCUMENTARY (TH)",3272,"FILM AND DOCUMENTARY (IN)"]
[null,3291,"ANIMAL HUSBANDRY, POULTRY, AND FISHERIES (TH)",3292,"ANIMAL HUSBANDRY, POULTRY, AND FISHERIES (IN)"]
[null,3311,"NEPALI (TH)",3312,"NEPALI (IN)"]
[null,3331,"ENGLISH (TH)",3332,"ENGLISH (IN)"]
[null,3351,"MAITHALI (TH)",3352,"MAITHALI (IN)"]
[null,3371,"NEWARI (TH)",3372,"NEWARI (IN)"]
[null,3391,"HINDI (TH)",3392,"HINDI (IN)"]
[null,3411,"CHINESE (TH)",3412,"CHINESE (IN)"]
[null,3431,"GERMAN (TH)",3432,"GERMAN (IN)"]
[null,3451,"JAPANESE (TH)",3452,"JAPANESE (IN)"]
[null,3471,"KOREAN (TH)",3472,"KOREAN (IN)"]
[null,3491,"URDU (TH)",3492,"URDU (PR)"]
[null,3511,"BHOJPURI (TH)",3512,"BHOJPURI (IN)"]
[null,3531,"FRENCH (TH)",3532,"FRENCH (IN)"]
[null,3551,"HEBREW (TH)",3552,"HEBREW (IN)"]
[null,3571,"ARABIC (TH)",3572,"ARABIC (IN)"]
[null,3591,"SANSKRIT (TH)",3592,"SANSKRIT (IN)"]
[null,3611,"APPLIED ARTS (TH)",3612,"APPLIED ARTS (IN)"]
[null,4011,"MATHEMATICS (TH)",4012,"MATHEMATICS (IN)"]
[null,4031,"APPLIED MATHEMATICS (TH)",4032,"APPLIED MATHEMATICS (IN)"]
[null,4051,"BUSINESS MATHEMATICS (TH)",4052,"BUSINESS MATHEMATICS (IN)"]
[null,4071,"HUMAN RIGHTS (TH)",4072,"HUMAN RIGHTS (IN)"]
[null,4091,"LIBRARY AND INFORMATION SCIENCE (TH)",4092,"LIBRARY AND INFORMATION SCIENCE (IN)"]
[null,4111,"HOME SCIENCE (TH)",4112,"HOME SCIENCE (IN)"]
[null,4131,"ENVRIONEMTN SCIENCE (TH)",4132,"ENVRIONEMTN SCIENCE (IN)"]
[null,4151,"GENERAL LAW (TH)",4152,"GENERAL LAW (IN)"]
[null,4171,"FINANCE (TH)",4172,"FINANCE (IN)"]
[null,4191,"CO-OPERATIVE MANAGEMENT (TH)",4192,"CO-OPERATIVE MANAGEMENT (IN)"]
[null,4211,"BUDDHIST STUDIES (TH)",4212,"BUDDHIST STUDIES (IN)"]
[null,4231,"SCULPTURE (TH)",4232,"SCULPTURE (IN)"]
[null,4251,"SINGING (TH)",4252,"SINGING (IN)"]
[null,4271,"COMPUTER SCIENCE (TH)",4272,"COMPUTER SCIENCE (IN)"]
[null,4291,"SERICULTURE AND BEE KEEPING (TH)",4292,"SERICULTURE AND BEE KEEPING (IN)"]
[null,4311,"BEAUTICIAN AND HAIR DRESSING (TH)",4312,"BEAUTICIAN AND HAIR DRESSING (IN)"]
[null,4331,"MEDICINAL HERBALS (TH)",4332,"MEDICINAL HERBALS (IN)"]
[null,4351,"PLUMBING AND WIRING (TH)",4352,"PLUMBING AND WIRING (IN)"]
[null,4371,"INTERNAL DECORATION (TH)",4372,"INTERNAL DECORATION (IN)"]
[null,4391,"HOTEL MANAGEMENT (TH)",4392,"HOTEL MANAGEMENT (IN)"]
[null,4411,"MASS COMMUNICATION (TH)",4412,"MASS COMMUNICATION (IN)"]
[null,4431,"HEALTH AND PHYSICAL EDUCATION (TH)",4432,"HEALTH AND PHYSICAL EDUCATION (IN)"]
[null,4451,"SPORT SCIENCE (TH)",4452,"SPORT SCIENCE (IN)"]
[null,4471,"SOCIAL STUDIES AND LIFE SKILLS EDUCATION (TH)",4472,"SOCIAL STUDIES AND LIFE SKILLS EDUCATION (IN)"]
[null,"0012","COM. NEPALI (IN)"]
[null,"0032","COM. ENGLISH (IN)"]
[null,"0052","COM. SOCIAL STUDIES AND LIFE SKILLS EDUCATION (IN)"]
[null,"0072","COM. MATHEMATICS (IN)"]
[null,1012,"PHYSICS (IN)"]
[null,1032,"ACCOUNTING (IN)"]
[null,1052,"RURAL DEVELOPMENT (IN)"]
[null,1072,"JURISPRUDENCE AND LEGAL THEORIES (PR)"]
[null,1112,"PAINTING (IN)"]
[null,1152,"CHILD DEVELOPMENT AND LEARNING (IN)"]
[null,1192,"PSYCHOLOGY (IN)"]
[null,1212,"HISTORY (IN)"]
[null,1232,"GENDER STUDIES (IN)"]
[null,1252,"HOSPITALITY MANAGEMENT (IN)"]
[null,1272,"AGRONOMY (IN)"]
[null,1292,"NATUROPATHY (IN)"]
[null,1312,"HUMAN VALUE EDUCATION (IN)"]
[null,2012,"BIOLOGY (IN)"]
[null,2032,"EDUCATION AND DEVELOPMENT (IN)"]
[null,2052,"GEOGRAPHY (IN)"]
[null,2072,"PROCEDURAL LAW (IN)"]
[null,2112,"SOCIOLOGY (IN)"]
[null,2132,"AYURVED (IN)"]
[null,2152,"BUSINESS STUDIES (IN)"]
[null,2172,"LINGUISTICS (IN)"]
[null,2192,"POLITICAL SCIENCE (IN)"]
[null,2212,"PHILOSOPHY (IN)"]
[null,2232,"POPULATION STUDIES (IN)"]
[null,2252,"HORTICULTURE (FRUITS, VEGETABLE, FLORICULTURE, AND MUSHROOM FARMING) (IN)"]
[null,2272,"FOOD AND NUTRITION (IN)"]
[null,2292,"DANCE (IN)"]
[null,2312,"HISTORY OF ARTS (IN)"]
[null,2012,"BIOLOGY (IN)"]
[null,2032,"EDUCATION AND DEVELOPMENT (IN)"]
[null,2052,"GEOGRAPHY (IN)"]
[null,2072,"PROCEDURAL LAW (IN)"]
[null,2112,"SOCIOLOGY (IN)"]
[null,2132,"AYURVED (IN)"]
[null,2152,"BUSINESS STUDIES (IN)"]
[null,2172,"LINGUISTICS (IN)"]
[null,2192,"POLITICAL SCIENCE (IN)"]
[null,2212,"PHILOSOPHY (IN)"]
[null,2232,"POPULATION STUDIES (IN)"]
[null,2252,"HORTICULTURE (FRUITS, VEGETABLE, FLORICULTURE, AND MUSHROOM FARMING) (IN)"]
[null,2272,"FOOD AND NUTRITION (IN)"]
[null,2292,"DANCE (IN)"]
[null,2312,"HISTORY OF ARTS (IN)"]
[null,3012,"CHEMISTRY (IN)"]
[null,3032,"ECONOMICS (IN)"]
[null,3052,"TOURISM AND MOUNTAINEERING STUDIES (IN)"]
[null,3072,"MARKETING (IN)"]
[null,3092,"GERONTOLOGY AND CARETAKING EDUCATION (IN)"]
[null,3112,"YOG (IN)"]
[null,3132,"VOCAL / INSTRUMENTAL (IN)"]
[null,3152,"SWEING AND KNITTING (IN)"]
[null,3172,"CONSTITUTION LAW (IN)"]
[null,3212,"CULINARY ARTS (IN)"]
[null,3232,"CULTURE (IN)"]
[null,3252,"FASHION DESIGNING (IN)"]
[null,3272,"FILM AND DOCUMENTARY (IN)"]
[null,3292,"ANIMAL HUSBANDRY, POULTRY, AND FISHERIES (IN)"]
[null,3312,"NEPALI (IN)"]
[null,3332,"ENGLISH (IN)"]
[null,3352,"MAITHALI (IN)"]
[null,3372,"NEWARI (IN)"]
[null,3392,"HINDI (IN)"]
[null,3412,"CHINESE (IN)"]
[null,3432,"GERMAN (IN)"]
[null,3452,"JAPANESE (IN)"]
[null,3472,"KOREAN (IN)"]
[null,3492,"URDU (IN)"]
[null,3512,"BHOJPURI (IN)"]
[null,3532,"FRENCH (IN)"]
[null,3552,"HEBREW (IN)"]
[null,3572,"ARABIC (IN)"]
[null,3592,"SANSKRIT (IN)"]
[null,3612,"APPLIED ARTS (IN)"]
[null,3012,"CHEMISTRY (IN)"]
[null,3032,"ECONOMICS (IN)"]
[null,3052,"TOURISM AND MOUNTAINEERING STUDIES (IN)"]
[null,3072,"MARKETING (IN)"]
[null,3092,"GERONTOLOGY AND CARETAKING EDUCATION (IN)"]
[null,3112,"YOG (IN)"]
[null,3132,"VOCAL / INSTRUMENTAL (IN)"]
[null,3152,"SWEING AND KNITTING (IN)"]
[null,3172,"CONSTITUTION LAW (IN)"]
[null,3212,"CULINARY ARTS (IN)"]
[null,3232,"CULTURE (IN)"]
[null,3252,"FASHION DESIGNING (IN)"]
[null,3272,"FILM AND DOCUMENTARY (IN)"]
[null,3292,"ANIMAL HUSBANDRY, POULTRY, AND FISHERIES (IN)"]
[null,3312,"NEPALI (IN)"]
[null,3332,"ENGLISH (IN)"]
[null,3352,"MAITHALI (IN)"]
[null,3372,"NEWARI (IN)"]
[null,3392,"HINDI (IN)"]
[null,3412,"CHINESE (IN)"]
[null,3432,"GERMAN (IN)"]
[null,3452,"JAPANESE (IN)"]
[null,3472,"KOREAN (IN)"]
[null,3492,"URDU (PR)"]
[null,3512,"BHOJPURI (IN)"]
[null,3532,"FRENCH (IN)"]
[null,3552,"HEBREW (IN)"]
[null,3572,"ARABIC (IN)"]
[null,3592,"SANSKRIT (IN)"]
[null,3612,"APPLIED ARTS (IN)"]
[null,4012,"MATHEMATICS (IN)"]
[null,4032,"APPLIED MATHEMATICS (IN)"]
[null,4052,"BUSINESS MATHEMATICS (IN)"]
[null,4072,"HUMAN RIGHTS (IN)"]
[null,4092,"LIBRARY AND INFORMATION SCIENCE (IN)"]
[null,4112,"HOME SCIENCE (IN)"]
[null,4132,"ENVRIONEMTN SCIENCE (IN)"]
[null,4152,"GENERAL LAW (IN)"]
[null,4172,"FINANCE (IN)"]
[null,4192,"CO-OPERATIVE MANAGEMENT (IN)"]
[null,4212,"BUDDHIST STUDIES (IN)"]
[null,4232,"SCULPTURE (IN)"]
[null,4252,"SINGING (IN)"]
[null,4272,"COMPUTER SCIENCE (IN)"]
[null,4292,"SERICULTURE AND BEE KEEPING (IN)"]
[null,4312,"BEAUTICIAN AND HAIR DRESSING (IN)"]
[null,4332,"MEDICINAL HERBALS (IN)"]
[null,4352,"PLUMBING AND WIRING (IN)"]
[null,4372,"INTERNAL DECORATION (IN)"]
[null,4392,"HOTEL MANAGEMENT (IN)"]
[null,4412,"MASS COMMUNICATION (IN)"]
[null,4432,"HEALTH AND PHYSICAL EDUCATION (IN)"]
[null,4452,"SPORT SCIENCE (IN)"]
[null,4472,"SOCIAL STUDIES AND LIFE SKILLS EDUCATION (IN)"]
[null,12,"COM. NEPALI (IN)"]
[null,32,"COM. ENGLISH (IN)"]
[null,52,"COM. SOCIAL STUDIES AND LIFE SKILLS EDUCATION (IN)"]
[null,72,"COM. MATHEMATICS (IN)"]